{"text_format":"1","workbook":"xlsx","n_sheets":8,"sheets":["Information","Data","Jenks iteration table","PivotSheet","Jenks","Std. Dev","Quantiles","Equal Interval"],"not_rendered":{"charts":4,"images":1,"macros":1,"external_links":0,"defined_names":33,"comments":0,"pivot_tables":1},"unopened":[],"bounds":{"document_bytes":16777216,"sheet_cells":100000,"rows_first":2000,"rows_last":500,"rows_between":2000,"halvings":0,"cell_chars":16384,"cell_head_chars":4096},"cells_cut":0,"cells_raw":0,"read":"whole","date_system":"1900"}

{"sheet":"Information","index":0,"n_rows":28,"n_cols":22,"rows_kept":28,"cut":false,"hidden":false,"merged":[[3,2,4,2],[5,3,6,3],[5,4,6,4],[5,2,6,2],[3,13,4,13],[5,13,6,13],[5,20,6,20],[5,21,6,21],[3,14,3,15],[3,16,3,17],[3,18,3,19],[5,18,6,18],[5,19,6,19],[7,3,8,3],[7,4,8,4],[9,3,10,3],[11,3,12,3],[13,3,14,3],[9,4,10,4],[11,4,12,4],[13,4,14,4],[3,20,3,21],[3,3,3,4],[3,5,3,6],[3,7,3,8],[3,9,3,10],[7,7,8,7],[7,8,8,8],[9,7,10,7],[5,5,6,5],[5,6,6,6],[7,5,8,5],[7,6,8,6],[9,5,10,5],[9,6,10,6],[7,21,8,21],[9,13,10,13],[7,2,8,2],[9,2,10,2],[11,2,12,2],[5,14,6,14],[5,15,6,15],[5,16,6,16],[5,17,6,17],[11,13,12,13],[11,7,12,7],[11,8,12,8],[5,9,6,9],[5,10,6,10],[7,9,8,9],[7,10,8,10],[9,9,10,9],[9,10,10,10],[7,13,8,13],[9,8,10,8],[11,9,12,9],[11,10,12,10],[11,5,12,5],[11,6,12,6],[5,7,6,7],[5,8,6,8],[9,14,10,14],[9,15,10,15],[9,16,10,16],[9,17,10,17],[9,18,10,18],[9,19,10,19],[9,20,10,20],[9,21,10,21],[7,14,8,14],[7,15,8,15],[7,16,8,16],[7,17,8,17],[7,18,8,18],[7,19,8,19],[7,20,8,20],[11,20,12,20],[11,21,12,21],[13,13,14,13],[13,14,14,14],[13,15,14,15],[13,16,14,16],[13,17,14,17],[13,18,14,18],[13,19,14,19],[13,20,14,20],[11,14,12,14],[11,15,12,15],[11,16,12,16],[11,17,12,17],[11,18,12,18],[11,19,12,19],[19,2,20,2],[19,3,20,3],[19,4,20,4],[19,5,20,5],[19,6,20,6],[19,7,20,7],[21,10,22,10],[13,21,14,21],[17,2,18,2],[17,3,17,4],[17,5,17,6],[17,7,17,8],[17,9,17,10],[13,7,14,7],[13,8,14,8],[13,9,14,9],[13,10,14,10],[13,5,14,5],[13,6,14,6],[13,2,14,2],[23,2,24,2],[23,3,24,3],[23,4,24,4],[23,5,24,5],[23,6,24,6],[23,7,24,7],[23,8,24,8],[23,9,24,9],[1,1,1,22],[2,2,2,10],[2,13,2,21],[16,2,16,10],[23,10,24,10],[21,9,22,9],[19,8,20,8],[19,9,20,9],[19,10,20,10],[21,2,22,2],[21,3,22,3],[21,4,22,4],[21,5,22,5],[21,6,22,6],[21,7,22,7],[21,8,22,8],[27,8,28,8],[27,9,28,9],[27,10,28,10],[27,2,28,2],[27,3,28,3],[27,4,28,4],[27,5,28,5],[27,6,28,6],[27,7,28,7],[25,2,26,2],[25,3,26,3],[25,4,26,4],[25,5,26,5],[25,6,26,6],[25,7,26,7],[25,8,26,8],[25,9,26,9],[25,10,26,10]]}
[]
[null,"Grouping Calculation Information"]
[null,null,"Standard Deviation",null,null,null,null,null,null,null,null,null,null,"Quantiles"]
[null,null,"Level of Intensity",2,null,3,null,4,null,5,null,null,null,"Level of Intensity",2,null,3,null,4,null,5]
[null,null,null,"Min","Max","Min","Max","Min","Max","Min","Max",null,null,null,"Min","Max","Min","Max","Min","Max","Min","Max"]
[null,null,"A Size","Min","Mean","Min","Mean - 1SD","Min","Mean - 1SD","Min","Mean - 1SD",null,null,"A Size","Min","Median","Min","33rd Percentile","Min","25th Percentile","Min","20th Percentile"]
[]
[null,null,"B Size","Mean + 1","Max","Mean - 1SD + 1","Mean + 1SD","Mean - 1SD + 1","Mean","Mean - 1SD + 1","Mean - 0.5*SD",null,null,"B Size","Median + 1","Max","33rd Percentile + 1","66th Percentile","25th Percentile + 1","Median","20th Percentile + 1","40th Percentile"]
[]
[null,null,"C Size",null,null,"Mean + 1SD + 1","Max","Mean + 1","Mean + 1SD","Mean - 0.5*SD + 1","Mean + 0.5*SD",null,null,"C Size",null,null,"66th Percentile + 1","Max","Median + 1","75th Percentile","40th Percentile + 1","60th Percentile"]
[]
[null,null,"D Size",null,null,null,null,"Mean + 1SD + 1","Max","Mean + 0.5*SD + 1","Mean + 1SD",null,null,"D Size",null,null,null,null,"75th Percentile + 1","Max","60th Percentile + 1","80th Percentile"]
[]
[null,null,"E Size",null,null,null,null,null,null,"Mean + 1SD + 1","Max",null,null,"E Size",null,null,null,null,null,null,"80th Percentile + 1","Max"]
[]
[]
[null,null,"Equal Interval"]
[null,null,"Level of Intensity",2,null,3,null,4,null,5]
[null,null,null,"Min","Max","Min","Max","Min","Max","Min","Max"]
[null,null,"A Size","Min","Min + (max - min)/2","Min","Min + (Max - Min)/3","Min","Min + (Max - Min)/4","Min","Min + (Max - Min)/5"]
[]
[null,null,"B Size","Min + (max - min)/2 + 1","Max","Min + (Max - Min)/3 + 1","Min + 2*(max - min)/3","Min + (Max - Min)/4 + 1","Min + (Max - Min)/2","Min + (Max - Min)/5 + 1","Min + 2*(Max - Min)/5"]
[]
[null,null,"C Size",null,null,"Min + 2*(Max - Min)/3 + 1","Max","Min + (Max - Min)/2 + 1","Min + 3*(Max - Min)/4","Min + 2*(Max - Min)/5 + 1","Min + 3*(Max - Min)/5"]
[]
[null,null,"D Size",null,null,null,null,"Min + 3*(Max - Min)/4 + 1","Max","Min + 3*(Max - Min)/5 + 1","Min + 4*(Max - Min)/5"]
[]
[null,null,"E Size",null,null,null,null,null,null,"Min + 4*(Max - Min)/5 + 1","Max"]

{"sheet":"Data","index":1,"n_rows":20018,"n_cols":33,"rows_kept":20018,"cut":false,"hidden":false,"merged":[[29,30,29,32],[30,30,30,32],[1,7,1,26]]}
[]
[null,"Datapoint Index","Data",null,"Levels of Intensity",3,null,"Enter the data you want to group in column C under the shaded area, then select the number of groups you would like to assign in cell 'F2' ('Levels of intensity'). "]
[null,{"$f":"IF(C3=\"\",\"\",B2+1)","v":{"$error":"#VALUE!"}},3]
[null,{"$f":"IF(#REF!=\"\",\"\",B3+1)","v":{"$error":"#REF!"}},411]
[null,{"$f":"IF(C5=\"\",\"\",B4+1)","v":{"$error":"#REF!"}},4]
[null,{"$error":"#REF!"},2]
[null,{"$error":"#REF!"},339,null,null,null,null,null,null,null,null,null,null,"Group","Min Value","Max Value",null,null,null,null,null,null,null,null,null,null,null,null,null,null,"Group","Min Value","Max Value"]
[null,{"$error":"#REF!"},45,null,null,null,null,null,null,null,null,null,null,"a",{"$f":"IFERROR(INDEX('Std. Dev'!$K$4:$L$26,MATCH(1,(Data!$F$2='Std. Dev'!$M$4:$M$26)*(Data!$N8='Std. Dev'!$N$4:$N$26),0),MATCH(Data!O$7,'Std. Dev'!$K$3:$L$3,0)),\"\")","v":2},{"$f":"IFERROR(INDEX('Std. Dev'!$K$4:$L$26,MATCH(1,(Data!$F$2='Std. Dev'!$M$4:$M$26)*(Data!$N8='Std. Dev'!$N$4:$N$26),0),MATCH(Data!P$7,'Std. Dev'!$K$3:$L$3,0)),\"\")","v":101.81618586118071},null,null,null,null,null,null,null,null,null,null,null,null,null,null,"a",{"$f":"IFERROR(INDEX(Quantiles!$K$4:$L$26,MATCH(1,(Data!$F$2=Quantiles!$M$4:$M$26)*(Data!$AE8=Quantiles!$N$4:$N$26),0),MATCH(Data!AF$7,Quantiles!$K$3:$L$3,0)),\"\")","v":2},{"$f":"IFERROR(INDEX(Quantiles!$K$4:$L$26,MATCH(1,(Data!$F$2=Quantiles!$M$4:$M$26)*(Data!$AE8=Quantiles!$N$4:$N$26),0),MATCH(Data!AG$7,Quantiles!$K$3:$L$3,0)),\"\")","v":158.18}]
[null,{"$error":"#REF!"},310,null,null,null,null,null,null,null,null,null,null,"b",{"$f":"IFERROR(INDEX('Std. Dev'!$K$4:$L$26,MATCH(1,(Data!$F$2='Std. Dev'!$M$4:$M$26)*(Data!$N9='Std. Dev'!$N$4:$N$26),0),MATCH(Data!O$7,'Std. Dev'!$K$3:$L$3,0)),\"\")","v":102.81618586118071},{"$f":"IFERROR(INDEX('Std. Dev'!$K$4:$L$26,MATCH(1,(Data!$F$2='Std. Dev'!$M$4:$M$26)*(Data!$N9='Std. Dev'!$N$4:$N$26),0),MATCH(Data!P$7,'Std. Dev'!$K$3:$L$3,0)),\"\")","v":381.90139338953975},null,null,null,null,null,null,null,null,null,null,null,null,null,null,"b",{"$f":"IFERROR(INDEX(Quantiles!$K$4:$L$26,MATCH(1,(Data!$F$2=Quantiles!$M$4:$M$26)*(Data!$AE9=Quantiles!$N$4:$N$26),0),MATCH(Data!AF$7,Quantiles!$K$3:$L$3,0)),\"\")","v":159.18},{"$f":"IFERROR(INDEX(Quantiles!$K$4:$L$26,MATCH(1,(Data!$F$2=Quantiles!$M$4:$M$26)*(Data!$AE9=Quantiles!$N$4:$N$26),0),MATCH(Data!AG$7,Quantiles!$K$3:$L$3,0)),\"\")","v":319.72000000000003}]
[null,{"$error":"#REF!"},55,null,null,null,null,null,null,null,null,null,null,"c",{"$f":"IFERROR(INDEX('Std. Dev'!$K$4:$L$26,MATCH(1,(Data!$F$2='Std. Dev'!$M$4:$M$26)*(Data!$N10='Std. Dev'!$N$4:$N$26),0),MATCH(Data!O$7,'Std. Dev'!$K$3:$L$3,0)),\"\")","v":382.90139338953975},{"$f":"IFERROR(INDEX('Std. Dev'!$K$4:$L$26,MATCH(1,(Data!$F$2='Std. Dev'!$M$4:$M$26)*(Data!$N10='Std. Dev'!$N$4:$N$26),0),MATCH(Data!P$7,'Std. Dev'!$K$3:$L$3,0)),\"\")","v":498},null,null,null,null,null,null,null,null,null,null,null,null,null,null,"c",{"$f":"IFERROR(INDEX(Quantiles!$K$4:$L$26,MATCH(1,(Data!$F$2=Quantiles!$M$4:$M$26)*(Data!$AE10=Quantiles!$N$4:$N$26),0),MATCH(Data!AF$7,Quantiles!$K$3:$L$3,0)),\"\")","v":320.72000000000003},{"$f":"IFERROR(INDEX(Quantiles!$K$4:$L$26,MATCH(1,(Data!$F$2=Quantiles!$M$4:$M$26)*(Data!$AE10=Quantiles!$N$4:$N$26),0),MATCH(Data!AG$7,Quantiles!$K$3:$L$3,0)),\"\")","v":498}]
[null,{"$error":"#REF!"},14,null,null,null,null,null,null,null,null,null,null,"d",{"$f":"IFERROR(INDEX('Std. Dev'!$K$4:$L$26,MATCH(1,(Data!$F$2='Std. Dev'!$M$4:$M$26)*(Data!$N11='Std. Dev'!$N$4:$N$26),0),MATCH(Data!O$7,'Std. Dev'!$K$3:$L$3,0)),\"\")","v":""},{"$f":"IFERROR(INDEX('Std. Dev'!$K$4:$L$26,MATCH(1,(Data!$F$2='Std. Dev'!$M$4:$M$26)*(Data!$N11='Std. Dev'!$N$4:$N$26),0),MATCH(Data!P$7,'Std. Dev'!$K$3:$L$3,0)),\"\")","v":""},null,null,null,null,null,null,null,null,null,null,null,null,null,null,"d",{"$f":"IFERROR(INDEX(Quantiles!$K$4:$L$26,MATCH(1,(Data!$F$2=Quantiles!$M$4:$M$26)*(Data!$AE11=Quantiles!$N$4:$N$26),0),MATCH(Data!AF$7,Quantiles!$K$3:$L$3,0)),\"\")","v":""},{"$f":"IFERROR(INDEX(Quantiles!$K$4:$L$26,MATCH(1,(Data!$F$2=Quantiles!$M$4:$M$26)*(Data!$AE11=Quantiles!$N$4:$N$26),0),MATCH(Data!AG$7,Quantiles!$K$3:$L$3,0)),\"\")","v":""}]
[null,{"$error":"#REF!"},441,null,null,null,null,null,null,null,null,null,null,"e",{"$f":"IFERROR(INDEX('Std. Dev'!$K$4:$L$26,MATCH(1,(Data!$F$2='Std. Dev'!$M$4:$M$26)*(Data!$N12='Std. Dev'!$N$4:$N$26),0),MATCH(Data!O$7,'Std. Dev'!$K$3:$L$3,0)),\"\")","v":""},{"$f":"IFERROR(INDEX('Std. Dev'!$K$4:$L$26,MATCH(1,(Data!$F$2='Std. Dev'!$M$4:$M$26)*(Data!$N12='Std. Dev'!$N$4:$N$26),0),MATCH(Data!P$7,'Std. Dev'!$K$3:$L$3,0)),\"\")","v":""},null,null,null,null,null,null,null,null,null,null,null,null,null,null,"e",{"$f":"IFERROR(INDEX(Quantiles!$K$4:$L$26,MATCH(1,(Data!$F$2=Quantiles!$M$4:$M$26)*(Data!$AE12=Quantiles!$N$4:$N$26),0),MATCH(Data!AF$7,Quantiles!$K$3:$L$3,0)),\"\")","v":""},{"$f":"IFERROR(INDEX(Quantiles!$K$4:$L$26,MATCH(1,(Data!$F$2=Quantiles!$M$4:$M$26)*(Data!$AE12=Quantiles!$N$4:$N$26),0),MATCH(Data!AG$7,Quantiles!$K$3:$L$3,0)),\"\")","v":""}]
[null,{"$error":"#REF!"},54]
[null,{"$error":"#REF!"},490]
[null,{"$error":"#REF!"},416]
[null,{"$error":"#REF!"},297]
[null,{"$error":"#REF!"},29]
[null,{"$error":"#REF!"},102]
[null,{"$error":"#REF!"},395]
[null,{"$error":"#REF!"},30]
[null,{"$error":"#REF!"},256]
[null,{"$error":"#REF!"},167]
[null,{"$error":"#REF!"},104,null,null,null,null,null,null,null,null,null,null,"Group","Min Value","Max Value",null,null,null,null,null,null,null,null,null,null,null,null,null,null,"Group","Min Value","Max Value"]
[null,{"$error":"#REF!"},15,null,null,null,null,null,null,null,null,null,null,"a",{"$f":"IFERROR(INDEX('Equal Interval'!$K$4:$L$26,MATCH(1,(Data!$F$2='Equal Interval'!$M$4:$M$26)*(Data!$N24='Equal Interval'!$N$4:$N$26),0),MATCH(Data!O$23,'Equal Interval'!$K$3:$L$3,0)),\"\")","v":2},{"$f":"IFERROR(INDEX('Equal Interval'!$K$4:$L$26,MATCH(1,(Data!$F$2='Equal Interval'!$M$4:$M$26)*(Data!$N24='Equal Interval'!$N$4:$N$26),0),MATCH(Data!P$23,'Equal Interval'!$K$3:$L$3,0)),\"\")","v":167.33333333333334},null,null,null,null,null,null,null,null,null,null,null,null,null,null,"a",{"$f":"IFERROR(INDEX(Jenks!$K$4:$L$26,MATCH(1,(Data!$F$2=Jenks!$M$4:$M$26)*(Data!$AE24=Jenks!$N$4:$N$26),0),MATCH(Data!AF$7,Jenks!$K$3:$L$3,0)),\"\")","v":2},{"$f":"IFERROR(INDEX(Jenks!$K$4:$L$26,MATCH(1,(Data!$F$2=Jenks!$M$4:$M$26)*(Data!$AE24=Jenks!$N$4:$N$26),0),MATCH(Data!AG$7,Jenks!$K$3:$L$3,0)),\"\")","v":161}]
[null,{"$error":"#REF!"},347,null,null,null,null,null,null,null,null,null,null,"b",{"$f":"IFERROR(INDEX('Equal Interval'!$K$4:$L$26,MATCH(1,(Data!$F$2='Equal Interval'!$M$4:$M$26)*(Data!$N25='Equal Interval'!$N$4:$N$26),0),MATCH(Data!O$23,'Equal Interval'!$K$3:$L$3,0)),\"\")","v":168.33333333333334},{"$f":"IFERROR(INDEX('Equal Interval'!$K$4:$L$26,MATCH(1,(Data!$F$2='Equal Interval'!$M$4:$M$26)*(Data!$N25='Equal Interval'!$N$4:$N$26),0),MATCH(Data!P$23,'Equal Interval'!$K$3:$L$3,0)),\"\")","v":332.66666666666669},null,null,null,null,null,null,null,null,null,null,null,null,null,null,"b",{"$f":"IFERROR(INDEX(Jenks!$K$4:$L$26,MATCH(1,(Data!$F$2=Jenks!$M$4:$M$26)*(Data!$AE25=Jenks!$N$4:$N$26),0),MATCH(Data!AF$7,Jenks!$K$3:$L$3,0)),\"\")","v":165},{"$f":"IFERROR(INDEX(Jenks!$K$4:$L$26,MATCH(1,(Data!$F$2=Jenks!$M$4:$M$26)*(Data!$AE25=Jenks!$N$4:$N$26),0),MATCH(Data!AG$7,Jenks!$K$3:$L$3,0)),\"\")","v":321}]
[null,{"$error":"#REF!"},353,null,null,null,null,null,null,null,null,null,null,"c",{"$f":"IFERROR(INDEX('Equal Interval'!$K$4:$L$26,MATCH(1,(Data!$F$2='Equal Interval'!$M$4:$M$26)*(Data!$N26='Equal Interval'!$N$4:$N$26),0),MATCH(Data!O$23,'Equal Interval'!$K$3:$L$3,0)),\"\")","v":333.66666666666669},{"$f":"IFERROR(INDEX('Equal Interval'!$K$4:$L$26,MATCH(1,(Data!$F$2='Equal Interval'!$M$4:$M$26)*(Data!$N26='Equal Interval'!$N$4:$N$26),0),MATCH(Data!P$23,'Equal Interval'!$K$3:$L$3,0)),\"\")","v":498},null,null,null,null,null,null,null,null,null,null,null,null,null,null,"c",{"$f":"IFERROR(INDEX(Jenks!$K$4:$L$26,MATCH(1,(Data!$F$2=Jenks!$M$4:$M$26)*(Data!$AE26=Jenks!$N$4:$N$26),0),MATCH(Data!AF$7,Jenks!$K$3:$L$3,0)),\"\")","v":324},{"$f":"IFERROR(INDEX(Jenks!$K$4:$L$26,MATCH(1,(Data!$F$2=Jenks!$M$4:$M$26)*(Data!$AE26=Jenks!$N$4:$N$26),0),MATCH(Data!AG$7,Jenks!$K$3:$L$3,0)),\"\")","v":498}]
[null,{"$error":"#REF!"},382,null,null,null,null,null,null,null,null,null,null,"d",{"$f":"IFERROR(INDEX('Equal Interval'!$K$4:$L$26,MATCH(1,(Data!$F$2='Equal Interval'!$M$4:$M$26)*(Data!$N27='Equal Interval'!$N$4:$N$26),0),MATCH(Data!O$23,'Equal Interval'!$K$3:$L$3,0)),\"\")","v":""},{"$f":"IFERROR(INDEX('Equal Interval'!$K$4:$L$26,MATCH(1,(Data!$F$2='Equal Interval'!$M$4:$M$26)*(Data!$N27='Equal Interval'!$N$4:$N$26),0),MATCH(Data!P$23,'Equal Interval'!$K$3:$L$3,0)),\"\")","v":""},null,null,null,null,null,null,null,null,null,null,null,null,null,null,"d",{"$f":"IFERROR(INDEX(Jenks!$K$4:$L$26,MATCH(1,(Data!$F$2=Jenks!$M$4:$M$26)*(Data!$AE27=Jenks!$N$4:$N$26),0),MATCH(Data!AF$7,Jenks!$K$3:$L$3,0)),\"\")","v":""},{"$f":"IFERROR(INDEX(Jenks!$K$4:$L$26,MATCH(1,(Data!$F$2=Jenks!$M$4:$M$26)*(Data!$AE27=Jenks!$N$4:$N$26),0),MATCH(Data!AG$7,Jenks!$K$3:$L$3,0)),\"\")","v":""}]
[null,{"$error":"#REF!"},168,null,null,null,null,null,null,null,null,null,null,"e",{"$f":"IFERROR(INDEX('Equal Interval'!$K$4:$L$26,MATCH(1,(Data!$F$2='Equal Interval'!$M$4:$M$26)*(Data!$N28='Equal Interval'!$N$4:$N$26),0),MATCH(Data!O$23,'Equal Interval'!$K$3:$L$3,0)),\"\")","v":""},{"$f":"IFERROR(INDEX('Equal Interval'!$K$4:$L$26,MATCH(1,(Data!$F$2='Equal Interval'!$M$4:$M$26)*(Data!$N28='Equal Interval'!$N$4:$N$26),0),MATCH(Data!P$23,'Equal Interval'!$K$3:$L$3,0)),\"\")","v":""},null,null,null,null,null,null,null,null,null,null,null,null,null,null,"e",{"$f":"IFERROR(INDEX(Jenks!$K$4:$L$26,MATCH(1,(Data!$F$2=Jenks!$M$4:$M$26)*(Data!$AE28=Jenks!$N$4:$N$26),0),MATCH(Data!AF$7,Jenks!$K$3:$L$3,0)),\"\")","v":""},{"$f":"IFERROR(INDEX(Jenks!$K$4:$L$26,MATCH(1,(Data!$F$2=Jenks!$M$4:$M$26)*(Data!$AE28=Jenks!$N$4:$N$26),0),MATCH(Data!AG$7,Jenks!$K$3:$L$3,0)),\"\")","v":""}]
[null,{"$error":"#REF!"},170]
[null,{"$error":"#REF!"},129,null,null,null,null,null,null,null,null,null,null,null,null,null,null,null,null,null,null,null,null,null,null,null,null,null,null,null,"Estimated run time"]
[null,{"$error":"#REF!"},329,null,null,null,null,null,null,null,null,null,null,null,null,null,null,null,null,null,null,null,null,null,null,null,null,null,null,null,{"$f":"ROUNDUP((INDEX('Jenks iteration table'!$B$2:$F$839,MATCH(Freq_Data_Count,'Jenks iteration table'!$A$2:$A$839,0),MATCH(Data!$F$2,'Jenks iteration table'!$B$1:$F$1,0))*0.00021967906432393)/60,2)&\" minutes\"","v":"0.12 minutes"}]
[null,{"$error":"#REF!"},405]
[null,{"$error":"#REF!"},362,null,null,null,null,null,null,null,null,null,null,null,null,null,null,null,null,null,null,null,null,null,null,null,null,null,null,null,null,"Refresh"]
[null,{"$error":"#REF!"},156]
[null,{"$error":"#REF!"},39]
[null,{"$error":"#REF!"},399]
[null,{"$f":"IF(C37=\"\",\"\",B36+1)","v":{"$error":"#REF!"}},275]
[null,{"$error":"#REF!"},378]
[null,{"$error":"#REF!"},469]
[null,{"$error":"#REF!"},179]
[null,{"$error":"#REF!"},78]
[null,{"$error":"#REF!"},375]
[null,{"$error":"#REF!"},286]
[null,{"$error":"#REF!"},29]
[null,{"$error":"#REF!"},392]
[null,{"$error":"#REF!"},99]
[null,{"$error":"#REF!"},294]
[null,{"$error":"#REF!"},123]
[null,{"$error":"#REF!"},61]
[null,{"$error":"#REF!"},110]
[null,{"$error":"#REF!"},238]
[null,{"$error":"#REF!"},154]
[null,{"$error":"#REF!"},100]
[null,{"$error":"#REF!"},389]
[null,{"$error":"#REF!"},62]
[null,{"$error":"#REF!"},292]
[null,{"$error":"#REF!"},39]
[null,{"$error":"#REF!"},6]
[null,{"$error":"#REF!"},277]
[null,{"$error":"#REF!"},269]
[null,{"$error":"#REF!"},350]
[null,{"$error":"#REF!"},203]
[null,{"$error":"#REF!"},165]
[null,{"$error":"#REF!"},391]
[null,{"$error":"#REF!"},166]
[null,{"$error":"#REF!"},459]
[null,{"$error":"#REF!"},489]
[null,{"$error":"#REF!"},141]
[null,{"$f":"IF(C69=\"\",\"\",B68+1)","v":{"$error":"#REF!"}},218]
[null,{"$error":"#REF!"},258]
[null,{"$error":"#REF!"},89]
[null,{"$error":"#REF!"},169]
[null,{"$error":"#REF!"},63]
[null,{"$error":"#REF!"},204]
[null,{"$error":"#REF!"},171]
[null,{"$error":"#REF!"},50]
[null,{"$error":"#REF!"},45]
[null,{"$error":"#REF!"},295]
[null,{"$error":"#REF!"},25]
[null,{"$error":"#REF!"},303]
[null,{"$error":"#REF!"},326]
[null,{"$error":"#REF!"},498]
[null,{"$error":"#REF!"},313]
[null,{"$error":"#REF!"},406]
[null,{"$error":"#REF!"},488]
[null,{"$error":"#REF!"},380]
[null,{"$error":"#REF!"},123]
[null,{"$error":"#REF!"},53]
[null,{"$error":"#REF!"},252]
[null,{"$error":"#REF!"},365]
[null,{"$error":"#REF!"},488]
[null,{"$error":"#REF!"},305]
[null,{"$error":"#REF!"},475]
[null,{"$error":"#REF!"},208]
[null,{"$error":"#REF!"},241]
[null,{"$error":"#REF!"},140]
[null,{"$error":"#REF!"},335]
[null,{"$error":"#REF!"},156]
[null,{"$error":"#REF!"},178]
[null,{"$error":"#REF!"},376]
[null,{"$f":"IF(C101=\"\",\"\",B100+1)","v":{"$error":"#REF!"}},87]
[null,{"$error":"#REF!"},141]
[null,{"$error":"#REF!"},423]
[null,{"$error":"#REF!"},329]
[null,{"$error":"#REF!"},264]
[null,{"$error":"#REF!"},29]
[null,{"$error":"#REF!"},330]
[null,{"$error":"#REF!"},161]
[null,{"$error":"#REF!"},337]
[null,{"$error":"#REF!"},17]
[null,{"$error":"#REF!"},403]
[null,{"$error":"#REF!"},227]
[null,{"$error":"#REF!"},85]
[null,{"$error":"#REF!"},94]
[null,{"$error":"#REF!"},453]
[null,{"$error":"#REF!"},150]
[null,{"$error":"#REF!"},260]
[null,{"$error":"#REF!"},480]
[null,{"$error":"#REF!"},308]
[null,{"$error":"#REF!"},166]
[null,{"$error":"#REF!"},128]
[null,{"$error":"#REF!"},476]
[null,{"$error":"#REF!"},381]
[null,{"$error":"#REF!"},69]
[null,{"$error":"#REF!"},217]
[null,{"$error":"#REF!"},84]
[null,{"$error":"#REF!"},467]
[null,{"$error":"#REF!"},439]
[null,{"$error":"#REF!"},489]
[null,null,249]
[null,{"$f":"IF(#REF!=\"\",\"\",B130+1)","v":{"$error":"#REF!"}},125]
[null,{"$f":"IF(#REF!=\"\",\"\",B131+1)","v":{"$error":"#REF!"}},301]
[null,{"$f":"IF(#REF!=\"\",\"\",B132+1)","v":{"$error":"#REF!"}},476]
[null,{"$f":"IF(#REF!=\"\",\"\",B133+1)","v":{"$error":"#REF!"}},267]
[null,{"$f":"IF(#REF!=\"\",\"\",B134+1)","v":{"$error":"#REF!"}},383]
[null,{"$f":"IF(#REF!=\"\",\"\",B135+1)","v":{"$error":"#REF!"}},181]
[null,{"$f":"IF(#REF!=\"\",\"\",B136+1)","v":{"$error":"#REF!"}},270]
[null,{"$f":"IF(#REF!=\"\",\"\",B137+1)","v":{"$error":"#REF!"}},178]
[null,{"$f":"IF(#REF!=\"\",\"\",B138+1)","v":{"$error":"#REF!"}},354]
[null,{"$f":"IF(#REF!=\"\",\"\",B139+1)","v":{"$error":"#REF!"}},85]
[null,{"$f":"IF(#REF!=\"\",\"\",B140+1)","v":{"$error":"#REF!"}},280]
[null,{"$f":"IF(#REF!=\"\",\"\",B141+1)","v":{"$error":"#REF!"}},139]
[null,{"$f":"IF(#REF!=\"\",\"\",B142+1)","v":{"$error":"#REF!"}},187]
[null,{"$f":"IF(#REF!=\"\",\"\",B143+1)","v":{"$error":"#REF!"}},147]
[null,{"$f":"IF(#REF!=\"\",\"\",B144+1)","v":{"$error":"#REF!"}},171]
[null,{"$f":"IF(#REF!=\"\",\"\",B145+1)","v":{"$error":"#REF!"}},47]
[null,{"$f":"IF(#REF!=\"\",\"\",B146+1)","v":{"$error":"#REF!"}},226]
[null,{"$f":"IF(#REF!=\"\",\"\",B147+1)","v":{"$error":"#REF!"}},106]
[null,null,30]
[null,null,257]
[null,null,222]
[null,null,449]
[null,null,265]
[null,null,177]
[null,null,158]
[null,null,88]
[null,null,334]
[null,null,34]
[null,null,187]
[null,null,328]
[null,null,213]
[null,null,79]
[null,null,106]
[null,null,156]
[null,null,278]
[null,null,241]
[null,null,408]
[null,null,327]
[null,null,494]
[null,null,98]
[null,null,291]
[null,null,351]
[null,null,362]
[null,null,22]
[null,null,90]
[null,null,455]
[null,null,155]
[null,null,289]
[null,null,239]
[null,null,89]
[null,null,108]
[null,null,338]
[null,null,267]
[null,null,145]
[null,null,428]
[null,null,345]
[null,null,97]
[null,null,295]
[null,null,417]
[null,null,289]
[null,null,179]
[null,null,137]
[null,null,161]
[null,null,461]
[null,null,82]
[null,null,102]
[null,null,332]
[null,null,111]
[null,null,49]
[null,null,296]
[null,null,337]
[null,null,218]
[null,null,137]
[null,null,182]
[null,null,118]
[null,null,398]
[null,null,249]
[null,null,42]
[null,null,361]
[null,null,485]
[null,null,5]
[null,null,10]
[null,null,447]
[null,null,411]
[null,null,109]
[null,null,309]
[null,null,159]
[null,null,332]
[null,null,41]
[null,null,349]
[null,null,314]
[null,null,21]
[null,null,326]
[null,null,62]
[null,null,345]
[null,null,249]
[null,null,244]
[null,null,68]
[null,null,497]
[null,null,390]
[null,null,356]
[null,null,145]
[null,null,235]
[null,null,421]
[null,null,498]
[null,null,293]
[null,null,328]
[null,null,189]
[null,null,393]
[null,null,385]
[null,null,213]
[null,null,282]
[null,null,191]
[null,null,399]
[null,null,419]
[null,null,181]
[null,null,269]
[null,null,114]
[null,null,295]
[null,null,174]
[null,null,266]
[null,null,273]
[null,null,172]
[null,null,87]
[null,null,390]
[null,null,417]
[null,null,369]
[null,null,104]
[null,null,186]
[null,null,79]
[null,null,75]
[null,null,359]
[null,null,315]
[null,null,82]
[null,null,356]
[null,null,172]
[null,null,12]
[null,null,411]
[null,null,206]
[null,null,460]
[null,null,487]
[null,null,51]
[null,null,453]
[null,null,213]
[null,null,297]
[null,null,248]
[null,null,155]
[null,null,229]
[null,null,186]
[null,null,435]
[null,null,363]
[null,null,346]
[null,null,343]
[null,null,72]
[null,null,88]
[null,null,125]
[null,null,362]
[null,null,133]
[null,null,295]
[null,null,191]
[null,null,190]
[null,null,368]
[null,null,190]
[null,null,324]
[null,null,197]
[null,null,122]
[null,null,369]
[null,null,11]
[null,null,496]
[null,null,75]
[null,null,228]
[null,null,28]
[null,null,339]
[null,null,435]
[null,null,366]
[null,null,292]
[null,null,236]
[null,null,466]
[null,null,181]
[null,null,332]
[null,null,67]
[null,null,319]
[null,null,453]
[null,null,252]
[null,null,171]
[null,null,127]
[null,null,69]
[null,null,214]
[null,null,220]
[null,null,306]
[null,null,229]
[null,null,373]
[null,null,418]
[null,null,121]
[null,null,346]
[null,null,123]
[null,null,137]
[null,null,89]
[null,null,321]
[null,null,469]
[null,null,292]
[null,null,144]
[null,null,302]
[null,null,82]
[null,null,122]
[null,null,10]
[null,null,3]
[null,null,196]
[null,null,483]
[null,null,66]
[null,null,459]
[null,null,135]
[null,null,476]
[null,null,488]
[null,null,388]
[null,null,106]
[null,null,394]
[null,null,239]
[null,null,484]
[]
[]
[]
[]
[]
[]
[]
[]
[]
[]
[]
[]
[]
[]
[]
[]
[]
[]
[]
[]
[]
[]
[]
[]
[]
[]
[]
[]
[]
[]
[]
[]
[]
[]
[]
[]
[]
[]
[]
[]
[]
[]
[]
[]
[]
[]
[]
[]
[]
[]
[]
[]
[]
[]
[]
[]
[]
[]
[]
[]
[]
[]
[]
[]
[]
[]
[]
[]
[]
[]
[]
[]
[]
[]
[]
[]
[]
[]
[]
[]
[]
[]
[]
[]
[]
[]
[]
[]
[]
[]
[]
[]
[]
[]
[]
[]
[]
[]
[]
[]
[]
[]
[]
[]
[]
[]
[]
[]
[]
[]
[]
[]
[]
[]
[]
[]
[]
[]
[]
[]
[]
[]
[]
[]
[]
[]
[]
[]
[]
[]
[]
[]
[]
[]
[]
[]
[]
[]
[]
[]
[]
[]
[]
[]
[]
[]
[]
[]
[]
[]
[]
[]
[]
[]
[]
[]
[]
[]
[]
[]
[]
[]
[]
[]
[]
[]
[]
[]
[]
[]
[]
[]
[]
[]
[]
[]
[]
[]
[]
[]
[]
[]
[]
[]
[]
[]
[]
[]
[]
[]
[]
[]
[]
[]
[]
[]
[]
[]
[]
[]
[]
[]
[]
[]
[]
[]
[]
[]
[]
[]
[]
[]
[]
[]
[]
[]
[]
[]
[]
[]
[]
[]
[]
[]
[]
[]
[]
[]
[]
[]
[]
[]
[]
[]
[]
[]
[]
[]
[]
[]
[]
[]
[]
[]
[]
[]
[]
[]
[]
[]
[]
[]
[]
[]
[]
[]
[]
[]
[]
[]
[]
[]
[]
[]
[]
[]
[]
[]
[]
[]
[]
[]
[]
[]
[]
[]
[]
[]
[]
[]
[]
[]
[]
[]
[]
[]
[]
[]
[]
[]
[]
[]
[]
[]
[]
[]
[]
[]
[]
[]
[]
[]
[]
[]
[]
[]
[]
[]
[]
[]
[]
[]
[]
[]
[]
[]
[]
[]
[]
[]
[]
[]
[]
[]
[]
[]
[]
[]
[]
[]
[]
[]
[]
[]
[]
[]
[]
[]
[]
[]
[]
[]
[]
[]
[]
[]
[]
[]
[]
[]
[]
[]
[]
[]
[]
[]
[]
[]
[]
[]
[]
[]
[]
[]
[]
[]
[]
[]
[]
[]
[]
[]
[]
[]
[]
[]
[]
[]
[]
[]
[]
[]
[]
[]
[]
[]
[]
[]
[]
[]
[]
[]
[]
[]
[]
[]
[]
[]
[]
[]
[]
[]
[]
[]
[]
[]
[]
[]
[]
[]
[]
[]
[]
[]
[]
[]
[]
[]
[]
[]
[]
[]
[]
[]
[]
[]
[]
[]
[]
[]
[]
[]
[]
[]
[]
[]
[]
[]
[]
[]
[]
[]
[]
[]
[]
[]
[]
[]
[]
[]
[]
[]
[]
[]
[]
[]
[]
[]
[]
[]
[]
[]
[]
[]
[]
[]
[]
[]
[]
[]
[]
[]
[]
[]
[]
[]
[]
[]
[]
[]
[]
[]
[]
[]
[]
[]
[]
[]
[]
[]
[]
[]
[]
[]
[]
[]
[]
[]
[]
[]
[]
[]
[]
[]
[]
[]
[]
[]
[]
[]
[]
[]
[]
[]
[]
[]
[]
[]
[]
[]
[]
[]
[]
[]
[]
[]
[]
[]
[]
[]
[]
[]
[]
[]
[]
[]
[]
[]
[]
[]
[]
[]
[]
[]
[]
[]
[]
[]
[]
[]
[]
[]
[]
[]
[]
[]
[]
[]
[]
[]
[]
[]
[]
[]
[]
[]
[]
[]
[]
[]
[]
[]
[]
[]
[]
[]
[]
[]
[]
[]
[]
[]
[]
[]
[]
[]
[]
[]
[]
[]
[]
[]
[]
[]
[]
[]
[]
[]
[]
[]
[]
[]
[]
[]
[]
[]
[]
[]
[]
[]
[]
[]
[]
[]
[]
[]
[]
[]
[]
[]
[]
[]
[]
[]
[]
[]
[]
[]
[]
[]
[]
[]
[]
[]
[]
[]
[]
[]
[]
[]
[]
[]
[]
[]
[]
[]
[]
[]
[]
[]
[]
[]
[]
[]
[]
[]
[]
[]
[]
[]
[]
[]
[]
[]
[]
[]
[]
[]
[]
[]
[]
[]
[]
[]
[]
[]
[]
[]
[]
[]
[]
[]
[]
[]
[]
[]
[]
[]
[]
[]
[]
[]
[]
[]
[]
[]
[]
[]
[]
[]
[]
[]
[]
[]
[]
[]
[]
[]
[]
[]
[]
[]
[]
[]
[]
[]
[]
[]
[]
[]
[]
[]
[]
[]
[]
[]
[]
[]
[]
[]
[]
[]
[]
[]
[]
[]
[]
[]
[]
[]
[]
[]
[]
[]
[]
[]
[]
[]
[]
[]
[]
[]
[]
[]
[]
[]
[]
[]
[]
[]
[]
[]
[]
[]
[]
[]
[]
[]
[]
[]
[]
[]
[]
[]
[]
[]
[]
[]
[]
[]
[]
[]
[]
[]
[]
[]
[]
[]
[]
[]
[]
[]
[]
[]
[]
[]
[]
[]
[]
[]
[]
[]
[]
[]
[]
[]
[]
[]
[]
[]
[]
[]
[]
[]
[]
[]
[]
[]
[]
[]
[]
[]
[]
[]
[]
[]
[]
[]
[]
[]
[]
[]
[]
[]
[]
[]
[]
[]
[]
[]
[]
[]
[]
[]
[]
[]
[]
[]
[]
[]
[]
[]
[]
[]
[]
[]
[]
[]
[]
[]
[]
[]
[]
[]
[]
[]
[]
[]
[]
[]
[]
[]
[]
[]
[]
[]
[]
[]
[]
[]
[]
[]
[]
[]
[]
[]
[]
[]
[]
[]
[]
[]
[]
[]
[]
[]
[]
[]
[]
[]
[]
[]
[]
[]
[]
[]
[]
[]
[]
[]
[]
[]
[]
[]
[]
[]
[]
[]
[]
[]
[]
[]
[]
[]
[]
[]
[]
[]
[]
[]
[]
[]
[]
[]
[]
[]
[]
[]
[]
[]
[]
[]
[]
[]
[]
[]
[]
[]
[]
[]
[]
[]
[]
[]
[]
[]
[]
[]
[]
[]
[]
[]
[]
[]
[]
[]
[]
[]
[]
[]
[]
[]
[]
[]
[]
[]
[]
[]
[]
[]
[]
[]
[]
[]
[]
[]
[]
[]
[]
[]
[]
[]
[]
[]
[]
[]
[]
[]
[]
[]
[]
[]
[]
[]
[]
[]
[]
[]
[]
[]
[]
[]
[]
[]
[]
[]
[]
[]
[]
[]
[]
[]
[]
[]
[]
[]
[]
[]
[]
[]
[]
[]
[]
[]
[]
[]
[]
[]
[]
[]
[]
[]
[]
[]
[]
[]
[]
[]
[]
[]
[]
[]
[]
[]
[]
[]
[]
[]
[]
[]
[]
[]
[]
[]
[]
[]
[]
[]
[]
[]
[]
[]
[]
[]
[]
[]
[]
[]
[]
[]
[]
[]
[]
[]
[]
[]
[]
[]
[]
[]
[]
[]
[]
[]
[]
[]
[]
[]
[]
[]
[]
[]
[]
[]
[]
[]
[]
[]
[]
[]
[]
[]
[]
[]
[]
[]
[]
[]
[]
[]
[]
[]
[]
[]
[]
[]
[]
[]
[]
[]
[]
[]
[]
[]
[]
[]
[]
[]
[]
[]
[]
[]
[]
[]
[]
[]
[]
[]
[]
[]
[]
[]
[]
[]
[]
[]
[]
[]
[]
[]
[]
[]
[]
[]
[]
[]
[]
[]
[]
[]
[]
[]
[]
[]
[]
[]
[]
[]
[]
[]
[]
[]
[]
[]
[]
[]
[]
[]
[]
[]
[]
[]
[]
[]
[]
[]
[]
[]
[]
[]
[]
[]
[]
[]
[]
[]
[]
[]
[]
[]
[]
[]
[]
[]
[]
[]
[]
[]
[]
[]
[]
[]
[]
[]
[]
[]
[]
[]
[]
[]
[]
[]
[]
[]
[]
[]
[]
[]
[]
[]
[]
[]
[]
[]
[]
[]
[]
[]
[]
[]
[]
[]
[]
[]
[]
[]
[]
[]
[]
[]
[]
[]
[]
[]
[]
[]
[]
[]
[]
[]
[]
[]
[]
[]
[]
[]
[]
[]
[]
[]
[]
[]
[]
[]
[]
[]
[]
[]
[]
[]
[]
[]
[]
[]
[]
[]
[]
[]
[]
[]
[]
[]
[]
[]
[]
[]
[]
[]
[]
[]
[]
[]
[]
[]
[]
[]
[]
[]
[]
[]
[]
[]
[]
[]
[]
[]
[]
[]
[]
[]
[]
[]
[]
[]
[]
[]
[]
[]
[]
[]
[]
[]
[]
[]
[]
[]
[]
[]
[]
[]
[]
[]
[]
[]
[]
[]
[]
[]
[]
[]
[]
[]
[]
[]
[]
[]
[]
[]
[]
[]
[]
[]
[]
[]
[]
[]
[]
[]
[]
[]
[]
[]
[]
[]
[]
[]
[]
[]
[]
[]
[]
[]
[]
[]
[]
[]
[]
[]
[]
[]
[]
[]
[]
[]
[]
[]
[]
[]
[]
[]
[]
[]
[]
[]
[]
[]
[]
[]
[]
[]
[]
[]
[]
[]
[]
[]
[]
[]
[]
[]
[]
[]
[]
[]
[]
[]
[]
[]
[]
[]
[]
[]
[]
[]
[]
[]
[]
[]
[]
[]
[]
[]
[]
[]
[]
[]
[]
[]
[]
[]
[]
[]
[]
[]
[]
[]
[]
[]
[]
[]
[]
[]
[]
[]
[]
[]
[]
[]
[]
[]
[]
[]
[]
[]
[]
[]
[]
[]
[]
[]
[]
[]
[]
[]
[]
[]
[]
[]
[]
[]
[]
[]
[]
[]
[]
[]
[]
[]
[]
[]
[]
[]
[]
[]
[]
[]
[]
[]
[]
[]
[]
[]
[]
[]
[]
[]
[]
[]
[]
[]
[]
[]
[]
[]
[]
[]
[]
[]
[]
[]
[]
[]
[]
[]
[]
[]
[]
[]
[]
[]
[]
[]
[]
[]
[]
[]
[]
[]
[]
[]
[]
[]
[]
[]
[]
[]
[]
[]
[]
[]
[]
[]
[]
[]
[]
[]
[]
[]
[]
[]
[]
[]
[]
[]
[]
[]
[]
[]
[]
[]
[]
[]
[]
[]
[]
[]
[]
[]
[]
[]
[]
[]
[]
[]
[]
[]
[]
[]
[]
[]
[]
[]
[]
[]
[]
[]
[]
[]
[]
[]
[]
[]
[]
[]
[]
[]
[]
[]
[]
[]
[]
[]
[]
[]
[]
[]
[]
[]
[]
[]
[]
[]
[]
[]
[]
[]
[]
[]
[]
[]
[]
[]
[]
[]
[]
[]
[]
[]
[]
[]
[]
[]
[]
[]
[]
[]
[]
[]
[]
[]
[]
[]
[]
[]
[]
[]
[]
[]
[]
[]
[]
[]
[]
[]
[]
[]
[]
[]
[]
[]
[]
[]
[]
[]
[]
[]
[]
[]
[]
[]
[]
[]
[]
[]
[]
[]
[]
[]
[]
[]
[]
[]
[]
[]
[]
[]
[]
[]
[]
[]
[]
[]
[]
[]
[]
[]
[]
[]
[]
[]
[]
[]
[]
[]
[]
[]
[]
[]
[]
[]
[]
[]
[]
[]
[]
[]
[]
[]
[]
[]
[]
[]
[]
[]
[]
[]
[]
[]
[]
[]
[]
[]
[]
[]
[]
[]
[]
[]
[]
[]
[]
[]
[]
[]
[]
[]
[]
[]
[]
[]
[]
[]
[]
[]
[]
[]
[]
[]
[]
[]
[]
[]
[]
[]
[]
[]
[]
[]
[]
[]
[]
[]
[]
[]
[]
[]
[]
[]
[]
[]
[]
[]
[]
[]
[]
[]
[]
[]
[]
[]
[]
[]
[]
[]
[]
[]
[]
[]
[]
[]
[]
[]
[]
[]
[]
[]
[]
[]
[]
[]
[]
[]
[]
[]
[]
[]
[]
[]
[]
[]
[]
[]
[]
[]
[]
[]
[]
[]
[]
[]
[]
[]
[]
[]
[]
[]
[]
[]
[]
[]
[]
[]
[]
[]
[]
[]
[]
[]
[]
[]
[]
[]
[]
[]
[]
[]
[]
[]
[]
[]
[]
[]
[]
[]
[]
[]
[]
[]
[]
[]
[]
[]
[]
[]
[]
[]
[]
[]
[]
[]
[]
[]
[]
[]
[]
[]
[]
[]
[]
[]
[]
[]
[]
[]
[]
[]
[]
[]
[]
[]
[]
[]
[]
[]
[]
[]
[]
[]
[]
[]
[]
[]
[]
[]
[]
[]
[]
[]
[]
[]
[]
[]
[]
[]
[]
[]
[]
[]
[]
[]
[]
[]
[]
[]
[]
[]
[]
[]
[]
[]
[]
[]
[]
[]
[]
[]
[]
[]
[]
[]
[]
[]
[]
[]
[]
[]
[]
[]
[]
[]
[]
[]
[]
[]
[]
[]
[]
[]
[]
[]
[]
[]
[]
[]
[]
[]
[]
[]
[]
[]
[]
[]
[]
[]
[]
[]
[]
[]
[]
[]
[]
[]
[]
[]
[]
[]
[]
[]
[]
[]
[]
[]
[]
[]
[]
[]
[]
[]
[]
[]
[]
[]
[]
[]
[]
[]
[]
[]
[]
[]
[]
[]
[]
[]
[]
[]
[]
[]
[]
[]
[]
[]
[]
[]
[]
[]
[]
[]
[]
[]
[]
[]
[]
[]
[]
[]
[]
[]
[]
[]
[]
[]
[]
[]
[]
[]
[]
[]
[]
[]
[]
[]
[]
[]
[]
[]
[]
[]
[]
[]
[]
[]
[]
[]
[]
[]
[]
[]
[]
[]
[]
[]
[]
[]
[]
[]
[]
[]
[]
[]
[]
[]
[]
[]
[]
[]
[]
[]
[]
[]
[]
[]
[]
[]
[]
[]
[]
[]
[]
[]
[]
[]
[]
[]
[]
[]
[]
[]
[]
[]
[]
[]
[]
[]
[]
[]
[]
[]
[]
[]
[]
[]
[]
[]
[]
[]
[]
[]
[]
[]
[]
[]
[]
[]
[]
[]
[]
[]
[]
[]
[]
[]
[]
[]
[]
[]
[]
[]
[]
[]
[]
[]
[]
[]
[]
[]
[]
[]
[]
[]
[]
[]
[]
[]
[]
[]
[]
[]
[]
[]
[]
[]
[]
[]
[]
[]
[]
[]
[]
[]
[]
[]
[]
[]
[]
[]
[]
[]
[]
[]
[]
[]
[]
[]
[]
[]
[]
[]
[]
[]
[]
[]
[]
[]
[]
[]
[]
[]
[]
[]
[]
[]
[]
[]
[]
[]
[]
[]
[]
[]
[]
[]
[]
[]
[]
[]
[]
[]
[]
[]
[]
[]
[]
[]
[]
[]
[]
[]
[]
[]
[]
[]
[]
[]
[]
[]
[]
[]
[]
[]
[]
[]
[]
[]
[]
[]
[]
[]
[]
[]
[]
[]
[]
[]
[]
[]
[]
[]
[]
[]
[]
[]
[]
[]
[]
[]
[]
[]
[]
[]
[]
[]
[]
[]
[]
[]
[]
[]
[]
[]
[]
[]
[]
[]
[]
[]
[]
[]
[]
[]
[]
[]
[]
[]
[]
[]
[]
[]
[]
[]
[]
[]
[]
[]
[]
[]
[]
[]
[]
[]
[]
[]
[]
[]
[]
[]
[]
[]
[]
[]
[]
[]
[]
[]
[]
[]
[]
[]
[]
[]
[]
[]
[]
[]
[]
[]
[]
[]
[]
[]
[]
[]
[]
[]
[]
[]
[]
[]
[]
[]
[]
[]
[]
[]
[]
[]
[]
[]
[]
[]
[]
[]
[]
[]
[]
[]
[]
[]
[]
[]
[]
[]
[]
[]
[]
[]
[]
[]
[]
[]
[]
[]
[]
[]
[]
[]
[]
[]
[]
[]
[]
[]
[]
[]
[]
[]
[]
[]
[]
[]
[]
[]
[]
[]
[]
[]
[]
[]
[]
[]
[]
[]
[]
[]
[]
[]
[]
[]
[]
[]
[]
[]
[]
[]
[]
[]
[]
[]
[]
[]
[]
[]
[]
[]
[]
[]
[]
[]
[]
[]
[]
[]
[]
[]
[]
[]
[]
[]
[]
[]
[]
[]
[]
[]
[]
[]
[]
[]
[]
[]
[]
[]
[]
[]
[]
[]
[]
[]
[]
[]
[]
[]
[]
[]
[]
[]
[]
[]
[]
[]
[]
[]
[]
[]
[]
[]
[]
[]
[]
[]
[]
[]
[]
[]
[]
[]
[]
[]
[]
[]
[]
[]
[]
[]
[]
[]
[]
[]
[]
[]
[]
[]
[]
[]
[]
[]
[]
[]
[]
[]
[]
[]
[]
[]
[]
[]
[]
[]
[]
[]
[]
[]
[]
[]
[]
[]
[]
[]
[]
[]
[]
[]
[]
[]
[]
[]
[]
[]
[]
[]
[]
[]
[]
[]
[]
[]
[]
[]
[]
[]
[]
[]
[]
[]
[]
[]
[]
[]
[]
[]
[]
[]
[]
[]
[]
[]
[]
[]
[]
[]
[]
[]
[]
[]
[]
[]
[]
[]
[]
[]
[]
[]
[]
[]
[]
[]
[]
[]
[]
[]
[]
[]
[]
[]
[]
[]
[]
[]
[]
[]
[]
[]
[]
[]
[]
[]
[]
[]
[]
[]
[]
[]
[]
[]
[]
[]
[]
[]
[]
[]
[]
[]
[]
[]
[]
[]
[]
[]
[]
[]
[]
[]
[]
[]
[]
[]
[]
[]
[]
[]
[]
[]
[]
[]
[]
[]
[]
[]
[]
[]
[]
[]
[]
[]
[]
[]
[]
[]
[]
[]
[]
[]
[]
[]
[]
[]
[]
[]
[]
[]
[]
[]
[]
[]
[]
[]
[]
[]
[]
[]
[]
[]
[]
[]
[]
[]
[]
[]
[]
[]
[]
[]
[]
[]
[]
[]
[]
[]
[]
[]
[]
[]
[]
[]
[]
[]
[]
[]
[]
[]
[]
[]
[]
[]
[]
[]
[]
[]
[]
[]
[]
[]
[]
[]
[]
[]
[]
[]
[]
[]
[]
[]
[]
[]
[]
[]
[]
[]
[]
[]
[]
[]
[]
[]
[]
[]
[]
[]
[]
[]
[]
[]
[]
[]
[]
[]
[]
[]
[]
[]
[]
[]
[]
[]
[]
[]
[]
[]
[]
[]
[]
[]
[]
[]
[]
[]
[]
[]
[]
[]
[]
[]
[]
[]
[]
[]
[]
[]
[]
[]
[]
[]
[]
[]
[]
[]
[]
[]
[]
[]
[]
[]
[]
[]
[]
[]
[]
[]
[]
[]
[]
[]
[]
[]
[]
[]
[]
[]
[]
[]
[]
[]
[]
[]
[]
[]
[]
[]
[]
[]
[]
[]
[]
[]
[]
[]
[]
[]
[]
[]
[]
[]
[]
[]
[]
[]
[]
[]
[]
[]
[]
[]
[]
[]
[]
[]
[]
[]
[]
[]
[]
[]
[]
[]
[]
[]
[]
[]
[]
[]
[]
[]
[]
[]
[]
[]
[]
[]
[]
[]
[]
[]
[]
[]
[]
[]
[]
[]
[]
[]
[]
[]
[]
[]
[]
[]
[]
[]
[]
[]
[]
[]
[]
[]
[]
[]
[]
[]
[]
[]
[]
[]
[]
[]
[]
[]
[]
[]
[]
[]
[]
[]
[]
[]
[]
[]
[]
[]
[]
[]
[]
[]
[]
[]
[]
[]
[]
[]
[]
[]
[]
[]
[]
[]
[]
[]
[]
[]
[]
[]
[]
[]
[]
[]
[]
[]
[]
[]
[]
[]
[]
[]
[]
[]
[]
[]
[]
[]
[]
[]
[]
[]
[]
[]
[]
[]
[]
[]
[]
[]
[]
[]
[]
[]
[]
[]
[]
[]
[]
[]
[]
[]
[]
[]
[]
[]
[]
[]
[]
[]
[]
[]
[]
[]
[]
[]
[]
[]
[]
[]
[]
[]
[]
[]
[]
[]
[]
[]
[]
[]
[]
[]
[]
[]
[]
[]
[]
[]
[]
[]
[]
[]
[]
[]
[]
[]
[]
[]
[]
[]
[]
[]
[]
[]
[]
[]
[]
[]
[]
[]
[]
[]
[]
[]
[]
[]
[]
[]
[]
[]
[]
[]
[]
[]
[]
[]
[]
[]
[]
[]
[]
[]
[]
[]
[]
[]
[]
[]
[]
[]
[]
[]
[]
[]
[]
[]
[]
[]
[]
[]
[]
[]
[]
[]
[]
[]
[]
[]
[]
[]
[]
[]
[]
[]
[]
[]
[]
[]
[]
[]
[]
[]
[]
[]
[]
[]
[]
[]
[]
[]
[]
[]
[]
[]
[]
[]
[]
[]
[]
[]
[]
[]
[]
[]
[]
[]
[]
[]
[]
[]
[]
[]
[]
[]
[]
[]
[]
[]
[]
[]
[]
[]
[]
[]
[]
[]
[]
[]
[]
[]
[]
[]
[]
[]
[]
[]
[]
[]
[]
[]
[]
[]
[]
[]
[]
[]
[]
[]
[]
[]
[]
[]
[]
[]
[]
[]
[]
[]
[]
[]
[]
[]
[]
[]
[]
[]
[]
[]
[]
[]
[]
[]
[]
[]
[]
[]
[]
[]
[]
[]
[]
[]
[]
[]
[]
[]
[]
[]
[]
[]
[]
[]
[]
[]
[]
[]
[]
[]
[]
[]
[]
[]
[]
[]
[]
[]
[]
[]
[]
[]
[]
[]
[]
[]
[]
[]
[]
[]
[]
[]
[]
[]
[]
[]
[]
[]
[]
[]
[]
[]
[]
[]
[]
[]
[]
[]
[]
[]
[]
[]
[]
[]
[]
[]
[]
[]
[]
[]
[]
[]
[]
[]
[]
[]
[]
[]
[]
[]
[]
[]
[]
[]
[]
[]
[]
[]
[]
[]
[]
[]
[]
[]
[]
[]
[]
[]
[]
[]
[]
[]
[]
[]
[]
[]
[]
[]
[]
[]
[]
[]
[]
[]
[]
[]
[]
[]
[]
[]
[]
[]
[]
[]
[]
[]
[]
[]
[]
[]
[]
[]
[]
[]
[]
[]
[]
[]
[]
[]
[]
[]
[]
[]
[]
[]
[]
[]
[]
[]
[]
[]
[]
[]
[]
[]
[]
[]
[]
[]
[]
[]
[]
[]
[]
[]
[]
[]
[]
[]
[]
[]
[]
[]
[]
[]
[]
[]
[]
[]
[]
[]
[]
[]
[]
[]
[]
[]
[]
[]
[]
[]
[]
[]
[]
[]
[]
[]
[]
[]
[]
[]
[]
[]
[]
[]
[]
[]
[]
[]
[]
[]
[]
[]
[]
[]
[]
[]
[]
[]
[]
[]
[]
[]
[]
[]
[]
[]
[]
[]
[]
[]
[]
[]
[]
[]
[]
[]
[]
[]
[]
[]
[]
[]
[]
[]
[]
[]
[]
[]
[]
[]
[]
[]
[]
[]
[]
[]
[]
[]
[]
[]
[]
[]
[]
[]
[]
[]
[]
[]
[]
[]
[]
[]
[]
[]
[]
[]
[]
[]
[]
[]
[]
[]
[]
[]
[]
[]
[]
[]
[]
[]
[]
[]
[]
[]
[]
[]
[]
[]
[]
[]
[]
[]
[]
[]
[]
[]
[]
[]
[]
[]
[]
[]
[]
[]
[]
[]
[]
[]
[]
[]
[]
[]
[]
[]
[]
[]
[]
[]
[]
[]
[]
[]
[]
[]
[]
[]
[]
[]
[]
[]
[]
[]
[]
[]
[]
[]
[]
[]
[]
[]
[]
[]
[]
[]
[]
[]
[]
[]
[]
[]
[]
[]
[]
[]
[]
[]
[]
[]
[]
[]
[]
[]
[]
[]
[]
[]
[]
[]
[]
[]
[]
[]
[]
[]
[]
[]
[]
[]
[]
[]
[]
[]
[]
[]
[]
[]
[]
[]
[]
[]
[]
[]
[]
[]
[]
[]
[]
[]
[]
[]
[]
[]
[]
[]
[]
[]
[]
[]
[]
[]
[]
[]
[]
[]
[]
[]
[]
[]
[]
[]
[]
[]
[]
[]
[]
[]
[]
[]
[]
[]
[]
[]
[]
[]
[]
[]
[]
[]
[]
[]
[]
[]
[]
[]
[]
[]
[]
[]
[]
[]
[]
[]
[]
[]
[]
[]
[]
[]
[]
[]
[]
[]
[]
[]
[]
[]
[]
[]
[]
[]
[]
[]
[]
[]
[]
[]
[]
[]
[]
[]
[]
[]
[]
[]
[]
[]
[]
[]
[]
[]
[]
[]
[]
[]
[]
[]
[]
[]
[]
[]
[]
[]
[]
[]
[]
[]
[]
[]
[]
[]
[]
[]
[]
[]
[]
[]
[]
[]
[]
[]
[]
[]
[]
[]
[]
[]
[]
[]
[]
[]
[]
[]
[]
[]
[]
[]
[]
[]
[]
[]
[]
[]
[]
[]
[]
[]
[]
[]
[]
[]
[]
[]
[]
[]
[]
[]
[]
[]
[]
[]
[]
[]
[]
[]
[]
[]
[]
[]
[]
[]
[]
[]
[]
[]
[]
[]
[]
[]
[]
[]
[]
[]
[]
[]
[]
[]
[]
[]
[]
[]
[]
[]
[]
[]
[]
[]
[]
[]
[]
[]
[]
[]
[]
[]
[]
[]
[]
[]
[]
[]
[]
[]
[]
[]
[]
[]
[]
[]
[]
[]
[]
[]
[]
[]
[]
[]
[]
[]
[]
[]
[]
[]
[]
[]
[]
[]
[]
[]
[]
[]
[]
[]
[]
[]
[]
[]
[]
[]
[]
[]
[]
[]
[]
[]
[]
[]
[]
[]
[]
[]
[]
[]
[]
[]
[]
[]
[]
[]
[]
[]
[]
[]
[]
[]
[]
[]
[]
[]
[]
[]
[]
[]
[]
[]
[]
[]
[]
[]
[]
[]
[]
[]
[]
[]
[]
[]
[]
[]
[]
[]
[]
[]
[]
[]
[]
[]
[]
[]
[]
[]
[]
[]
[]
[]
[]
[]
[]
[]
[]
[]
[]
[]
[]
[]
[]
[]
[]
[]
[]
[]
[]
[]
[]
[]
[]
[]
[]
[]
[]
[]
[]
[]
[]
[]
[]
[]
[]
[]
[]
[]
[]
[]
[]
[]
[]
[]
[]
[]
[]
[]
[]
[]
[]
[]
[]
[]
[]
[]
[]
[]
[]
[]
[]
[]
[]
[]
[]
[]
[]
[]
[]
[]
[]
[]
[]
[]
[]
[]
[]
[]
[]
[]
[]
[]
[]
[]
[]
[]
[]
[]
[]
[]
[]
[]
[]
[]
[]
[]
[]
[]
[]
[]
[]
[]
[]
[]
[]
[]
[]
[]
[]
[]
[]
[]
[]
[]
[]
[]
[]
[]
[]
[]
[]
[]
[]
[]
[]
[]
[]
[]
[]
[]
[]
[]
[]
[]
[]
[]
[]
[]
[]
[]
[]
[]
[]
[]
[]
[]
[]
[]
[]
[]
[]
[]
[]
[]
[]
[]
[]
[]
[]
[]
[]
[]
[]
[]
[]
[]
[]
[]
[]
[]
[]
[]
[]
[]
[]
[]
[]
[]
[]
[]
[]
[]
[]
[]
[]
[]
[]
[]
[]
[]
[]
[]
[]
[]
[]
[]
[]
[]
[]
[]
[]
[]
[]
[]
[]
[]
[]
[]
[]
[]
[]
[]
[]
[]
[]
[]
[]
[]
[]
[]
[]
[]
[]
[]
[]
[]
[]
[]
[]
[]
[]
[]
[]
[]
[]
[]
[]
[]
[]
[]
[]
[]
[]
[]
[]
[]
[]
[]
[]
[]
[]
[]
[]
[]
[]
[]
[]
[]
[]
[]
[]
[]
[]
[]
[]
[]
[]
[]
[]
[]
[]
[]
[]
[]
[]
[]
[]
[]
[]
[]
[]
[]
[]
[]
[]
[]
[]
[]
[]
[]
[]
[]
[]
[]
[]
[]
[]
[]
[]
[]
[]
[]
[]
[]
[]
[]
[]
[]
[]
[]
[]
[]
[]
[]
[]
[]
[]
[]
[]
[]
[]
[]
[]
[]
[]
[]
[]
[]
[]
[]
[]
[]
[]
[]
[]
[]
[]
[]
[]
[]
[]
[]
[]
[]
[]
[]
[]
[]
[]
[]
[]
[]
[]
[]
[]
[]
[]
[]
[]
[]
[]
[]
[]
[]
[]
[]
[]
[]
[]
[]
[]
[]
[]
[]
[]
[]
[]
[]
[]
[]
[]
[]
[]
[]
[]
[]
[]
[]
[]
[]
[]
[]
[]
[]
[]
[]
[]
[]
[]
[]
[]
[]
[]
[]
[]
[]
[]
[]
[]
[]
[]
[]
[]
[]
[]
[]
[]
[]
[]
[]
[]
[]
[]
[]
[]
[]
[]
[]
[]
[]
[]
[]
[]
[]
[]
[]
[]
[]
[]
[]
[]
[]
[]
[]
[]
[]
[]
[]
[]
[]
[]
[]
[]
[]
[]
[]
[]
[]
[]
[]
[]
[]
[]
[]
[]
[]
[]
[]
[]
[]
[]
[]
[]
[]
[]
[]
[]
[]
[]
[]
[]
[]
[]
[]
[]
[]
[]
[]
[]
[]
[]
[]
[]
[]
[]
[]
[]
[]
[]
[]
[]
[]
[]
[]
[]
[]
[]
[]
[]
[]
[]
[]
[]
[]
[]
[]
[]
[]
[]
[]
[]
[]
[]
[]
[]
[]
[]
[]
[]
[]
[]
[]
[]
[]
[]
[]
[]
[]
[]
[]
[]
[]
[]
[]
[]
[]
[]
[]
[]
[]
[]
[]
[]
[]
[]
[]
[]
[]
[]
[]
[]
[]
[]
[]
[]
[]
[]
[]
[]
[]
[]
[]
[]
[]
[]
[]
[]
[]
[]
[]
[]
[]
[]
[]
[]
[]
[]
[]
[]
[]
[]
[]
[]
[]
[]
[]
[]
[]
[]
[]
[]
[]
[]
[]
[]
[]
[]
[]
[]
[]
[]
[]
[]
[]
[]
[]
[]
[]
[]
[]
[]
[]
[]
[]
[]
[]
[]
[]
[]
[]
[]
[]
[]
[]
[]
[]
[]
[]
[]
[]
[]
[]
[]
[]
[]
[]
[]
[]
[]
[]
[]
[]
[]
[]
[]
[]
[]
[]
[]
[]
[]
[]
[]
[]
[]
[]
[]
[]
[]
[]
[]
[]
[]
[]
[]
[]
[]
[]
[]
[]
[]
[]
[]
[]
[]
[]
[]
[]
[]
[]
[]
[]
[]
[]
[]
[]
[]
[]
[]
[]
[]
[]
[]
[]
[]
[]
[]
[]
[]
[]
[]
[]
[]
[]
[]
[]
[]
[]
[]
[]
[]
[]
[]
[]
[]
[]
[]
[]
[]
[]
[]
[]
[]
[]
[]
[]
[]
[]
[]
[]
[]
[]
[]
[]
[]
[]
[]
[]
[]
[]
[]
[]
[]
[]
[]
[]
[]
[]
[]
[]
[]
[]
[]
[]
[]
[]
[]
[]
[]
[]
[]
[]
[]
[]
[]
[]
[]
[]
[]
[]
[]
[]
[]
[]
[]
[]
[]
[]
[]
[]
[]
[]
[]
[]
[]
[]
[]
[]
[]
[]
[]
[]
[]
[]
[]
[]
[]
[]
[]
[]
[]
[]
[]
[]
[]
[]
[]
[]
[]
[]
[]
[]
[]
[]
[]
[]
[]
[]
[]
[]
[]
[]
[]
[]
[]
[]
[]
[]
[]
[]
[]
[]
[]
[]
[]
[]
[]
[]
[]
[]
[]
[]
[]
[]
[]
[]
[]
[]
[]
[]
[]
[]
[]
[]
[]
[]
[]
[]
[]
[]
[]
[]
[]
[]
[]
[]
[]
[]
[]
[]
[]
[]
[]
[]
[]
[]
[]
[]
[]
[]
[]
[]
[]
[]
[]
[]
[]
[]
[]
[]
[]
[]
[]
[]
[]
[]
[]
[]
[]
[]
[]
[]
[]
[]
[]
[]
[]
[]
[]
[]
[]
[]
[]
[]
[]
[]
[]
[]
[]
[]
[]
[]
[]
[]
[]
[]
[]
[]
[]
[]
[]
[]
[]
[]
[]
[]
[]
[]
[]
[]
[]
[]
[]
[]
[]
[]
[]
[]
[]
[]
[]
[]
[]
[]
[]
[]
[]
[]
[]
[]
[]
[]
[]
[]
[]
[]
[]
[]
[]
[]
[]
[]
[]
[]
[]
[]
[]
[]
[]
[]
[]
[]
[]
[]
[]
[]
[]
[]
[]
[]
[]
[]
[]
[]
[]
[]
[]
[]
[]
[]
[]
[]
[]
[]
[]
[]
[]
[]
[]
[]
[]
[]
[]
[]
[]
[]
[]
[]
[]
[]
[]
[]
[]
[]
[]
[]
[]
[]
[]
[]
[]
[]
[]
[]
[]
[]
[]
[]
[]
[]
[]
[]
[]
[]
[]
[]
[]
[]
[]
[]
[]
[]
[]
[]
[]
[]
[]
[]
[]
[]
[]
[]
[]
[]
[]
[]
[]
[]
[]
[]
[]
[]
[]
[]
[]
[]
[]
[]
[]
[]
[]
[]
[]
[]
[]
[]
[]
[]
[]
[]
[]
[]
[]
[]
[]
[]
[]
[]
[]
[]
[]
[]
[]
[]
[]
[]
[]
[]
[]
[]
[]
[]
[]
[]
[]
[]
[]
[]
[]
[]
[]
[]
[]
[]
[]
[]
[]
[]
[]
[]
[]
[]
[]
[]
[]
[]
[]
[]
[]
[]
[]
[]
[]
[]
[]
[]
[]
[]
[]
[]
[]
[]
[]
[]
[]
[]
[]
[]
[]
[]
[]
[]
[]
[]
[]
[]
[]
[]
[]
[]
[]
[]
[]
[]
[]
[]
[]
[]
[]
[]
[]
[]
[]
[]
[]
[]
[]
[]
[]
[]
[]
[]
[]
[]
[]
[]
[]
[]
[]
[]
[]
[]
[]
[]
[]
[]
[]
[]
[]
[]
[]
[]
[]
[]
[]
[]
[]
[]
[]
[]
[]
[]
[]
[]
[]
[]
[]
[]
[]
[]
[]
[]
[]
[]
[]
[]
[]
[]
[]
[]
[]
[]
[]
[]
[]
[]
[]
[]
[]
[]
[]
[]
[]
[]
[]
[]
[]
[]
[]
[]
[]
[]
[]
[]
[]
[]
[]
[]
[]
[]
[]
[]
[]
[]
[]
[]
[]
[]
[]
[]
[]
[]
[]
[]
[]
[]
[]
[]
[]
[]
[]
[]
[]
[]
[]
[]
[]
[]
[]
[]
[]
[]
[]
[]
[]
[]
[]
[]
[]
[]
[]
[]
[]
[]
[]
[]
[]
[]
[]
[]
[]
[]
[]
[]
[]
[]
[]
[]
[]
[]
[]
[]
[]
[]
[]
[]
[]
[]
[]
[]
[]
[]
[]
[]
[]
[]
[]
[]
[]
[]
[]
[]
[]
[]
[]
[]
[]
[]
[]
[]
[]
[]
[]
[]
[]
[]
[]
[]
[]
[]
[]
[]
[]
[]
[]
[]
[]
[]
[]
[]
[]
[]
[]
[]
[]
[]
[]
[]
[]
[]
[]
[]
[]
[]
[]
[]
[]
[]
[]
[]
[]
[]
[]
[]
[]
[]
[]
[]
[]
[]
[]
[]
[]
[]
[]
[]
[]
[]
[]
[]
[]
[]
[]
[]
[]
[]
[]
[]
[]
[]
[]
[]
[]
[]
[]
[]
[]
[]
[]
[]
[]
[]
[]
[]
[]
[]
[]
[]
[]
[]
[]
[]
[]
[]
[]
[]
[]
[]
[]
[]
[]
[]
[]
[]
[]
[]
[]
[]
[]
[]
[]
[]
[]
[]
[]
[]
[]
[]
[]
[]
[]
[]
[]
[]
[]
[]
[]
[]
[]
[]
[]
[]
[]
[]
[]
[]
[]
[]
[]
[]
[]
[]
[]
[]
[]
[]
[]
[]
[]
[]
[]
[]
[]
[]
[]
[]
[]
[]
[]
[]
[]
[]
[]
[]
[]
[]
[]
[]
[]
[]
[]
[]
[]
[]
[]
[]
[]
[]
[]
[]
[]
[]
[]
[]
[]
[]
[]
[]
[]
[]
[]
[]
[]
[]
[]
[]
[]
[]
[]
[]
[]
[]
[]
[]
[]
[]
[]
[]
[]
[]
[]
[]
[]
[]
[]
[]
[]
[]
[]
[]
[]
[]
[]
[]
[]
[]
[]
[]
[]
[]
[]
[]
[]
[]
[]
[]
[]
[]
[]
[]
[]
[]
[]
[]
[]
[]
[]
[]
[]
[]
[]
[]
[]
[]
[]
[]
[]
[]
[]
[]
[]
[]
[]
[]
[]
[]
[]
[]
[]
[]
[]
[]
[]
[]
[]
[]
[]
[]
[]
[]
[]
[]
[]
[]
[]
[]
[]
[]
[]
[]
[]
[]
[]
[]
[]
[]
[]
[]
[]
[]
[]
[]
[]
[]
[]
[]
[]
[]
[]
[]
[]
[]
[]
[]
[]
[]
[]
[]
[]
[]
[]
[]
[]
[]
[]
[]
[]
[]
[]
[]
[]
[]
[]
[]
[]
[]
[]
[]
[]
[]
[]
[]
[]
[]
[]
[]
[]
[]
[]
[]
[]
[]
[]
[]
[]
[]
[]
[]
[]
[]
[]
[]
[]
[]
[]
[]
[]
[]
[]
[]
[]
[]
[]
[]
[]
[]
[]
[]
[]
[]
[]
[]
[]
[]
[]
[]
[]
[]
[]
[]
[]
[]
[]
[]
[]
[]
[]
[]
[]
[]
[]
[]
[]
[]
[]
[]
[]
[]
[]
[]
[]
[]
[]
[]
[]
[]
[]
[]
[]
[]
[]
[]
[]
[]
[]
[]
[]
[]
[]
[]
[]
[]
[]
[]
[]
[]
[]
[]
[]
[]
[]
[]
[]
[]
[]
[]
[]
[]
[]
[]
[]
[]
[]
[]
[]
[]
[]
[]
[]
[]
[]
[]
[]
[]
[]
[]
[]
[]
[]
[]
[]
[]
[]
[]
[]
[]
[]
[]
[]
[]
[]
[]
[]
[]
[]
[]
[]
[]
[]
[]
[]
[]
[]
[]
[]
[]
[]
[]
[]
[]
[]
[]
[]
[]
[]
[]
[]
[]
[]
[]
[]
[]
[]
[]
[]
[]
[]
[]
[]
[]
[]
[]
[]
[]
[]
[]
[]
[]
[]
[]
[]
[]
[]
[]
[]
[]
[]
[]
[]
[]
[]
[]
[]
[]
[]
[]
[]
[]
[]
[]
[]
[]
[]
[]
[]
[]
[]
[]
[]
[]
[]
[]
[]
[]
[]
[]
[]
[]
[]
[]
[]
[]
[]
[]
[]
[]
[]
[]
[]
[]
[]
[]
[]
[]
[]
[]
[]
[]
[]
[]
[]
[]
[]
[]
[]
[]
[]
[]
[]
[]
[]
[]
[]
[]
[]
[]
[]
[]
[]
[]
[]
[]
[]
[]
[]
[]
[]
[]
[]
[]
[]
[]
[]
[]
[]
[]
[]
[]
[]
[]
[]
[]
[]
[]
[]
[]
[]
[]
[]
[]
[]
[]
[]
[]
[]
[]
[]
[]
[]
[]
[]
[]
[]
[]
[]
[]
[]
[]
[]
[]
[]
[]
[]
[]
[]
[]
[]
[]
[]
[]
[]
[]
[]
[]
[]
[]
[]
[]
[]
[]
[]
[]
[]
[]
[]
[]
[]
[]
[]
[]
[]
[]
[]
[]
[]
[]
[]
[]
[]
[]
[]
[]
[]
[]
[]
[]
[]
[]
[]
[]
[]
[]
[]
[]
[]
[]
[]
[]
[]
[]
[]
[]
[]
[]
[]
[]
[]
[]
[]
[]
[]
[]
[]
[]
[]
[]
[]
[]
[]
[]
[]
[]
[]
[]
[]
[]
[]
[]
[]
[]
[]
[]
[]
[]
[]
[]
[]
[]
[]
[]
[]
[]
[]
[]
[]
[]
[]
[]
[]
[]
[]
[]
[]
[]
[]
[]
[]
[]
[]
[]
[]
[]
[]
[]
[]
[]
[]
[]
[]
[]
[]
[null,{"$f":"IF(C6503=\"\",\"\",B6502+1)","v":""}]
[null,""]
[null,""]
[null,""]
[null,""]
[null,""]
[null,""]
[null,""]
[null,""]
[null,""]
[null,""]
[null,""]
[null,""]
[null,""]
[null,""]
[null,""]
[null,""]
[null,""]
[null,""]
[null,""]
[null,""]
[null,""]
[null,""]
[null,""]
[null,""]
[null,""]
[null,""]
[null,""]
[null,""]
[null,""]
[null,""]
[null,""]
[null,{"$f":"IF(C6535=\"\",\"\",B6534+1)","v":""}]
[null,""]
[null,""]
[null,""]
[null,""]
[null,""]
[null,""]
[null,""]
[null,""]
[null,""]
[null,""]
[null,""]
[null,""]
[null,""]
[null,""]
[null,""]
[null,""]
[null,""]
[null,""]
[null,""]
[null,""]
[null,""]
[null,""]
[null,""]
[null,""]
[null,""]
[null,""]
[null,""]
[null,""]
[null,""]
[null,""]
[null,""]
[null,{"$f":"IF(C6567=\"\",\"\",B6566+1)","v":""}]
[null,""]
[null,""]
[null,""]
[null,""]
[null,""]
[null,""]
[null,""]
[null,""]
[null,""]
[null,""]
[null,""]
[null,""]
[null,""]
[null,""]
[null,""]
[null,""]
[null,""]
[null,""]
[null,""]
[null,""]
[null,""]
[null,""]
[null,""]
[null,""]
[null,""]
[null,""]
[null,""]
[null,""]
[null,""]
[null,""]
[null,""]
[null,{"$f":"IF(C6599=\"\",\"\",B6598+1)","v":""}]
[null,""]
[null,""]
[null,""]
[null,""]
[null,""]
[null,""]
[null,""]
[null,""]
[null,""]
[null,""]
[null,""]
[null,""]
[null,""]
[null,""]
[null,""]
[null,""]
[null,""]
[null,""]
[null,""]
[null,""]
[null,""]
[null,""]
[null,""]
[null,""]
[null,""]
[null,""]
[null,""]
[null,""]
[null,""]
[null,""]
[null,""]
[null,{"$f":"IF(C6631=\"\",\"\",B6630+1)","v":""}]
[null,""]
[null,""]
[null,""]
[null,""]
[null,""]
[null,""]
[null,""]
[null,""]
[null,""]
[null,""]
[null,""]
[null,""]
[null,""]
[null,""]
[null,""]
[null,""]
[null,""]
[null,""]
[null,""]
[null,""]
[null,""]
[null,""]
[null,""]
[null,""]
[null,""]
[null,""]
[]
[null,{"$f":"IF(#REF!=\"\",\"\",B6658+1)","v":{"$error":"#REF!"}}]
[null,{"$f":"IF(#REF!=\"\",\"\",B6659+1)","v":{"$error":"#REF!"}}]
[null,{"$f":"IF(#REF!=\"\",\"\",B6660+1)","v":{"$error":"#REF!"}}]
[null,{"$f":"IF(#REF!=\"\",\"\",B6661+1)","v":{"$error":"#REF!"}}]
[null,{"$f":"IF(#REF!=\"\",\"\",B6662+1)","v":{"$error":"#REF!"}}]
[null,{"$f":"IF(#REF!=\"\",\"\",B6663+1)","v":{"$error":"#REF!"}}]
[null,{"$f":"IF(#REF!=\"\",\"\",B6664+1)","v":{"$error":"#REF!"}}]
[null,{"$f":"IF(#REF!=\"\",\"\",B6665+1)","v":{"$error":"#REF!"}}]
[null,{"$f":"IF(#REF!=\"\",\"\",B6666+1)","v":{"$error":"#REF!"}}]
[null,{"$f":"IF(#REF!=\"\",\"\",B6667+1)","v":{"$error":"#REF!"}}]
[null,{"$f":"IF(#REF!=\"\",\"\",B6668+1)","v":{"$error":"#REF!"}}]
[null,{"$f":"IF(#REF!=\"\",\"\",B6669+1)","v":{"$error":"#REF!"}}]
[null,{"$f":"IF(#REF!=\"\",\"\",B6670+1)","v":{"$error":"#REF!"}}]
[null,{"$f":"IF(#REF!=\"\",\"\",B6671+1)","v":{"$error":"#REF!"}}]
[null,{"$f":"IF(#REF!=\"\",\"\",B6672+1)","v":{"$error":"#REF!"}}]
[]
[]
[]
[]
[]
[]
[]
[]
[]
[]
[]
[]
[]
[]
[]
[]
[]
[]
[]
[]
[]
[]
[]
[]
[]
[]
[]
[]
[]
[]
[]
[]
[]
[]
[]
[]
[]
[]
[]
[]
[]
[]
[]
[]
[]
[]
[]
[]
[]
[]
[]
[]
[]
[]
[]
[]
[]
[]
[]
[]
[]
[]
[]
[]
[]
[]
[]
[]
[]
[]
[]
[]
[]
[]
[]
[]
[]
[]
[]
[]
[]
[]
[]
[]
[]
[]
[]
[]
[]
[]
[]
[]
[]
[]
[]
[]
[]
[]
[]
[]
[]
[]
[]
[]
[]
[]
[]
[]
[]
[]
[]
[]
[]
[]
[]
[]
[]
[]
[]
[]
[]
[]
[]
[]
[]
[]
[]
[]
[]
[]
[]
[]
[]
[]
[]
[]
[]
[]
[]
[]
[]
[]
[]
[]
[]
[]
[]
[]
[]
[]
[]
[]
[]
[]
[]
[]
[]
[]
[]
[]
[]
[]
[]
[]
[]
[]
[]
[]
[]
[]
[]
[]
[]
[]
[]
[]
[]
[]
[]
[]
[]
[]
[]
[]
[]
[]
[]
[]
[]
[]
[]
[]
[]
[]
[]
[]
[]
[]
[]
[]
[]
[]
[]
[]
[]
[]
[]
[]
[]
[]
[]
[]
[]
[]
[]
[]
[]
[]
[]
[]
[]
[]
[]
[]
[]
[]
[]
[]
[]
[]
[]
[]
[]
[]
[]
[]
[]
[]
[]
[]
[]
[]
[]
[]
[]
[]
[]
[]
[]
[]
[]
[]
[]
[]
[]
[]
[]
[]
[]
[]
[]
[]
[]
[]
[]
[]
[]
[]
[]
[]
[]
[]
[]
[]
[]
[]
[]
[]
[]
[]
[]
[]
[]
[]
[]
[]
[]
[]
[]
[]
[]
[]
[]
[]
[]
[]
[]
[]
[]
[]
[]
[]
[]
[]
[]
[]
[]
[]
[]
[]
[]
[]
[]
[]
[]
[]
[]
[]
[]
[]
[]
[]
[]
[]
[]
[]
[]
[]
[]
[]
[]
[]
[]
[]
[]
[]
[]
[]
[]
[]
[]
[]
[]
[]
[]
[]
[]
[]
[]
[]
[]
[]
[]
[]
[]
[]
[]
[]
[]
[]
[]
[]
[]
[]
[]
[]
[]
[]
[]
[]
[]
[]
[]
[]
[]
[]
[]
[]
[]
[]
[]
[]
[]
[]
[]
[]
[]
[]
[]
[]
[]
[]
[]
[]
[]
[]
[]
[]
[]
[]
[]
[]
[]
[]
[]
[]
[]
[]
[]
[]
[]
[]
[]
[]
[]
[]
[]
[]
[]
[]
[]
[]
[]
[]
[]
[]
[]
[]
[]
[]
[]
[]
[]
[]
[]
[]
[]
[]
[]
[]
[]
[]
[]
[]
[]
[]
[]
[]
[]
[]
[]
[]
[]
[]
[]
[]
[]
[]
[]
[]
[]
[]
[]
[]
[]
[]
[]
[]
[]
[]
[]
[]
[]
[]
[]
[]
[]
[]
[]
[]
[]
[]
[]
[]
[]
[]
[]
[]
[]
[]
[]
[]
[]
[]
[]
[]
[]
[]
[]
[]
[]
[]
[]
[]
[]
[]
[]
[]
[]
[]
[]
[]
[]
[]
[]
[]
[]
[]
[]
[]
[]
[]
[]
[]
[]
[]
[]
[]
[]
[]
[]
[]
[]
[]
[]
[]
[]
[]
[]
[]
[]
[]
[]
[]
[]
[]
[]
[]
[]
[]
[]
[]
[]
[]
[]
[]
[]
[]
[]
[]
[]
[]
[]
[]
[]
[]
[]
[]
[]
[]
[]
[]
[]
[]
[]
[]
[]
[]
[]
[]
[]
[]
[]
[]
[]
[]
[]
[]
[]
[]
[]
[]
[]
[]
[]
[]
[]
[]
[]
[]
[]
[]
[]
[]
[]
[]
[]
[]
[]
[]
[]
[]
[]
[]
[]
[]
[]
[]
[]
[]
[]
[]
[]
[]
[]
[]
[]
[]
[]
[]
[]
[]
[]
[]
[]
[]
[]
[]
[]
[]
[]
[]
[]
[]
[]
[]
[]
[]
[]
[]
[]
[]
[]
[]
[]
[]
[]
[]
[]
[]
[]
[]
[]
[]
[]
[]
[]
[]
[]
[]
[]
[]
[]
[]
[]
[]
[]
[]
[]
[]
[]
[]
[]
[]
[]
[]
[]
[]
[]
[]
[]
[]
[]
[]
[]
[]
[]
[]
[]
[]
[]
[]
[]
[]
[]
[]
[]
[]
[]
[]
[]
[]
[]
[]
[]
[]
[]
[]
[]
[]
[]
[]
[]
[]
[]
[]
[]
[]
[]
[]
[]
[]
[]
[]
[]
[]
[]
[]
[]
[]
[]
[]
[]
[]
[]
[]
[]
[]
[]
[]
[]
[]
[]
[]
[]
[]
[]
[]
[]
[]
[]
[]
[]
[]
[]
[]
[]
[]
[]
[]
[]
[]
[]
[]
[]
[]
[]
[]
[]
[]
[]
[]
[]
[]
[]
[]
[]
[]
[]
[]
[]
[]
[]
[]
[]
[]
[]
[]
[]
[]
[]
[]
[]
[]
[]
[]
[]
[]
[]
[]
[]
[]
[]
[]
[]
[]
[]
[]
[]
[]
[]
[]
[]
[]
[]
[]
[]
[]
[]
[]
[]
[]
[]
[]
[]
[]
[]
[]
[]
[]
[]
[]
[]
[]
[]
[]
[]
[]
[]
[]
[]
[]
[]
[]
[]
[]
[]
[]
[]
[]
[]
[]
[]
[]
[]
[]
[]
[]
[]
[]
[]
[]
[]
[]
[]
[]
[]
[]
[]
[]
[]
[]
[]
[]
[]
[]
[]
[]
[]
[]
[]
[]
[]
[]
[]
[]
[]
[]
[]
[]
[]
[]
[]
[]
[]
[]
[]
[]
[]
[]
[]
[]
[]
[]
[]
[]
[]
[]
[]
[]
[]
[]
[]
[]
[]
[]
[]
[]
[]
[]
[]
[]
[]
[]
[]
[]
[]
[]
[]
[]
[]
[]
[]
[]
[]
[]
[]
[]
[]
[]
[]
[]
[]
[]
[]
[]
[]
[]
[]
[]
[]
[]
[]
[]
[]
[]
[]
[]
[]
[]
[]
[]
[]
[]
[]
[]
[]
[]
[]
[]
[]
[]
[]
[]
[]
[]
[]
[]
[]
[]
[]
[]
[]
[]
[]
[]
[]
[]
[]
[]
[]
[]
[]
[]
[]
[]
[]
[]
[]
[]
[]
[]
[]
[]
[]
[]
[]
[]
[]
[]
[]
[]
[]
[]
[]
[]
[]
[]
[]
[]
[]
[]
[]
[]
[]
[]
[]
[]
[]
[]
[]
[]
[]
[]
[]
[]
[]
[]
[]
[]
[]
[]
[]
[]
[]
[]
[]
[]
[]
[]
[]
[]
[]
[]
[]
[]
[]
[]
[]
[]
[]
[]
[]
[]
[]
[]
[]
[]
[]
[]
[]
[]
[]
[]
[]
[]
[]
[]
[]
[]
[]
[]
[]
[]
[]
[]
[]
[]
[]
[]
[]
[]
[]
[]
[]
[]
[]
[]
[]
[]
[]
[]
[]
[]
[]
[]
[]
[]
[]
[]
[]
[]
[]
[]
[]
[]
[]
[]
[]
[]
[]
[]
[]
[]
[]
[]
[]
[]
[]
[]
[]
[]
[]
[]
[]
[]
[]
[]
[]
[]
[]
[]
[]
[]
[]
[]
[]
[]
[]
[]
[]
[]
[]
[]
[]
[]
[]
[]
[]
[]
[]
[]
[]
[]
[]
[]
[]
[]
[]
[]
[]
[]
[]
[]
[]
[]
[]
[]
[]
[]
[]
[]
[]
[]
[]
[]
[]
[]
[]
[]
[]
[]
[]
[]
[]
[]
[]
[]
[]
[]
[]
[]
[]
[]
[]
[]
[]
[]
[]
[]
[]
[]
[]
[]
[]
[]
[]
[]
[]
[]
[]
[]
[]
[]
[]
[]
[]
[]
[]
[]
[]
[]
[]
[]
[]
[]
[]
[]
[]
[]
[]
[]
[]
[]
[]
[]
[]
[]
[]
[]
[]
[]
[]
[]
[]
[]
[]
[]
[]
[]
[]
[]
[]
[]
[]
[]
[]
[]
[]
[]
[]
[]
[]
[]
[]
[]
[]
[]
[]
[]
[]
[]
[]
[]
[]
[]
[]
[]
[]
[]
[]
[]
[]
[]
[]
[]
[]
[]
[]
[]
[]
[]
[]
[]
[]
[]
[]
[]
[]
[]
[]
[]
[]
[]
[]
[]
[]
[]
[]
[]
[]
[]
[]
[]
[]
[]
[]
[]
[]
[]
[]
[]
[]
[]
[]
[]
[]
[]
[]
[]
[]
[]
[]
[]
[]
[]
[]
[]
[]
[]
[]
[]
[]
[]
[]
[]
[]
[]
[]
[]
[]
[]
[]
[]
[]
[]
[]
[]
[]
[]
[]
[]
[]
[]
[]
[]
[]
[]
[]
[]
[]
[]
[]
[]
[]
[]
[]
[]
[]
[]
[]
[]
[]
[]
[]
[]
[]
[]
[]
[]
[]
[]
[]
[]
[]
[]
[]
[]
[]
[]
[]
[]
[]
[]
[]
[]
[]
[]
[]
[]
[]
[]
[]
[]
[]
[]
[]
[]
[]
[]
[]
[]
[]
[]
[]
[]
[]
[]
[]
[]
[]
[]
[]
[]
[]
[]
[]
[]
[]
[]
[]
[]
[]
[]
[]
[]
[]
[]
[]
[]
[]
[]
[]
[]
[]
[]
[]
[]
[]
[]
[]
[]
[]
[]
[]
[]
[]
[]
[]
[]
[]
[]
[]
[]
[]
[]
[]
[]
[]
[]
[]
[]
[]
[]
[]
[]
[]
[]
[]
[]
[]
[]
[]
[]
[]
[]
[]
[]
[]
[]
[]
[]
[]
[]
[]
[]
[]
[]
[]
[]
[]
[]
[]
[]
[]
[]
[]
[]
[]
[]
[]
[]
[]
[]
[]
[]
[]
[]
[]
[]
[]
[]
[]
[]
[]
[]
[]
[]
[]
[]
[]
[]
[]
[]
[]
[]
[]
[]
[]
[]
[]
[]
[]
[]
[]
[]
[]
[]
[]
[]
[]
[]
[]
[]
[]
[]
[]
[]
[]
[]
[]
[]
[]
[]
[]
[]
[]
[]
[]
[]
[]
[]
[]
[]
[]
[]
[]
[]
[]
[]
[]
[]
[]
[]
[]
[]
[]
[]
[]
[]
[]
[]
[]
[]
[]
[]
[]
[]
[]
[]
[]
[]
[]
[]
[]
[]
[]
[]
[]
[]
[]
[]
[]
[]
[]
[]
[]
[]
[]
[]
[]
[]
[]
[]
[]
[]
[]
[]
[]
[]
[]
[]
[]
[]
[]
[]
[]
[]
[]
[]
[]
[]
[]
[]
[]
[]
[]
[]
[]
[]
[]
[]
[]
[]
[]
[]
[]
[]
[]
[]
[]
[]
[]
[]
[]
[]
[]
[]
[]
[]
[]
[]
[]
[]
[]
[]
[]
[]
[]
[]
[]
[]
[]
[]
[]
[]
[]
[]
[]
[]
[]
[]
[]
[]
[]
[]
[]
[]
[]
[]
[]
[]
[]
[]
[]
[]
[]
[]
[]
[]
[]
[]
[]
[]
[]
[]
[]
[]
[]
[]
[]
[]
[]
[]
[]
[]
[]
[]
[]
[]
[]
[]
[]
[]
[]
[]
[]
[]
[]
[]
[]
[]
[]
[]
[]
[]
[]
[]
[]
[]
[]
[]
[]
[]
[]
[]
[]
[]
[]
[]
[]
[]
[]
[]
[]
[]
[]
[]
[]
[]
[]
[]
[]
[]
[]
[]
[]
[]
[]
[]
[]
[]
[]
[]
[]
[]
[]
[]
[]
[]
[]
[]
[]
[]
[]
[]
[]
[]
[]
[]
[]
[]
[]
[]
[]
[]
[]
[]
[]
[]
[]
[]
[]
[]
[]
[]
[]
[]
[]
[]
[]
[]
[]
[]
[]
[]
[]
[]
[]
[]
[]
[]
[]
[]
[]
[]
[]
[]
[]
[]
[]
[]
[]
[]
[]
[]
[]
[]
[]
[]
[]
[]
[]
[]
[]
[]
[]
[]
[]
[]
[]
[]
[]
[]
[]
[]
[]
[]
[]
[]
[]
[]
[]
[]
[]
[]
[]
[]
[]
[]
[]
[]
[]
[]
[]
[]
[]
[]
[]
[]
[]
[]
[]
[]
[]
[]
[]
[]
[]
[]
[]
[]
[]
[]
[]
[]
[]
[]
[]
[]
[]
[]
[]
[]
[]
[]
[]
[]
[]
[]
[]
[]
[]
[]
[]
[]
[]
[]
[]
[]
[]
[]
[]
[]
[]
[]
[]
[]
[]
[]
[]
[]
[]
[]
[]
[]
[]
[]
[]
[]
[]
[]
[]
[]
[]
[]
[]
[]
[]
[]
[]
[]
[]
[]
[]
[]
[]
[]
[]
[]
[]
[]
[]
[]
[]
[]
[]
[]
[]
[]
[]
[]
[]
[]
[]
[]
[]
[]
[]
[]
[]
[]
[]
[]
[]
[]
[]
[]
[]
[]
[]
[]
[]
[]
[]
[]
[]
[]
[]
[]
[]
[]
[]
[]
[]
[]
[]
[]
[]
[]
[]
[]
[]
[]
[]
[]
[]
[]
[]
[]
[]
[]
[]
[]
[]
[]
[]
[]
[]
[]
[]
[]
[]
[]
[]
[]
[]
[]
[]
[]
[]
[]
[]
[]
[]
[]
[]
[]
[]
[]
[]
[]
[]
[]
[]
[]
[]
[]
[]
[]
[]
[]
[]
[]
[]
[]
[]
[]
[]
[]
[]
[]
[]
[]
[]
[]
[]
[]
[]
[]
[]
[]
[]
[]
[]
[]
[]
[]
[]
[]
[]
[]
[]
[]
[]
[]
[]
[]
[]
[]
[]
[]
[]
[]
[]
[]
[]
[]
[]
[]
[]
[]
[]
[]
[]
[]
[]
[]
[]
[]
[]
[]
[]
[]
[]
[]
[]
[]
[]
[]
[]
[]
[]
[]
[]
[]
[]
[]
[]
[]
[]
[]
[]
[]
[]
[]
[]
[]
[]
[]
[]
[]
[]
[]
[]
[]
[]
[]
[]
[]
[]
[]
[]
[]
[]
[]
[]
[]
[]
[]
[]
[]
[]
[]
[]
[]
[]
[]
[]
[]
[]
[]
[]
[]
[]
[]
[]
[]
[]
[]
[]
[]
[]
[]
[]
[]
[]
[]
[]
[]
[]
[]
[]
[]
[]
[]
[]
[]
[]
[]
[]
[]
[]
[]
[]
[]
[]
[]
[]
[]
[]
[]
[]
[]
[]
[]
[]
[]
[]
[]
[]
[]
[]
[]
[]
[]
[]
[]
[]
[]
[]
[]
[]
[]
[]
[]
[]
[]
[]
[]
[]
[]
[]
[]
[]
[]
[]
[]
[]
[]
[]
[]
[]
[]
[]
[]
[]
[]
[]
[]
[]
[]
[]
[]
[]
[]
[]
[]
[]
[]
[]
[]
[]
[]
[]
[]
[]
[]
[]
[]
[]
[]
[]
[]
[]
[]
[]
[]
[]
[]
[]
[]
[]
[]
[]
[]
[]
[]
[]
[]
[]
[]
[]
[]
[]
[]
[]
[]
[]
[]
[]
[]
[]
[]
[]
[]
[]
[]
[]
[]
[]
[]
[]
[]
[]
[]
[]
[]
[]
[]
[]
[]
[]
[]
[]
[]
[]
[]
[]
[]
[]
[]
[]
[]
[]
[]
[]
[]
[]
[]
[]
[]
[]
[]
[]
[]
[]
[]
[]
[]
[]
[]
[]
[]
[]
[]
[]
[]
[]
[]
[]
[]
[]
[]
[]
[]
[]
[]
[]
[]
[]
[]
[]
[]
[]
[]
[]
[]
[]
[]
[]
[]
[]
[]
[]
[]
[]
[]
[]
[]
[]
[]
[]
[]
[]
[]
[]
[]
[]
[]
[]
[]
[]
[]
[]
[]
[]
[]
[]
[]
[]
[]
[]
[]
[]
[]
[]
[]
[]
[]
[]
[]
[]
[]
[]
[]
[]
[]
[]
[]
[]
[]
[]
[]
[]
[]
[]
[]
[]
[]
[]
[]
[]
[]
[]
[]
[]
[]
[]
[]
[]
[]
[]
[]
[]
[]
[]
[]
[]
[]
[]
[]
[]
[]
[]
[]
[]
[]
[]
[]
[]
[]
[]
[]
[]
[]
[]
[]
[]
[]
[]
[]
[]
[]
[]
[]
[]
[]
[]
[]
[]
[]
[]
[]
[]
[]
[]
[]
[null,{"$f":"IF(C9232=\"\",\"\",B9231+1)","v":""}]
[null,""]
[null,""]
[null,""]
[null,""]
[null,""]
[null,""]
[null,""]
[null,""]
[null,""]
[null,""]
[null,""]
[null,""]
[null,""]
[null,""]
[null,""]
[null,""]
[null,""]
[null,""]
[null,""]
[null,""]
[null,""]
[null,""]
[null,""]
[null,""]
[null,""]
[null,""]
[null,""]
[null,""]
[null,""]
[null,""]
[null,""]
[null,{"$f":"IF(C9264=\"\",\"\",B9263+1)","v":""}]
[null,""]
[null,""]
[null,""]
[null,""]
[null,""]
[null,""]
[null,""]
[null,""]
[null,""]
[null,""]
[null,""]
[null,""]
[null,""]
[null,""]
[null,""]
[null,""]
[null,""]
[null,""]
[null,""]
[null,""]
[null,""]
[null,""]
[null,""]
[null,""]
[null,""]
[null,""]
[null,""]
[null,""]
[null,""]
[null,""]
[null,""]
[null,{"$f":"IF(C9296=\"\",\"\",B9295+1)","v":""}]
[null,""]
[null,""]
[null,""]
[null,""]
[null,""]
[null,""]
[null,""]
[null,""]
[null,""]
[null,""]
[null,""]
[null,""]
[null,""]
[null,""]
[null,""]
[null,""]
[null,""]
[null,""]
[null,""]
[null,""]
[null,""]
[null,""]
[null,""]
[null,""]
[null,""]
[null,""]
[null,""]
[null,""]
[null,""]
[null,""]
[null,""]
[null,{"$f":"IF(C9328=\"\",\"\",B9327+1)","v":""}]
[null,""]
[null,""]
[null,""]
[null,""]
[null,""]
[null,""]
[null,""]
[null,""]
[null,""]
[null,""]
[null,""]
[null,""]
[null,""]
[null,""]
[null,""]
[null,""]
[null,""]
[null,""]
[null,""]
[null,""]
[null,""]
[null,""]
[null,""]
[null,""]
[null,""]
[null,""]
[null,""]
[null,""]
[null,""]
[null,""]
[null,""]
[null,{"$f":"IF(C9360=\"\",\"\",B9359+1)","v":""}]
[null,{"$f":"IF(#REF!=\"\",\"\",B9360+1)","v":{"$error":"#REF!"}}]
[null,{"$f":"IF(#REF!=\"\",\"\",B9361+1)","v":{"$error":"#REF!"}}]
[null,{"$f":"IF(#REF!=\"\",\"\",B9362+1)","v":{"$error":"#REF!"}}]
[null,{"$f":"IF(#REF!=\"\",\"\",B9363+1)","v":{"$error":"#REF!"}}]
[null,{"$f":"IF(#REF!=\"\",\"\",B9364+1)","v":{"$error":"#REF!"}}]
[null,{"$f":"IF(#REF!=\"\",\"\",B9365+1)","v":{"$error":"#REF!"}}]
[null,{"$f":"IF(#REF!=\"\",\"\",B9366+1)","v":{"$error":"#REF!"}}]
[null,{"$f":"IF(#REF!=\"\",\"\",B9367+1)","v":{"$error":"#REF!"}}]
[null,{"$f":"IF(#REF!=\"\",\"\",B9368+1)","v":{"$error":"#REF!"}}]
[null,{"$f":"IF(#REF!=\"\",\"\",B9369+1)","v":{"$error":"#REF!"}}]
[null,{"$f":"IF(#REF!=\"\",\"\",B9370+1)","v":{"$error":"#REF!"}}]
[null,{"$f":"IF(#REF!=\"\",\"\",B9371+1)","v":{"$error":"#REF!"}}]
[null,{"$f":"IF(#REF!=\"\",\"\",B9372+1)","v":{"$error":"#REF!"}}]
[null,{"$f":"IF(#REF!=\"\",\"\",B9373+1)","v":{"$error":"#REF!"}}]
[null,{"$f":"IF(#REF!=\"\",\"\",B9374+1)","v":{"$error":"#REF!"}}]
[null,{"$f":"IF(#REF!=\"\",\"\",B9375+1)","v":{"$error":"#REF!"}}]
[null,{"$f":"IF(#REF!=\"\",\"\",B9376+1)","v":{"$error":"#REF!"}}]
[null,{"$f":"IF(#REF!=\"\",\"\",B9377+1)","v":{"$error":"#REF!"}}]
[null,{"$f":"IF(#REF!=\"\",\"\",B9378+1)","v":{"$error":"#REF!"}}]
[null,{"$f":"IF(#REF!=\"\",\"\",B9379+1)","v":{"$error":"#REF!"}}]
[]
[]
[]
[]
[]
[]
[]
[]
[]
[]
[]
[]
[]
[]
[]
[]
[]
[]
[]
[]
[]
[]
[]
[]
[]
[]
[]
[]
[]
[]
[]
[]
[]
[]
[]
[]
[]
[]
[]
[]
[]
[]
[]
[]
[]
[]
[]
[]
[]
[]
[]
[]
[]
[]
[]
[]
[]
[]
[]
[]
[]
[]
[]
[]
[]
[]
[]
[]
[]
[]
[]
[]
[]
[]
[]
[]
[]
[]
[]
[]
[]
[]
[]
[]
[]
[]
[]
[]
[]
[]
[]
[]
[]
[]
[]
[]
[]
[]
[]
[]
[]
[]
[]
[]
[]
[]
[]
[]
[]
[]
[]
[]
[]
[]
[]
[]
[]
[]
[]
[]
[]
[]
[]
[]
[]
[]
[]
[]
[]
[]
[]
[]
[]
[]
[]
[]
[]
[]
[]
[]
[]
[]
[]
[]
[]
[]
[]
[]
[]
[]
[]
[]
[]
[]
[]
[]
[]
[]
[]
[]
[]
[]
[]
[]
[]
[]
[]
[]
[]
[]
[]
[]
[]
[]
[]
[]
[]
[]
[]
[]
[]
[]
[]
[]
[]
[]
[]
[]
[]
[]
[]
[]
[]
[]
[]
[]
[]
[]
[]
[]
[]
[]
[]
[]
[]
[]
[]
[]
[]
[]
[]
[]
[]
[]
[]
[]
[]
[]
[]
[]
[]
[]
[]
[]
[]
[]
[]
[]
[]
[]
[]
[]
[]
[]
[]
[]
[]
[]
[]
[]
[]
[]
[]
[]
[]
[]
[]
[]
[]
[]
[]
[]
[]
[]
[]
[]
[]
[]
[]
[]
[]
[]
[]
[]
[]
[]
[]
[]
[]
[]
[]
[]
[]
[]
[]
[]
[]
[]
[]
[]
[]
[]
[]
[]
[]
[]
[]
[]
[]
[]
[]
[]
[]
[]
[]
[]
[]
[]
[]
[]
[]
[]
[]
[]
[]
[]
[]
[]
[]
[]
[]
[]
[]
[]
[]
[]
[]
[]
[]
[]
[]
[]
[]
[]
[]
[]
[]
[]
[]
[]
[]
[]
[]
[]
[]
[]
[]
[]
[]
[]
[]
[]
[]
[]
[]
[]
[]
[]
[]
[]
[]
[]
[]
[]
[]
[]
[]
[]
[]
[]
[]
[]
[]
[]
[]
[]
[]
[]
[]
[]
[]
[]
[]
[]
[]
[]
[]
[]
[]
[]
[]
[]
[]
[]
[]
[]
[]
[]
[]
[]
[]
[]
[]
[]
[]
[]
[]
[]
[]
[]
[]
[]
[]
[]
[]
[]
[]
[]
[]
[]
[]
[]
[]
[]
[]
[]
[]
[]
[]
[]
[]
[]
[]
[]
[]
[]
[]
[]
[]
[]
[]
[]
[]
[]
[]
[]
[]
[]
[]
[]
[]
[]
[]
[]
[]
[]
[]
[]
[]
[]
[]
[]
[]
[]
[]
[]
[]
[]
[]
[]
[]
[]
[]
[]
[]
[]
[]
[]
[]
[]
[]
[]
[]
[]
[]
[]
[]
[]
[]
[]
[]
[]
[]
[]
[]
[]
[]
[]
[]
[]
[]
[]
[]
[]
[]
[]
[]
[]
[]
[]
[]
[]
[]
[]
[]
[]
[]
[]
[]
[]
[]
[]
[]
[]
[]
[]
[]
[]
[]
[]
[]
[]
[]
[]
[]
[]
[]
[]
[]
[]
[]
[]
[]
[]
[]
[]
[]
[]
[]
[]
[]
[]
[]
[]
[]
[]
[]
[]
[]
[]
[]
[]
[]
[]
[]
[]
[]
[]
[]
[]
[]
[]
[]
[]
[]
[]
[]
[]
[]
[]
[]
[]
[]
[]
[]
[]
[]
[]
[]
[]
[]
[]
[]
[]
[]
[]
[]
[]
[]
[]
[]
[]
[]
[]
[]
[]
[]
[]
[]
[]
[]
[]
[]
[]
[]
[]
[]
[]
[]
[]
[]
[]
[]
[]
[]
[]
[]
[]
[]
[]
[]
[]
[]
[]
[]
[]
[]
[]
[]
[]
[]
[]
[]
[]
[]
[]
[]
[]
[]
[]
[]
[]
[]
[]
[]
[]
[]
[]
[]
[]
[]
[]
[]
[]
[]
[]
[]
[]
[]
[]
[]
[]
[]
[]
[]
[]
[]
[]
[]
[]
[]
[]
[]
[]
[]
[]
[]
[]
[]
[]
[]
[]
[]
[]
[]
[]
[]
[]
[]
[]
[]
[]
[]
[]
[]
[]
[]
[]
[]
[]
[]
[]
[]
[]
[]
[]
[]
[]
[]
[]
[]
[]
[]
[]
[]
[]
[]
[]
[]
[]
[]
[]
[]
[]
[]
[]
[]
[]
[]
[]
[]
[]
[]
[]
[]
[]
[]
[]
[]
[]
[]
[]
[]
[]
[]
[]
[]
[]
[]
[]
[]
[]
[]
[]
[]
[]
[]
[]
[]
[]
[]
[]
[]
[]
[]
[]
[]
[]
[]
[]
[]
[]
[]
[]
[]
[]
[]
[]
[]
[]
[]
[]
[]
[]
[]
[]
[]
[]
[]
[]
[]
[]
[]
[]
[]
[]
[]
[]
[]
[]
[]
[]
[]
[]
[]
[]
[]
[]
[]
[]
[]
[]
[]
[]
[]
[]
[]
[]
[]
[]
[]
[]
[]
[]
[]
[]
[]
[]
[]
[]
[]
[]
[]
[]
[]
[]
[]
[]
[]
[]
[]
[]
[]
[]
[]
[]
[]
[]
[]
[]
[]
[]
[]
[]
[]
[]
[]
[]
[]
[]
[]
[]
[]
[]
[]
[]
[]
[]
[]
[]
[]
[]
[]
[]
[]
[]
[]
[]
[]
[]
[]
[]
[]
[]
[]
[]
[]
[]
[]
[]
[]
[]
[]
[]
[]
[]
[]
[]
[]
[]
[]
[]
[]
[]
[]
[]
[]
[]
[]
[]
[]
[]
[]
[]
[]
[]
[]
[]
[]
[]
[]
[]
[]
[]
[]
[]
[]
[]
[]
[]
[]
[]
[]
[]
[]
[]
[]
[]
[]
[]
[]
[]
[]
[]
[]
[]
[]
[]
[]
[]
[]
[]
[]
[]
[]
[]
[]
[]
[]
[]
[]
[]
[]
[]
[]
[]
[]
[]
[]
[]
[]
[]
[]
[]
[]
[]
[]
[]
[]
[]
[]
[]
[]
[]
[]
[]
[]
[]
[]
[]
[]
[]
[]
[]
[]
[]
[]
[]
[]
[]
[]
[]
[]
[]
[]
[]
[]
[]
[]
[]
[]
[]
[]
[]
[]
[]
[]
[]
[]
[]
[]
[]
[]
[]
[]
[]
[]
[]
[]
[]
[]
[]
[]
[]
[]
[]
[]
[]
[]
[]
[]
[]
[]
[]
[]
[]
[]
[]
[]
[]
[]
[]
[]
[]
[]
[]
[]
[]
[]
[]
[]
[]
[]
[]
[]
[]
[]
[]
[]
[]
[]
[]
[]
[]
[]
[]
[]
[]
[]
[]
[]
[]
[]
[]
[]
[]
[]
[]
[]
[]
[]
[]
[]
[]
[]
[]
[]
[]
[]
[]
[]
[]
[]
[]
[]
[]
[]
[]
[]
[]
[]
[]
[]
[]
[]
[]
[]
[]
[]
[]
[]
[]
[]
[]
[]
[]
[]
[]
[]
[]
[]
[]
[]
[]
[]
[]
[]
[]
[]
[]
[]
[]
[]
[]
[]
[]
[]
[]
[]
[]
[]
[]
[]
[]
[]
[]
[]
[]
[]
[]
[]
[]
[]
[]
[]
[]
[]
[]
[]
[]
[]
[]
[]
[]
[]
[]
[]
[]
[]
[]
[]
[]
[]
[]
[]
[]
[]
[]
[]
[]
[]
[]
[]
[]
[]
[]
[]
[]
[]
[]
[]
[]
[]
[]
[]
[]
[]
[]
[]
[]
[]
[]
[]
[]
[]
[]
[]
[]
[]
[]
[]
[]
[]
[]
[]
[]
[]
[]
[]
[]
[]
[]
[]
[]
[]
[]
[]
[]
[]
[]
[]
[]
[]
[]
[]
[]
[]
[]
[]
[]
[]
[]
[]
[]
[]
[]
[]
[]
[]
[]
[]
[]
[]
[]
[]
[]
[]
[]
[]
[]
[]
[]
[]
[]
[]
[]
[]
[]
[]
[]
[]
[]
[]
[]
[]
[]
[]
[]
[]
[]
[]
[]
[]
[]
[]
[]
[]
[]
[]
[]
[]
[]
[]
[]
[]
[]
[]
[]
[]
[]
[]
[]
[]
[]
[]
[]
[]
[]
[]
[]
[]
[]
[]
[]
[]
[]
[]
[]
[]
[]
[]
[]
[]
[]
[]
[]
[]
[]
[]
[]
[]
[]
[]
[]
[]
[]
[]
[]
[]
[]
[]
[]
[]
[]
[]
[]
[]
[]
[]
[]
[]
[]
[]
[]
[]
[]
[]
[]
[]
[]
[]
[]
[]
[]
[]
[]
[]
[]
[]
[]
[]
[]
[]
[]
[]
[]
[]
[]
[]
[]
[]
[]
[]
[]
[]
[]
[]
[]
[]
[]
[]
[]
[]
[]
[]
[]
[]
[]
[]
[]
[]
[]
[]
[]
[]
[]
[]
[]
[]
[]
[]
[]
[]
[]
[]
[]
[]
[]
[]
[]
[]
[]
[]
[]
[]
[]
[]
[]
[]
[]
[]
[]
[]
[]
[]
[]
[]
[]
[]
[]
[]
[]
[]
[]
[]
[]
[]
[]
[]
[]
[]
[]
[]
[]
[]
[]
[]
[]
[]
[]
[]
[]
[]
[]
[]
[]
[]
[]
[]
[]
[]
[]
[]
[]
[]
[]
[]
[]
[]
[]
[]
[]
[]
[]
[]
[]
[]
[]
[]
[]
[]
[]
[]
[]
[]
[]
[]
[]
[]
[]
[]
[]
[]
[]
[]
[]
[]
[]
[]
[]
[]
[]
[]
[]
[]
[]
[]
[]
[]
[]
[]
[]
[]
[]
[]
[]
[]
[]
[]
[]
[]
[]
[]
[]
[]
[]
[]
[]
[]
[]
[]
[]
[]
[]
[]
[]
[]
[]
[]
[]
[]
[]
[]
[]
[]
[]
[]
[]
[]
[]
[]
[]
[]
[]
[]
[]
[]
[]
[]
[]
[]
[]
[]
[]
[]
[]
[]
[]
[]
[]
[]
[]
[]
[]
[]
[]
[]
[]
[]
[]
[]
[]
[]
[]
[]
[]
[]
[]
[]
[]
[]
[]
[]
[]
[]
[]
[]
[]
[]
[]
[]
[]
[]
[]
[]
[]
[]
[]
[]
[]
[]
[]
[]
[]
[]
[]
[]
[]
[]
[]
[]
[]
[]
[]
[]
[]
[]
[]
[]
[]
[]
[]
[]
[]
[]
[]
[]
[]
[]
[]
[]
[]
[]
[]
[]
[]
[]
[]
[]
[]
[]
[]
[]
[]
[]
[]
[]
[]
[]
[]
[]
[]
[]
[]
[]
[]
[]
[]
[]
[]
[]
[]
[]
[]
[]
[]
[]
[]
[]
[]
[]
[]
[]
[]
[]
[]
[]
[]
[]
[]
[]
[]
[]
[]
[]
[]
[]
[]
[]
[]
[]
[]
[]
[]
[]
[]
[]
[]
[]
[]
[]
[]
[]
[]
[]
[]
[]
[]
[]
[]
[]
[]
[]
[]
[]
[]
[]
[]
[]
[]
[]
[]
[]
[]
[]
[]
[]
[]
[]
[]
[]
[]
[]
[]
[]
[]
[]
[]
[]
[]
[]
[]
[]
[]
[]
[]
[]
[]
[]
[]
[]
[]
[]
[]
[]
[]
[]
[]
[]
[]
[]
[]
[]
[]
[]
[]
[]
[]
[]
[]
[]
[]
[]
[]
[]
[]
[]
[]
[]
[]
[]
[]
[]
[]
[]
[]
[]
[]
[]
[]
[]
[]
[]
[]
[]
[]
[]
[]
[]
[]
[]
[]
[]
[]
[]
[]
[]
[]
[]
[]
[]
[]
[]
[]
[]
[]
[]
[]
[]
[]
[]
[]
[]
[]
[]
[]
[]
[]
[]
[]
[]
[]
[]
[]
[]
[]
[]
[]
[]
[]
[]
[]
[]
[]
[]
[]
[]
[]
[]
[]
[]
[]
[]
[]
[]
[]
[]
[]
[]
[]
[]
[]
[]
[]
[]
[]
[]
[]
[]
[]
[]
[]
[]
[]
[]
[]
[]
[]
[]
[]
[]
[]
[]
[]
[]
[]
[]
[]
[]
[]
[]
[]
[]
[]
[]
[]
[]
[]
[]
[]
[]
[]
[]
[]
[]
[]
[]
[]
[]
[]
[]
[]
[]
[]
[]
[]
[]
[]
[]
[]
[]
[]
[]
[]
[]
[]
[]
[]
[]
[]
[]
[]
[]
[]
[]
[]
[]
[]
[]
[]
[]
[]
[]
[]
[]
[]
[]
[]
[]
[]
[]
[]
[]
[]
[]
[]
[]
[]
[]
[]
[]
[]
[]
[]
[]
[]
[]
[]
[]
[]
[]
[]
[]
[]
[]
[]
[]
[]
[]
[]
[]
[]
[]
[]
[]
[]
[]
[]
[]
[]
[]
[]
[]
[]
[]
[]
[]
[]
[]
[]
[]
[]
[]
[]
[]
[]
[]
[]
[]
[]
[]
[]
[]
[]
[]
[]
[]
[]
[]
[]
[]
[]
[]
[]
[]
[]
[]
[]
[]
[]
[]
[]
[]
[]
[]
[]
[]
[]
[]
[]
[]
[]
[]
[]
[]
[]
[]
[]
[]
[]
[]
[]
[]
[]
[]
[]
[]
[]
[]
[]
[]
[]
[]
[]
[]
[]
[]
[]
[]
[]
[]
[]
[]
[]
[]
[]
[]
[]
[]
[]
[]
[]
[]
[]
[]
[]
[]
[]
[]
[]
[]
[]
[]
[]
[]
[]
[]
[]
[]
[]
[]
[]
[]
[]
[]
[]
[]
[]
[]
[]
[]
[]
[]
[]
[]
[]
[]
[]
[]
[]
[]
[]
[]
[]
[]
[]
[]
[]
[]
[]
[]
[]
[]
[]
[]
[]
[]
[]
[]
[]
[]
[]
[]
[]
[]
[]
[]
[]
[]
[]
[]
[]
[]
[]
[]
[]
[]
[]
[]
[]
[]
[]
[]
[]
[]
[]
[]
[]
[]
[]
[]
[]
[]
[]
[]
[]
[]
[]
[]
[]
[]
[]
[]
[]
[]
[]
[]
[]
[]
[]
[]
[]
[]
[]
[]
[]
[]
[]
[]
[]
[]
[]
[]
[]
[]
[]
[]
[]
[]
[]
[]
[]
[]
[]
[]
[]
[]
[]
[]
[]
[]
[]
[]
[]
[]
[]
[]
[]
[]
[]
[]
[]
[]
[]
[]
[]
[]
[]
[]
[]
[]
[]
[]
[]
[]
[]
[]
[]
[]
[]
[]
[]
[]
[]
[]
[]
[]
[]
[]
[]
[]
[]
[]
[]
[]
[]
[]
[]
[]
[]
[]
[]
[]
[]
[]
[]
[]
[]
[]
[]
[]
[]
[]
[]
[]
[]
[]
[]
[]
[]
[]
[]
[]
[]
[]
[]
[]
[]
[]
[]
[]
[]
[]
[]
[]
[]
[]
[]
[]
[]
[]
[]
[]
[]
[]
[]
[]
[]
[]
[]
[]
[]
[]
[]
[]
[]
[]
[]
[]
[]
[]
[]
[]
[]
[]
[]
[]
[]
[]
[]
[]
[]
[]
[]
[]
[]
[]
[]
[]
[]
[]
[]
[]
[]
[]
[]
[]
[]
[]
[]
[]
[]
[]
[]
[]
[]
[]
[]
[]
[]
[]
[]
[]
[]
[]
[]
[]
[]
[]
[]
[]
[]
[]
[]
[]
[]
[]
[]
[]
[]
[]
[]
[]
[]
[]
[]
[]
[]
[]
[]
[]
[]
[]
[]
[]
[]
[]
[]
[]
[]
[]
[]
[]
[]
[]
[]
[]
[]
[]
[]
[]
[]
[]
[]
[]
[]
[]
[]
[]
[]
[]
[]
[]
[]
[]
[]
[]
[]
[]
[]
[]
[]
[]
[]
[]
[]
[]
[]
[]
[]
[]
[]
[]
[]
[]
[]
[]
[]
[]
[]
[]
[]
[]
[]
[]
[]
[]
[]
[]
[]
[]
[]
[]
[]
[]
[]
[]
[]
[]
[]
[]
[]
[]
[]
[]
[]
[]
[]
[]
[]
[]
[]
[]
[]
[]
[]
[]
[]
[]
[]
[]
[]
[]
[]
[]
[]
[]
[]
[]
[]
[]
[]
[]
[]
[]
[]
[]
[]
[]
[]
[]
[]
[]
[]
[]
[]
[]
[]
[]
[]
[]
[]
[]
[]
[]
[]
[]
[]
[]
[]
[]
[]
[]
[]
[]
[]
[]
[]
[]
[]
[]
[]
[]
[]
[]
[]
[]
[]
[]
[]
[]
[]
[]
[]
[]
[]
[]
[]
[]
[]
[]
[]
[]
[]
[]
[]
[]
[]
[]
[]
[]
[]
[]
[]
[]
[]
[]
[]
[]
[]
[]
[]
[]
[]
[]
[]
[]
[]
[]
[]
[]
[]
[]
[]
[]
[]
[]
[]
[]
[]
[]
[]
[]
[]
[]
[]
[]
[]
[]
[]
[]
[]
[]
[]
[]
[]
[]
[]
[]
[]
[]
[]
[]
[]
[]
[]
[]
[]
[]
[]
[]
[]
[]
[]
[]
[]
[]
[]
[]
[]
[]
[]
[]
[]
[]
[]
[]
[]
[]
[]
[]
[]
[]
[]
[]
[]
[]
[]
[]
[]
[]
[]
[]
[]
[]
[]
[]
[]
[]
[]
[]
[]
[]
[]
[]
[]
[]
[]
[]
[]
[]
[]
[]
[]
[]
[]
[]
[]
[]
[]
[]
[]
[]
[]
[]
[]
[]
[]
[]
[]
[]
[]
[]
[]
[]
[]
[]
[]
[]
[]
[]
[]
[]
[]
[]
[]
[]
[]
[]
[]
[]
[]
[]
[]
[]
[]
[]
[]
[]
[]
[]
[]
[]
[]
[]
[]
[]
[]
[]
[]
[]
[]
[]
[]
[]
[]
[]
[]
[]
[]
[]
[]
[]
[]
[]
[]
[]
[]
[]
[]
[]
[]
[]
[]
[]
[]
[]
[]
[]
[]
[]
[]
[]
[]
[]
[null,{"$f":"IF(C12196=\"\",\"\",B12195+1)","v":""}]
[null,""]
[null,""]
[null,""]
[null,""]
[null,""]
[null,""]
[null,""]
[null,""]
[null,""]
[null,""]
[null,""]
[null,""]
[null,""]
[null,""]
[null,""]
[null,""]
[null,""]
[null,""]
[null,""]
[null,""]
[null,""]
[null,""]
[null,""]
[null,""]
[null,""]
[null,""]
[null,""]
[null,""]
[null,""]
[null,""]
[null,""]
[null,{"$f":"IF(C12228=\"\",\"\",B12227+1)","v":""}]
[null,""]
[null,""]
[null,""]
[null,""]
[null,""]
[null,""]
[null,""]
[null,""]
[null,""]
[null,""]
[null,""]
[null,""]
[null,""]
[null,""]
[null,""]
[null,""]
[null,""]
[null,""]
[null,""]
[null,""]
[null,""]
[null,""]
[null,""]
[null,""]
[null,""]
[null,""]
[null,""]
[null,""]
[null,""]
[null,""]
[null,""]
[null,{"$f":"IF(C12260=\"\",\"\",B12259+1)","v":""}]
[null,""]
[null,""]
[null,""]
[null,""]
[null,""]
[null,""]
[]
[]
[]
[null,{"$f":"IF(#REF!=\"\",\"\",B12269+1)","v":{"$error":"#REF!"}}]
[null,{"$f":"IF(#REF!=\"\",\"\",B12270+1)","v":{"$error":"#REF!"}}]
[null,{"$f":"IF(#REF!=\"\",\"\",B12271+1)","v":{"$error":"#REF!"}}]
[null,{"$f":"IF(#REF!=\"\",\"\",B12272+1)","v":{"$error":"#REF!"}}]
[null,{"$f":"IF(#REF!=\"\",\"\",B12273+1)","v":{"$error":"#REF!"}}]
[null,{"$f":"IF(#REF!=\"\",\"\",B12274+1)","v":{"$error":"#REF!"}}]
[null,{"$f":"IF(#REF!=\"\",\"\",B12275+1)","v":{"$error":"#REF!"}}]
[null,{"$f":"IF(#REF!=\"\",\"\",B12276+1)","v":{"$error":"#REF!"}}]
[null,{"$f":"IF(#REF!=\"\",\"\",B12277+1)","v":{"$error":"#REF!"}}]
[null,{"$f":"IF(#REF!=\"\",\"\",B12278+1)","v":{"$error":"#REF!"}}]
[]
[]
[]
[]
[]
[]
[]
[]
[]
[]
[]
[]
[]
[]
[]
[]
[]
[]
[]
[]
[]
[]
[]
[]
[]
[]
[]
[]
[]
[]
[]
[]
[]
[]
[]
[]
[]
[]
[]
[]
[]
[]
[]
[]
[]
[]
[]
[]
[]
[]
[]
[]
[]
[]
[]
[]
[]
[]
[]
[]
[]
[]
[]
[]
[]
[]
[]
[]
[]
[]
[]
[]
[]
[]
[]
[]
[]
[]
[]
[]
[]
[]
[]
[]
[]
[]
[]
[]
[]
[]
[]
[]
[]
[]
[]
[]
[]
[]
[]
[]
[]
[]
[]
[]
[]
[]
[]
[]
[]
[]
[]
[]
[]
[]
[]
[]
[]
[]
[]
[]
[]
[]
[]
[]
[]
[]
[]
[]
[]
[]
[]
[]
[]
[]
[]
[]
[]
[]
[]
[]
[]
[]
[]
[]
[]
[]
[]
[]
[]
[]
[]
[]
[]
[]
[]
[]
[]
[]
[]
[]
[]
[]
[]
[]
[]
[]
[]
[]
[]
[]
[]
[]
[]
[]
[]
[]
[]
[]
[]
[]
[]
[]
[]
[]
[]
[]
[]
[]
[]
[]
[]
[]
[]
[]
[]
[]
[]
[]
[]
[]
[]
[]
[]
[]
[]
[]
[]
[]
[]
[]
[]
[]
[]
[]
[]
[]
[]
[]
[]
[]
[]
[]
[]
[]
[]
[]
[]
[]
[]
[]
[]
[]
[]
[]
[]
[]
[]
[]
[]
[]
[]
[]
[]
[]
[]
[]
[]
[]
[]
[]
[]
[]
[]
[]
[]
[]
[]
[]
[]
[]
[]
[]
[]
[]
[]
[]
[]
[]
[]
[]
[]
[]
[]
[]
[]
[]
[]
[]
[]
[]
[]
[]
[]
[]
[]
[]
[]
[]
[]
[]
[]
[]
[]
[]
[]
[]
[]
[]
[]
[]
[]
[]
[]
[]
[]
[]
[]
[]
[]
[]
[]
[]
[]
[]
[]
[]
[]
[]
[]
[]
[]
[]
[]
[]
[]
[]
[]
[]
[]
[]
[]
[]
[]
[]
[]
[]
[]
[]
[]
[]
[]
[]
[]
[]
[]
[]
[]
[]
[]
[]
[]
[]
[]
[]
[]
[]
[]
[]
[]
[]
[]
[]
[]
[]
[]
[]
[]
[]
[]
[]
[]
[]
[]
[]
[]
[]
[]
[]
[]
[]
[]
[]
[]
[]
[]
[]
[]
[]
[]
[]
[]
[]
[]
[]
[]
[]
[]
[]
[]
[]
[]
[]
[]
[]
[]
[]
[]
[]
[]
[]
[]
[]
[]
[]
[]
[]
[]
[]
[]
[]
[]
[]
[]
[]
[]
[]
[]
[]
[]
[]
[]
[]
[]
[]
[]
[]
[]
[]
[]
[]
[]
[]
[]
[]
[]
[]
[]
[]
[]
[]
[]
[]
[]
[]
[]
[]
[]
[]
[]
[]
[]
[]
[]
[]
[]
[]
[]
[]
[]
[]
[]
[]
[]
[]
[]
[]
[]
[]
[]
[]
[]
[]
[]
[]
[]
[]
[]
[]
[]
[]
[]
[]
[]
[]
[]
[]
[]
[]
[]
[]
[]
[]
[]
[]
[]
[]
[]
[]
[]
[]
[]
[]
[]
[]
[]
[]
[]
[]
[]
[]
[]
[]
[]
[]
[]
[]
[]
[]
[]
[]
[]
[]
[]
[]
[]
[]
[]
[]
[]
[]
[]
[]
[]
[]
[]
[]
[]
[]
[]
[]
[]
[]
[]
[]
[]
[]
[]
[]
[]
[]
[]
[]
[]
[]
[]
[]
[]
[]
[]
[]
[]
[]
[]
[]
[]
[]
[]
[]
[]
[]
[]
[]
[]
[]
[]
[]
[]
[]
[]
[]
[]
[]
[]
[]
[]
[]
[]
[]
[]
[]
[]
[]
[]
[]
[]
[]
[]
[]
[]
[]
[]
[]
[]
[]
[]
[]
[]
[]
[]
[]
[]
[]
[]
[]
[]
[]
[]
[]
[]
[]
[]
[]
[]
[]
[]
[]
[]
[]
[]
[]
[]
[]
[]
[]
[]
[]
[]
[]
[]
[]
[]
[]
[]
[]
[]
[]
[]
[]
[]
[]
[]
[]
[]
[]
[]
[]
[]
[]
[]
[]
[]
[]
[]
[]
[]
[]
[]
[]
[]
[]
[]
[]
[]
[]
[]
[]
[]
[]
[]
[]
[]
[]
[]
[]
[]
[]
[]
[]
[]
[]
[]
[]
[]
[]
[]
[]
[]
[]
[]
[]
[]
[]
[]
[]
[]
[]
[]
[]
[]
[]
[]
[]
[]
[]
[]
[]
[]
[]
[]
[]
[]
[]
[]
[]
[]
[]
[]
[]
[]
[]
[]
[]
[]
[]
[]
[]
[]
[]
[]
[]
[]
[]
[]
[]
[]
[]
[]
[]
[]
[]
[]
[]
[]
[]
[]
[]
[]
[]
[]
[]
[]
[]
[]
[]
[]
[]
[]
[]
[]
[]
[]
[]
[]
[]
[]
[]
[]
[]
[]
[]
[]
[]
[]
[]
[]
[]
[]
[]
[]
[]
[]
[]
[]
[]
[]
[]
[]
[]
[]
[]
[]
[]
[]
[]
[]
[]
[]
[]
[]
[]
[]
[]
[]
[]
[]
[]
[]
[]
[]
[]
[]
[]
[]
[]
[]
[]
[]
[]
[]
[]
[]
[]
[]
[]
[]
[]
[]
[]
[]
[]
[]
[]
[]
[]
[]
[]
[]
[]
[]
[]
[]
[]
[]
[]
[]
[]
[]
[]
[]
[]
[]
[]
[]
[]
[]
[]
[]
[]
[]
[]
[]
[]
[]
[]
[]
[]
[]
[]
[]
[]
[]
[]
[]
[]
[]
[]
[]
[]
[]
[]
[]
[]
[]
[]
[]
[]
[]
[]
[]
[]
[]
[]
[]
[]
[]
[]
[]
[]
[]
[]
[]
[]
[]
[]
[]
[]
[]
[]
[]
[]
[]
[]
[]
[]
[]
[]
[]
[]
[]
[]
[]
[]
[]
[]
[]
[]
[]
[]
[]
[]
[]
[]
[]
[]
[]
[]
[]
[]
[]
[]
[]
[]
[]
[]
[]
[]
[]
[]
[]
[]
[]
[]
[]
[]
[]
[]
[]
[]
[]
[]
[]
[]
[]
[]
[]
[]
[]
[]
[]
[]
[]
[]
[]
[]
[]
[]
[]
[]
[]
[]
[]
[]
[]
[]
[]
[]
[]
[]
[]
[]
[]
[]
[]
[]
[]
[]
[]
[]
[]
[]
[]
[]
[]
[]
[]
[]
[]
[]
[]
[]
[]
[]
[]
[]
[]
[]
[]
[]
[]
[]
[]
[]
[]
[]
[]
[]
[]
[]
[]
[]
[]
[]
[]
[]
[]
[]
[]
[]
[]
[]
[]
[]
[]
[]
[]
[]
[]
[]
[]
[]
[]
[]
[]
[]
[]
[]
[]
[]
[]
[]
[]
[]
[]
[]
[]
[]
[]
[]
[]
[]
[]
[]
[]
[]
[]
[]
[]
[]
[]
[]
[]
[]
[]
[]
[]
[]
[]
[]
[]
[]
[]
[]
[]
[]
[]
[]
[]
[]
[]
[]
[]
[]
[]
[]
[]
[]
[]
[]
[]
[]
[]
[]
[]
[]
[]
[]
[]
[]
[]
[]
[]
[]
[]
[]
[]
[]
[]
[]
[]
[]
[]
[]
[]
[]
[]
[]
[]
[]
[]
[]
[]
[]
[]
[]
[]
[]
[]
[]
[]
[]
[]
[]
[]
[]
[]
[]
[]
[]
[]
[]
[]
[]
[]
[]
[]
[]
[]
[]
[]
[]
[]
[]
[]
[]
[]
[]
[]
[]
[]
[]
[]
[]
[]
[]
[]
[]
[]
[]
[]
[]
[]
[]
[]
[]
[]
[]
[]
[]
[]
[]
[]
[]
[]
[]
[]
[]
[]
[]
[]
[]
[]
[]
[]
[]
[]
[]
[]
[]
[]
[]
[]
[]
[]
[]
[]
[]
[]
[]
[]
[]
[]
[]
[]
[]
[]
[]
[]
[]
[]
[]
[]
[]
[]
[]
[]
[]
[]
[]
[]
[]
[]
[]
[]
[]
[]
[]
[]
[]
[]
[]
[]
[]
[]
[]
[]
[]
[]
[]
[]
[]
[]
[]
[]
[]
[]
[]
[]
[]
[]
[]
[]
[]
[]
[]
[]
[]
[]
[]
[]
[]
[]
[]
[]
[]
[]
[]
[]
[]
[]
[]
[]
[]
[]
[]
[]
[]
[]
[]
[]
[]
[]
[]
[]
[]
[]
[]
[]
[]
[]
[]
[]
[]
[]
[]
[]
[]
[]
[]
[]
[]
[]
[]
[]
[]
[]
[]
[]
[]
[]
[]
[]
[]
[]
[]
[]
[]
[]
[]
[]
[]
[]
[]
[]
[]
[]
[]
[]
[]
[]
[]
[]
[]
[]
[]
[]
[]
[]
[]
[]
[]
[]
[]
[]
[]
[]
[]
[]
[]
[]
[]
[]
[]
[]
[]
[]
[]
[]
[]
[]
[]
[]
[]
[]
[]
[]
[]
[]
[]
[]
[]
[]
[]
[]
[]
[]
[]
[]
[]
[]
[]
[]
[]
[]
[]
[]
[]
[]
[]
[]
[]
[]
[]
[]
[]
[]
[]
[]
[]
[]
[]
[]
[]
[]
[]
[]
[]
[]
[]
[]
[]
[]
[]
[]
[]
[]
[]
[]
[]
[]
[]
[]
[]
[]
[]
[]
[]
[]
[]
[]
[]
[]
[]
[]
[]
[]
[]
[]
[]
[]
[]
[]
[]
[]
[]
[]
[]
[]
[]
[]
[]
[]
[]
[]
[]
[]
[]
[]
[]
[]
[]
[]
[]
[]
[]
[]
[]
[]
[]
[]
[]
[]
[]
[]
[]
[]
[]
[]
[]
[]
[]
[]
[]
[]
[]
[]
[]
[]
[]
[]
[]
[]
[]
[]
[]
[]
[]
[]
[]
[]
[]
[]
[]
[]
[]
[]
[]
[]
[]
[]
[]
[]
[]
[]
[]
[]
[]
[]
[]
[]
[]
[]
[]
[]
[]
[]
[]
[]
[]
[]
[]
[]
[]
[]
[]
[]
[]
[]
[]
[]
[]
[]
[]
[]
[]
[]
[]
[]
[]
[]
[]
[]
[]
[]
[]
[]
[]
[]
[]
[]
[]
[]
[]
[]
[]
[]
[]
[]
[]
[]
[]
[]
[]
[]
[]
[]
[]
[]
[]
[]
[]
[]
[]
[]
[]
[]
[]
[]
[]
[]
[]
[]
[]
[]
[]
[]
[]
[]
[]
[]
[]
[]
[]
[]
[]
[]
[]
[]
[]
[]
[]
[]
[]
[]
[]
[]
[]
[]
[]
[]
[]
[]
[]
[]
[]
[]
[]
[]
[]
[]
[]
[]
[]
[]
[]
[]
[]
[]
[]
[]
[]
[]
[]
[]
[]
[]
[]
[]
[]
[]
[]
[]
[]
[]
[]
[]
[]
[]
[]
[]
[]
[]
[]
[]
[]
[]
[]
[]
[]
[]
[]
[]
[]
[]
[]
[]
[]
[]
[]
[]
[]
[]
[]
[]
[]
[]
[]
[]
[]
[]
[]
[]
[]
[]
[]
[]
[]
[]
[]
[]
[]
[]
[]
[]
[]
[]
[]
[]
[]
[]
[]
[]
[]
[]
[]
[]
[]
[]
[]
[]
[]
[]
[]
[]
[]
[]
[]
[]
[]
[]
[]
[]
[]
[]
[]
[]
[]
[]
[]
[]
[]
[]
[]
[]
[]
[]
[]
[]
[]
[]
[]
[]
[]
[]
[]
[]
[]
[]
[]
[]
[]
[]
[]
[]
[]
[]
[]
[]
[]
[]
[]
[]
[]
[]
[]
[]
[]
[]
[]
[]
[]
[]
[]
[]
[]
[]
[]
[]
[]
[]
[]
[]
[]
[]
[]
[]
[]
[]
[]
[]
[]
[]
[]
[]
[]
[]
[]
[]
[]
[]
[]
[]
[]
[]
[]
[]
[]
[]
[]
[]
[]
[]
[]
[]
[]
[]
[]
[]
[]
[]
[]
[]
[]
[]
[]
[]
[]
[]
[]
[]
[]
[]
[]
[]
[]
[]
[]
[]
[]
[]
[null,{"$f":"IF(C14179=\"\",\"\",B14178+1)","v":""}]
[null,""]
[null,""]
[null,""]
[null,""]
[null,""]
[null,""]
[null,""]
[null,""]
[null,""]
[null,""]
[null,""]
[null,""]
[null,""]
[null,""]
[null,""]
[null,""]
[null,""]
[null,""]
[null,""]
[null,""]
[null,""]
[]
[null,{"$f":"IF(#REF!=\"\",\"\",B14201+1)","v":{"$error":"#REF!"}}]
[null,{"$f":"IF(#REF!=\"\",\"\",B14202+1)","v":{"$error":"#REF!"}}]
[]
[]
[]
[]
[]
[]
[]
[]
[]
[]
[]
[]
[]
[]
[]
[]
[]
[]
[]
[]
[]
[]
[]
[]
[]
[]
[]
[]
[]
[]
[]
[]
[]
[]
[]
[]
[]
[]
[]
[]
[]
[]
[]
[]
[]
[]
[]
[]
[]
[]
[]
[]
[]
[]
[]
[]
[]
[]
[]
[]
[]
[]
[]
[]
[]
[]
[]
[]
[]
[]
[]
[]
[]
[]
[]
[]
[]
[]
[]
[]
[]
[]
[]
[]
[]
[]
[]
[]
[]
[]
[]
[]
[]
[]
[]
[]
[]
[]
[]
[]
[]
[]
[]
[]
[]
[]
[]
[]
[]
[]
[]
[]
[]
[]
[]
[]
[]
[]
[]
[]
[]
[]
[]
[]
[]
[]
[]
[]
[]
[]
[]
[]
[]
[]
[]
[]
[]
[]
[]
[]
[]
[]
[]
[]
[]
[]
[]
[]
[]
[]
[]
[]
[]
[]
[]
[]
[]
[]
[]
[]
[]
[]
[]
[]
[]
[]
[]
[]
[]
[]
[]
[]
[]
[]
[]
[]
[]
[]
[]
[]
[]
[]
[]
[]
[]
[]
[]
[]
[]
[]
[]
[]
[]
[]
[]
[]
[]
[]
[]
[]
[]
[]
[]
[]
[]
[]
[]
[]
[]
[]
[]
[]
[]
[]
[]
[]
[]
[]
[]
[]
[]
[]
[]
[]
[]
[]
[]
[]
[]
[]
[]
[]
[]
[]
[]
[]
[]
[]
[]
[]
[]
[]
[]
[]
[]
[]
[]
[]
[]
[]
[]
[]
[]
[]
[]
[]
[]
[]
[]
[]
[]
[]
[]
[]
[]
[]
[]
[]
[]
[]
[]
[]
[]
[]
[]
[]
[]
[]
[]
[]
[]
[]
[]
[]
[]
[]
[]
[]
[]
[]
[]
[]
[]
[]
[]
[]
[]
[]
[]
[]
[]
[]
[]
[]
[]
[]
[]
[]
[]
[]
[]
[]
[]
[]
[]
[]
[]
[]
[]
[]
[]
[]
[]
[]
[]
[]
[]
[]
[]
[]
[]
[]
[]
[]
[]
[]
[]
[]
[]
[]
[]
[]
[]
[]
[]
[]
[]
[]
[]
[]
[]
[]
[]
[]
[]
[]
[]
[]
[]
[]
[]
[]
[]
[]
[]
[]
[]
[]
[]
[]
[]
[]
[]
[]
[]
[]
[]
[]
[]
[]
[]
[]
[]
[]
[]
[]
[]
[]
[]
[]
[]
[]
[]
[]
[]
[]
[]
[]
[]
[]
[]
[]
[]
[]
[]
[]
[]
[]
[]
[]
[]
[]
[]
[]
[]
[]
[]
[]
[]
[]
[]
[]
[]
[]
[]
[]
[]
[]
[]
[]
[]
[]
[]
[]
[]
[]
[]
[]
[]
[]
[]
[]
[]
[]
[]
[]
[]
[]
[null,{"$f":"IF(C14652=\"\",\"\",B14651+1)","v":""}]
[null,{"$f":"IF(C14653=\"\",\"\",B14652+1)","v":""}]
[null,{"$f":"IF(C14641=\"\",\"\",B14653+1)","v":""}]
[null,{"$f":"IF(C14642=\"\",\"\",B14654+1)","v":""}]
[null,{"$f":"IF(C14656=\"\",\"\",B14655+1)","v":""}]
[null,""]
[null,""]
[null,""]
[null,""]
[null,""]
[null,""]
[null,""]
[null,""]
[null,""]
[null,""]
[null,""]
[null,""]
[null,""]
[null,""]
[null,""]
[null,""]
[null,""]
[null,""]
[null,""]
[null,""]
[null,""]
[null,""]
[]
[]
[]
[]
[null,{"$f":"IF(#REF!=\"\",\"\",B14682+1)","v":{"$error":"#REF!"}}]
[null,{"$f":"IF(#REF!=\"\",\"\",B14683+1)","v":{"$error":"#REF!"}}]
[null,{"$f":"IF(#REF!=\"\",\"\",B14684+1)","v":{"$error":"#REF!"}}]
[]
[]
[]
[]
[]
[]
[]
[]
[]
[]
[]
[]
[]
[]
[]
[]
[]
[]
[]
[]
[]
[]
[]
[]
[]
[]
[]
[]
[]
[]
[]
[]
[]
[]
[]
[]
[]
[]
[]
[]
[]
[]
[]
[]
[]
[]
[]
[]
[]
[]
[]
[]
[]
[]
[]
[]
[]
[]
[]
[]
[]
[]
[]
[]
[]
[]
[]
[]
[]
[]
[]
[]
[]
[]
[]
[]
[]
[]
[]
[]
[]
[]
[]
[]
[]
[]
[]
[]
[]
[]
[]
[]
[]
[]
[]
[]
[]
[]
[]
[]
[]
[]
[]
[]
[]
[]
[]
[]
[]
[]
[]
[]
[]
[]
[]
[]
[]
[]
[]
[]
[]
[]
[]
[]
[]
[]
[]
[]
[]
[]
[]
[]
[]
[]
[]
[]
[]
[]
[]
[]
[]
[]
[]
[]
[]
[]
[]
[]
[]
[]
[]
[]
[]
[]
[]
[]
[]
[]
[]
[]
[]
[]
[]
[]
[]
[]
[]
[]
[]
[]
[]
[]
[]
[]
[]
[]
[]
[]
[]
[]
[]
[]
[]
[]
[]
[]
[]
[]
[]
[]
[]
[]
[]
[]
[]
[]
[]
[]
[]
[]
[]
[]
[]
[]
[]
[]
[]
[]
[]
[]
[]
[]
[]
[]
[]
[]
[]
[]
[]
[]
[]
[]
[]
[]
[]
[]
[]
[]
[]
[]
[]
[]
[]
[]
[]
[]
[]
[]
[]
[]
[]
[]
[]
[]
[]
[]
[]
[]
[]
[]
[]
[]
[]
[]
[]
[]
[]
[]
[]
[]
[]
[]
[]
[]
[]
[]
[]
[]
[]
[]
[]
[]
[]
[]
[]
[]
[]
[]
[]
[]
[]
[]
[]
[]
[]
[]
[]
[]
[]
[]
[]
[]
[]
[]
[]
[]
[]
[]
[]
[]
[]
[]
[]
[]
[]
[]
[]
[]
[]
[]
[]
[]
[]
[]
[]
[]
[]
[]
[]
[]
[]
[]
[]
[]
[]
[]
[null,{"$f":"IF(#REF!=\"\",\"\",B15011+1)","v":{"$error":"#REF!"}}]
[null,{"$f":"IF(C15013=\"\",\"\",B15012+1)","v":""}]
[null,""]
[null,""]
[null,""]
[null,""]
[null,""]
[null,""]
[null,""]
[null,""]
[null,""]
[null,""]
[null,""]
[null,""]
[null,""]
[null,""]
[null,""]
[null,""]
[null,""]
[null,""]
[null,""]
[null,""]
[null,""]
[null,""]
[null,""]
[null,""]
[null,""]
[null,""]
[null,""]
[null,""]
[null,""]
[null,""]
[null,""]
[null,{"$f":"IF(C15045=\"\",\"\",B15044+1)","v":""}]
[null,""]
[null,""]
[null,""]
[null,""]
[null,""]
[null,""]
[null,""]
[null,""]
[null,""]
[null,""]
[null,""]
[null,""]
[null,""]
[null,""]
[null,""]
[null,""]
[null,""]
[null,""]
[null,""]
[null,""]
[null,""]
[null,""]
[null,""]
[null,""]
[null,""]
[null,""]
[null,""]
[null,""]
[null,""]
[null,""]
[null,""]
[null,{"$f":"IF(C15077=\"\",\"\",B15076+1)","v":""}]
[null,""]
[null,""]
[null,""]
[null,""]
[null,""]
[null,""]
[null,""]
[null,""]
[null,""]
[null,""]
[null,""]
[null,""]
[null,""]
[null,""]
[null,""]
[null,""]
[null,""]
[null,""]
[null,""]
[null,""]
[null,""]
[null,""]
[null,""]
[null,""]
[null,""]
[null,""]
[null,""]
[null,""]
[null,""]
[null,""]
[null,""]
[null,{"$f":"IF(C15109=\"\",\"\",B15108+1)","v":""}]
[null,""]
[null,""]
[null,""]
[null,""]
[null,""]
[null,""]
[null,""]
[null,""]
[null,""]
[null,""]
[null,""]
[null,""]
[null,""]
[null,""]
[null,""]
[]
[]
[]
[]
[]
[null,{"$f":"IF(#REF!=\"\",\"\",1)","v":{"$error":"#REF!"}}]
[null,{"$f":"IF(#REF!=\"\",\"\",B15130+1)","v":{"$error":"#REF!"}}]
[null,{"$f":"IF(#REF!=\"\",\"\",B15131+1)","v":{"$error":"#REF!"}}]
[null,{"$f":"IF(#REF!=\"\",\"\",B15132+1)","v":{"$error":"#REF!"}}]
[null,{"$f":"IF(#REF!=\"\",\"\",B15133+1)","v":{"$error":"#REF!"}}]
[null,{"$f":"IF(#REF!=\"\",\"\",B15134+1)","v":{"$error":"#REF!"}}]
[null,{"$f":"IF(#REF!=\"\",\"\",B15135+1)","v":{"$error":"#REF!"}}]
[null,{"$f":"IF(#REF!=\"\",\"\",B15136+1)","v":{"$error":"#REF!"}}]
[null,{"$f":"IF(#REF!=\"\",\"\",B15137+1)","v":{"$error":"#REF!"}}]
[null,{"$f":"IF(#REF!=\"\",\"\",B15138+1)","v":{"$error":"#REF!"}}]
[null,{"$f":"IF(#REF!=\"\",\"\",B15139+1)","v":{"$error":"#REF!"}}]
[null,{"$f":"IF(#REF!=\"\",\"\",B15140+1)","v":{"$error":"#REF!"}}]
[null,{"$f":"IF(#REF!=\"\",\"\",B15141+1)","v":{"$error":"#REF!"}}]
[null,{"$f":"IF(#REF!=\"\",\"\",B15142+1)","v":{"$error":"#REF!"}}]
[null,{"$f":"IF(#REF!=\"\",\"\",B15143+1)","v":{"$error":"#REF!"}}]
[null,{"$f":"IF(#REF!=\"\",\"\",B15144+1)","v":{"$error":"#REF!"}}]
[null,{"$f":"IF(#REF!=\"\",\"\",B15145+1)","v":{"$error":"#REF!"}}]
[null,{"$f":"IF(#REF!=\"\",\"\",B15146+1)","v":{"$error":"#REF!"}}]
[null,{"$f":"IF(#REF!=\"\",\"\",B15147+1)","v":{"$error":"#REF!"}}]
[null,{"$f":"IF(#REF!=\"\",\"\",B15148+1)","v":{"$error":"#REF!"}}]
[null,{"$f":"IF(#REF!=\"\",\"\",B15149+1)","v":{"$error":"#REF!"}}]
[]
[]
[]
[]
[]
[]
[]
[]
[]
[]
[]
[]
[]
[]
[]
[]
[]
[]
[]
[]
[]
[]
[]
[]
[]
[]
[]
[]
[]
[]
[]
[]
[]
[]
[]
[]
[]
[]
[]
[]
[]
[]
[]
[]
[]
[]
[]
[]
[]
[]
[]
[]
[]
[]
[]
[]
[]
[]
[]
[]
[]
[]
[]
[]
[]
[]
[]
[]
[]
[]
[]
[]
[]
[]
[]
[]
[]
[]
[]
[]
[]
[]
[]
[]
[]
[]
[]
[]
[]
[]
[]
[]
[]
[]
[]
[]
[]
[]
[]
[]
[]
[]
[]
[]
[]
[]
[]
[]
[]
[]
[]
[]
[]
[]
[]
[]
[]
[]
[]
[]
[]
[]
[]
[]
[]
[]
[]
[]
[]
[]
[]
[]
[]
[]
[]
[]
[]
[]
[]
[]
[]
[]
[]
[]
[]
[]
[]
[]
[]
[]
[]
[]
[]
[]
[]
[]
[]
[]
[]
[]
[]
[]
[]
[]
[]
[]
[]
[]
[]
[]
[]
[]
[]
[]
[]
[]
[]
[]
[]
[]
[]
[]
[]
[]
[]
[]
[]
[]
[]
[]
[]
[]
[]
[]
[]
[]
[]
[]
[]
[]
[]
[]
[]
[]
[]
[]
[]
[]
[]
[]
[]
[]
[]
[]
[]
[]
[]
[]
[]
[]
[]
[]
[]
[]
[]
[]
[]
[]
[]
[]
[]
[]
[]
[]
[]
[]
[]
[]
[]
[]
[]
[]
[]
[]
[]
[]
[]
[]
[]
[]
[]
[]
[]
[]
[]
[]
[]
[]
[]
[]
[]
[]
[]
[]
[]
[]
[]
[]
[]
[]
[]
[]
[]
[]
[]
[]
[]
[]
[]
[]
[]
[]
[]
[]
[]
[]
[]
[]
[]
[]
[]
[]
[]
[]
[]
[]
[]
[]
[]
[]
[]
[]
[]
[]
[]
[]
[]
[]
[]
[]
[]
[]
[]
[]
[]
[]
[]
[]
[]
[]
[]
[]
[]
[]
[]
[]
[]
[]
[]
[]
[]
[]
[]
[]
[]
[]
[]
[]
[]
[]
[]
[]
[]
[]
[]
[]
[]
[]
[]
[]
[]
[]
[]
[]
[]
[]
[]
[]
[]
[]
[]
[]
[]
[]
[]
[]
[]
[]
[]
[]
[]
[]
[]
[]
[]
[]
[]
[]
[]
[]
[]
[]
[]
[]
[]
[]
[]
[]
[]
[]
[]
[]
[]
[]
[]
[]
[]
[]
[]
[]
[]
[]
[]
[]
[]
[]
[]
[]
[]
[]
[]
[]
[]
[]
[]
[]
[]
[]
[]
[]
[]
[]
[]
[]
[]
[]
[]
[]
[]
[]
[]
[]
[]
[]
[]
[]
[]
[]
[]
[]
[]
[]
[]
[]
[]
[]
[]
[]
[]
[]
[]
[]
[]
[]
[]
[]
[]
[]
[]
[]
[]
[]
[]
[]
[]
[]
[]
[]
[]
[]
[]
[]
[]
[]
[]
[]
[]
[]
[]
[]
[]
[]
[]
[]
[]
[]
[]
[]
[]
[]
[]
[]
[]
[]
[]
[]
[]
[]
[]
[]
[]
[]
[]
[]
[]
[]
[]
[]
[]
[]
[]
[]
[]
[]
[]
[]
[]
[]
[]
[]
[]
[]
[]
[]
[]
[]
[]
[]
[]
[]
[]
[]
[]
[]
[]
[]
[]
[]
[]
[]
[]
[]
[]
[]
[]
[]
[]
[]
[]
[]
[]
[]
[]
[]
[]
[]
[]
[]
[]
[]
[]
[]
[]
[]
[]
[]
[]
[]
[]
[]
[]
[]
[]
[]
[]
[]
[]
[]
[]
[]
[]
[]
[]
[]
[]
[]
[]
[]
[]
[]
[]
[]
[]
[]
[]
[]
[]
[]
[]
[]
[]
[]
[]
[]
[]
[]
[]
[]
[]
[]
[]
[]
[]
[]
[]
[]
[]
[]
[]
[]
[]
[]
[]
[]
[]
[]
[]
[]
[]
[]
[]
[]
[]
[]
[]
[]
[]
[]
[]
[]
[]
[]
[]
[]
[]
[]
[]
[]
[]
[]
[]
[]
[]
[]
[]
[]
[]
[]
[]
[]
[]
[]
[]
[]
[]
[]
[]
[]
[]
[]
[]
[]
[]
[]
[]
[]
[]
[]
[]
[]
[]
[]
[]
[]
[]
[]
[]
[]
[]
[]
[]
[]
[]
[]
[]
[]
[]
[]
[]
[]
[]
[]
[]
[]
[]
[]
[]
[]
[]
[]
[]
[]
[]
[]
[]
[]
[]
[]
[]
[]
[]
[]
[]
[]
[]
[]
[]
[]
[]
[]
[]
[]
[]
[]
[]
[]
[]
[]
[]
[]
[]
[]
[]
[]
[]
[]
[]
[]
[]
[]
[]
[]
[]
[]
[]
[]
[]
[]
[]
[]
[]
[]
[]
[]
[]
[]
[]
[]
[]
[]
[]
[]
[]
[]
[]
[]
[]
[]
[]
[]
[]
[]
[]
[]
[]
[]
[]
[]
[]
[]
[]
[]
[]
[]
[]
[]
[]
[]
[]
[]
[]
[]
[]
[]
[]
[]
[]
[]
[]
[]
[]
[]
[]
[]
[]
[]
[]
[]
[]
[]
[]
[]
[]
[]
[]
[]
[]
[]
[]
[]
[]
[]
[]
[]
[]
[]
[]
[]
[]
[]
[]
[]
[]
[]
[]
[]
[]
[]
[]
[]
[]
[]
[]
[]
[]
[]
[]
[]
[]
[]
[]
[]
[]
[]
[]
[]
[]
[]
[]
[]
[]
[]
[]
[]
[]
[]
[]
[]
[]
[]
[]
[]
[]
[]
[]
[]
[]
[]
[]
[]
[]
[]
[]
[]
[]
[]
[]
[]
[]
[]
[]
[]
[]
[]
[]
[]
[]
[]
[]
[]
[]
[]
[]
[]
[]
[]
[]
[]
[]
[]
[]
[]
[]
[]
[]
[]
[]
[]
[]
[]
[]
[]
[]
[]
[]
[]
[]
[]
[]
[]
[]
[]
[]
[]
[]
[]
[]
[]
[]
[]
[]
[]
[]
[]
[]
[]
[]
[]
[]
[]
[]
[]
[]
[]
[]
[]
[]
[]
[]
[]
[]
[]
[]
[]
[]
[]
[]
[]
[]
[]
[]
[]
[]
[]
[]
[]
[]
[]
[]
[]
[]
[]
[]
[]
[]
[]
[]
[]
[]
[]
[]
[]
[]
[]
[]
[]
[]
[]
[]
[]
[]
[]
[]
[]
[]
[]
[]
[]
[]
[]
[]
[]
[]
[]
[]
[]
[]
[]
[]
[]
[]
[]
[]
[]
[]
[]
[]
[]
[]
[]
[]
[]
[]
[]
[]
[]
[]
[]
[]
[]
[]
[]
[]
[]
[]
[]
[]
[]
[]
[]
[]
[]
[]
[]
[]
[]
[]
[]
[]
[]
[]
[]
[]
[]
[]
[]
[]
[]
[]
[]
[]
[]
[]
[]
[]
[]
[]
[]
[]
[]
[]
[]
[]
[]
[]
[]
[]
[]
[]
[]
[]
[]
[]
[]
[]
[]
[]
[]
[]
[]
[]
[]
[]
[]
[]
[]
[]
[]
[]
[]
[]
[]
[]
[]
[]
[]
[]
[]
[]
[]
[]
[]
[]
[]
[]
[]
[]
[]
[]
[]
[]
[]
[]
[]
[]
[]
[]
[]
[]
[]
[]
[]
[]
[]
[]
[]
[]
[]
[]
[]
[]
[]
[]
[]
[]
[]
[]
[]
[]
[]
[]
[]
[]
[]
[]
[]
[]
[]
[]
[]
[]
[]
[]
[]
[]
[]
[]
[]
[]
[]
[]
[]
[]
[]
[]
[]
[]
[]
[]
[]
[]
[]
[]
[]
[]
[]
[]
[]
[]
[]
[]
[]
[]
[]
[]
[]
[]
[]
[]
[]
[]
[]
[]
[]
[]
[]
[]
[]
[]
[]
[]
[]
[]
[]
[]
[]
[]
[]
[]
[]
[]
[]
[]
[]
[]
[]
[]
[]
[]
[]
[]
[]
[]
[]
[]
[]
[]
[]
[]
[]
[]
[]
[]
[]
[]
[]
[]
[]
[]
[]
[]
[]
[]
[]
[]
[]
[]
[]
[]
[]
[]
[]
[]
[]
[]
[]
[]
[]
[]
[]
[]
[]
[]
[]
[]
[]
[]
[]
[]
[]
[]
[]
[]
[]
[]
[]
[]
[]
[]
[]
[]
[]
[]
[]
[]
[]
[]
[]
[]
[]
[]
[]
[]
[]
[]
[]
[]
[]
[]
[]
[]
[]
[]
[]
[]
[]
[]
[]
[]
[]
[]
[]
[]
[]
[]
[]
[]
[]
[]
[]
[]
[]
[]
[]
[]
[]
[]
[]
[]
[]
[]
[]
[]
[]
[]
[]
[]
[]
[]
[]
[]
[]
[]
[]
[]
[]
[]
[]
[]
[]
[]
[]
[]
[]
[]
[]
[]
[]
[]
[]
[]
[]
[]
[]
[]
[]
[]
[]
[]
[]
[]
[]
[]
[]
[]
[]
[]
[]
[]
[]
[]
[]
[]
[]
[]
[]
[]
[]
[]
[]
[]
[]
[]
[]
[]
[]
[]
[]
[]
[]
[]
[]
[]
[]
[]
[]
[]
[]
[]
[]
[]
[]
[]
[]
[]
[]
[]
[]
[]
[]
[]
[]
[]
[]
[]
[]
[]
[]
[]
[]
[]
[]
[]
[]
[]
[]
[]
[]
[]
[]
[]
[]
[]
[]
[]
[]
[]
[]
[]
[]
[]
[]
[]
[]
[]
[]
[]
[]
[]
[]
[]
[]
[]
[]
[]
[]
[]
[]
[]
[]
[]
[]
[]
[]
[]
[]
[]
[]
[]
[]
[]
[]
[]
[]
[]
[]
[]
[]
[]
[]
[]
[]
[]
[]
[]
[]
[]
[]
[]
[]
[]
[]
[]
[]
[]
[]
[]
[]
[]
[]
[]
[]
[]
[]
[]
[]
[]
[]
[]
[]
[]
[]
[]
[]
[]
[]
[]
[]
[]
[]
[]
[]
[]
[]
[]
[]
[]
[]
[]
[]
[]
[]
[]
[]
[]
[]
[]
[]
[]
[]
[]
[]
[]
[]
[]
[]
[]
[]
[]
[]
[]
[]
[]
[]
[]
[]
[]
[]
[]
[]
[]
[]
[]
[]
[]
[]
[]
[]
[]
[]
[]
[]
[]
[]
[]
[]
[]
[]
[]
[]
[]
[]
[]
[]
[]
[]
[]
[]
[]
[]
[]
[]
[]
[]
[]
[]
[]
[]
[]
[]
[]
[]
[]
[]
[]
[]
[]
[]
[]
[]
[]
[]
[]
[]
[]
[]
[]
[]
[]
[]
[]
[]
[]
[]
[]
[]
[]
[]
[]
[]
[]
[]
[]
[]
[]
[]
[]
[]
[]
[]
[]
[]
[]
[]
[]
[]
[]
[]
[]
[]
[]
[]
[]
[]
[]
[]
[]
[]
[]
[]
[]
[]
[]
[]
[]
[]
[]
[]
[]
[]
[]
[]
[]
[]
[]
[]
[]
[]
[]
[]
[]
[]
[]
[]
[]
[]
[]
[]
[]
[]
[]
[]
[]
[]
[]
[]
[]
[]
[]
[]
[]
[]
[]
[]
[]
[]
[]
[]
[]
[]
[]
[]
[]
[]
[]
[]
[]
[]
[]
[]
[]
[]
[]
[]
[]
[]
[]
[]
[]
[]
[]
[]
[]
[]
[]
[]
[]
[]
[]
[]
[]
[]
[]
[]
[]
[]
[]
[]
[]
[]
[]
[]
[]
[]
[]
[]
[]
[]
[]
[]
[]
[]
[]
[]
[]
[]
[]
[]
[]
[]
[]
[]
[]
[]
[]
[]
[]
[]
[]
[]
[]
[]
[]
[]
[]
[]
[]
[]
[]
[]
[]
[]
[]
[]
[]
[]
[]
[]
[]
[]
[]
[]
[]
[]
[]
[]
[]
[]
[]
[]
[]
[]
[]
[]
[]
[]
[]
[]
[]
[]
[]
[]
[]
[]
[]
[]
[]
[]
[]
[]
[]
[]
[]
[]
[]
[]
[]
[]
[]
[]
[]
[]
[]
[]
[]
[]
[]
[]
[]
[]
[]
[]
[]
[]
[]
[]
[]
[]
[]
[]
[]
[]
[]
[]
[]
[]
[]
[]
[]
[]
[]
[]
[]
[]
[]
[]
[]
[]
[]
[]
[]
[]
[]
[]
[]
[]
[]
[]
[]
[]
[]
[]
[]
[]
[]
[]
[]
[]
[]
[]
[]
[]
[]
[]
[]
[]
[]
[]
[]
[]
[]
[]
[]
[]
[]
[]
[]
[]
[]
[]
[]
[]
[]
[]
[]
[]
[]
[]
[]
[]
[]
[]
[]
[]
[]
[]
[]
[]
[]
[]
[]
[]
[]
[]
[]
[]
[]
[]
[]
[]
[]
[]
[]
[]
[]
[]
[]
[]
[]
[]
[]
[]
[]
[]
[]
[]
[]
[]
[]
[]
[]
[]
[]
[]
[]
[]
[]
[]
[]
[]
[]
[]
[]
[]
[]
[]
[]
[]
[]
[]
[]
[]
[]
[]
[]
[]
[]
[]
[]
[]
[]
[]
[]
[]
[]
[]
[]
[]
[]
[]
[]
[]
[]
[]
[]
[]
[]
[]
[]
[]
[]
[]
[]
[]
[]
[]
[]
[]
[]
[]
[]
[]
[]
[]
[]
[]
[]
[]
[]
[]
[]
[]
[]
[]
[]
[]
[]
[]
[]
[]
[]
[]
[]
[]
[null,{"$f":"IF(C17237=\"\",\"\",B17244+1)","v":""}]
[null,{"$f":"IF(C17233=\"\",\"\",B17245+1)","v":""}]
[null,{"$f":"IF(C17247=\"\",\"\",B17246+1)","v":""}]
[null,""]
[null,""]
[null,""]
[null,""]
[null,""]
[null,""]
[null,""]
[null,""]
[null,""]
[null,""]
[null,""]
[null,""]
[null,""]
[null,""]
[null,""]
[null,""]
[null,""]
[null,""]
[]
[]
[null,{"$f":"IF(#REF!=\"\",\"\",B17267+1)","v":{"$error":"#REF!"}}]
[]
[]
[]
[]
[]
[]
[]
[]
[]
[]
[]
[]
[]
[]
[]
[]
[]
[]
[]
[]
[]
[]
[]
[]
[]
[]
[]
[]
[]
[]
[]
[]
[]
[]
[]
[]
[]
[]
[]
[]
[]
[]
[]
[]
[]
[]
[]
[]
[]
[]
[]
[]
[]
[]
[]
[]
[]
[]
[]
[]
[]
[]
[]
[]
[]
[]
[]
[]
[]
[]
[]
[]
[]
[]
[]
[]
[]
[]
[]
[]
[]
[]
[]
[]
[]
[]
[]
[]
[]
[]
[]
[]
[]
[]
[]
[]
[]
[]
[]
[]
[]
[]
[]
[]
[]
[]
[]
[]
[]
[]
[]
[]
[]
[]
[]
[]
[]
[]
[]
[]
[]
[]
[]
[]
[]
[]
[]
[]
[]
[]
[]
[]
[]
[]
[]
[]
[]
[]
[]
[]
[]
[]
[]
[]
[]
[]
[]
[]
[]
[]
[]
[]
[]
[]
[]
[]
[]
[]
[]
[]
[]
[]
[]
[]
[]
[]
[]
[]
[]
[]
[]
[]
[]
[]
[]
[]
[]
[]
[]
[]
[]
[]
[]
[]
[]
[]
[]
[]
[]
[]
[null,{"$f":"IF(C17459=\"\",\"\",B17458+1)","v":""}]
[null,{"$f":"IF(C17460=\"\",\"\",B17459+1)","v":""}]
[null,{"$f":"IF(C17461=\"\",\"\",B17460+1)","v":""}]
[null,{"$f":"IF(C17462=\"\",\"\",B17461+1)","v":""}]
[null,{"$f":"IF(C17463=\"\",\"\",B17462+1)","v":""}]
[null,{"$f":"IF(#REF!=\"\",\"\",B17463+1)","v":{"$error":"#REF!"}}]
[]
[]
[]
[]
[]
[]
[]
[]
[]
[]
[]
[]
[]
[]
[]
[]
[]
[]
[]
[]
[]
[]
[]
[]
[]
[]
[]
[]
[]
[]
[]
[]
[]
[]
[]
[]
[]
[]
[]
[]
[]
[]
[]
[]
[]
[]
[]
[]
[]
[]
[]
[]
[]
[]
[]
[]
[]
[]
[]
[]
[]
[]
[]
[]
[]
[]
[]
[]
[]
[]
[]
[]
[]
[]
[]
[]
[]
[]
[]
[]
[]
[]
[]
[]
[]
[]
[]
[]
[]
[]
[]
[]
[]
[]
[]
[]
[]
[]
[]
[]
[]
[]
[]
[]
[]
[]
[]
[]
[]
[]
[]
[]
[]
[null,{"$f":"IF(C17570=\"\",\"\",B17577+1)","v":""}]
[null,{"$f":"IF(C17579=\"\",\"\",B17578+1)","v":""}]
[null,{"$f":"IF(C17580=\"\",\"\",B17579+1)","v":""}]
[null,{"$f":"IF(C17581=\"\",\"\",B17580+1)","v":""}]
[]
[]
[]
[]
[]
[]
[]
[]
[]
[]
[]
[]
[]
[]
[]
[]
[]
[]
[]
[]
[]
[]
[]
[]
[]
[]
[]
[]
[]
[]
[]
[]
[]
[]
[]
[]
[]
[]
[]
[]
[]
[]
[]
[]
[]
[]
[]
[]
[]
[]
[]
[]
[]
[]
[]
[]
[]
[]
[]
[]
[]
[]
[]
[]
[]
[]
[]
[]
[]
[]
[]
[]
[]
[]
[]
[]
[]
[]
[]
[]
[]
[]
[]
[]
[]
[]
[]
[]
[]
[]
[]
[]
[]
[]
[]
[]
[]
[]
[]
[]
[]
[]
[]
[]
[]
[]
[]
[]
[]
[]
[]
[]
[]
[]
[]
[]
[]
[]
[]
[null,{"$f":"IF(C17701=\"\",\"\",B17700+1)","v":""}]
[null,""]
[null,""]
[null,""]
[null,""]
[null,""]
[null,""]
[null,""]
[]
[]
[]
[]
[]
[]
[]
[]
[]
[]
[]
[]
[]
[]
[]
[]
[]
[]
[]
[]
[]
[]
[]
[]
[]
[]
[]
[]
[]
[]
[]
[]
[]
[]
[]
[]
[]
[]
[]
[]
[]
[]
[]
[]
[]
[]
[]
[]
[]
[]
[]
[]
[]
[]
[]
[]
[]
[]
[]
[]
[]
[]
[]
[]
[]
[]
[]
[]
[]
[]
[]
[]
[]
[]
[]
[]
[]
[]
[]
[]
[]
[]
[]
[]
[]
[]
[]
[]
[]
[]
[]
[]
[]
[]
[]
[]
[]
[]
[]
[]
[]
[]
[]
[]
[]
[]
[]
[]
[]
[]
[]
[]
[null,{"$f":"IF(C17821=\"\",\"\",B17820+1)","v":""}]
[null,""]
[null,""]
[null,""]
[null,""]
[null,""]
[]
[]
[]
[]
[]
[]
[]
[]
[]
[]
[]
[]
[]
[]
[]
[]
[]
[]
[]
[]
[]
[]
[]
[]
[]
[]
[]
[]
[]
[]
[]
[]
[]
[]
[]
[]
[]
[]
[]
[]
[]
[]
[]
[]
[null,{"$f":"IF(C17871=\"\",\"\",B17870+1)","v":""}]
[null,{"$f":"IF(C17859=\"\",\"\",B17871+1)","v":""}]
[null,{"$f":"IF(C17873=\"\",\"\",B17872+1)","v":""}]
[null,{"$f":"IF(C17874=\"\",\"\",B17873+1)","v":""}]
[null,{"$f":"IF(C17875=\"\",\"\",B17874+1)","v":""}]
[null,{"$f":"IF(C17876=\"\",\"\",B17875+1)","v":""}]
[null,{"$f":"IF(C17877=\"\",\"\",B17876+1)","v":""}]
[]
[]
[]
[]
[]
[]
[]
[]
[]
[]
[]
[]
[]
[]
[]
[]
[]
[]
[]
[]
[]
[]
[]
[]
[]
[]
[]
[]
[]
[]
[]
[]
[]
[]
[]
[]
[]
[]
[]
[]
[]
[]
[]
[]
[]
[]
[]
[]
[]
[]
[]
[]
[]
[]
[]
[]
[]
[]
[]
[]
[]
[]
[]
[]
[]
[]
[]
[]
[]
[]
[]
[null,{"$f":"IF(C17936=\"\",\"\",B17948+1)","v":""}]
[null,{"$f":"IF(C17950=\"\",\"\",B17949+1)","v":""}]
[null,""]
[null,""]
[null,""]
[null,""]
[null,""]
[null,""]
[null,""]
[null,""]
[null,""]
[null,""]
[null,""]
[null,""]
[null,""]
[null,""]
[null,""]
[null,""]
[null,""]
[null,""]
[null,""]
[]
[]
[null,{"$f":"IF(#REF!=\"\",\"\",B17971+1)","v":{"$error":"#REF!"}}]
[]
[]
[]
[]
[]
[]
[]
[]
[]
[]
[]
[]
[]
[]
[]
[]
[]
[]
[]
[]
[]
[]
[]
[]
[]
[]
[]
[]
[]
[]
[]
[]
[]
[]
[]
[]
[]
[]
[]
[]
[]
[]
[]
[]
[]
[]
[]
[]
[]
[]
[]
[]
[]
[]
[]
[]
[]
[]
[]
[]
[]
[]
[]
[]
[]
[]
[]
[]
[]
[]
[]
[]
[]
[]
[]
[]
[]
[]
[]
[]
[]
[]
[]
[]
[]
[]
[]
[]
[]
[]
[]
[]
[]
[]
[]
[]
[]
[]
[]
[]
[]
[]
[]
[]
[]
[]
[]
[]
[]
[]
[]
[]
[]
[]
[]
[]
[]
[]
[]
[]
[]
[]
[]
[]
[]
[]
[]
[]
[]
[]
[]
[]
[]
[]
[]
[]
[]
[]
[]
[]
[]
[]
[]
[]
[]
[]
[]
[]
[]
[]
[]
[]
[]
[]
[]
[]
[]
[]
[]
[]
[]
[]
[]
[]
[]
[]
[]
[]
[]
[]
[]
[]
[]
[]
[]
[]
[]
[]
[]
[]
[]
[]
[]
[]
[]
[]
[]
[]
[]
[]
[]
[]
[]
[]
[]
[]
[]
[]
[]
[]
[]
[]
[]
[]
[]
[]
[]
[]
[]
[]
[]
[]
[]
[]
[]
[]
[]
[]
[]
[]
[]
[]
[]
[]
[]
[]
[]
[]
[]
[]
[]
[]
[]
[]
[]
[]
[]
[]
[]
[]
[]
[]
[]
[]
[]
[]
[]
[]
[]
[]
[]
[]
[]
[]
[]
[]
[]
[]
[]
[]
[]
[]
[]
[]
[]
[]
[]
[]
[]
[]
[]
[]
[]
[]
[]
[]
[]
[]
[]
[]
[]
[]
[]
[]
[]
[]
[]
[]
[]
[]
[]
[]
[]
[]
[]
[]
[]
[]
[]
[]
[]
[]
[]
[]
[]
[]
[]
[]
[]
[]
[]
[]
[]
[]
[]
[]
[]
[]
[]
[]
[]
[]
[]
[]
[null,{"$f":"IF(C18297=\"\",\"\",B18296+1)","v":""}]
[null,{"$f":"IF(C18298=\"\",\"\",B18297+1)","v":""}]
[null,{"$f":"IF(C18299=\"\",\"\",B18298+1)","v":""}]
[null,{"$f":"IF(C18300=\"\",\"\",B18299+1)","v":""}]
[]
[]
[]
[]
[]
[]
[]
[]
[]
[]
[]
[]
[]
[]
[]
[]
[]
[]
[]
[]
[]
[]
[]
[]
[]
[]
[]
[]
[]
[]
[]
[]
[]
[]
[]
[]
[]
[]
[]
[]
[]
[]
[]
[]
[]
[]
[null,{"$f":"IF(C18347=\"\",\"\",B18346+1)","v":""}]
[null,{"$f":"IF(C18348=\"\",\"\",B18347+1)","v":""}]
[null,{"$f":"IF(C18349=\"\",\"\",B18348+1)","v":""}]
[null,{"$f":"IF(C18350=\"\",\"\",B18349+1)","v":""}]
[null,{"$f":"IF(C18351=\"\",\"\",B18350+1)","v":""}]
[]
[]
[]
[]
[]
[]
[]
[]
[]
[]
[]
[]
[]
[]
[]
[]
[]
[]
[]
[]
[]
[]
[]
[]
[]
[]
[]
[]
[]
[]
[]
[]
[]
[]
[]
[]
[]
[]
[]
[]
[]
[]
[null,{"$f":"IF(C18386=\"\",\"\",B18393+1)","v":""}]
[null,{"$f":"IF(C18395=\"\",\"\",B18394+1)","v":""}]
[null,{"$f":"IF(C18396=\"\",\"\",B18395+1)","v":""}]
[null,{"$f":"IF(C18397=\"\",\"\",B18396+1)","v":""}]
[]
[]
[]
[]
[]
[]
[]
[]
[]
[]
[]
[]
[]
[]
[]
[]
[]
[]
[]
[]
[]
[]
[]
[]
[]
[]
[]
[]
[]
[]
[]
[]
[]
[]
[null,{"$f":"IF(C18432=\"\",\"\",B18431+1)","v":""}]
[null,{"$f":"IF(C18433=\"\",\"\",B18432+1)","v":""}]
[null,{"$f":"IF(C18434=\"\",\"\",B18433+1)","v":""}]
[null,{"$f":"IF(C18435=\"\",\"\",B18434+1)","v":""}]
[null,{"$f":"IF(C18436=\"\",\"\",B18435+1)","v":""}]
[]
[]
[]
[]
[]
[]
[]
[]
[]
[]
[]
[]
[]
[]
[]
[]
[]
[]
[]
[]
[]
[]
[]
[]
[]
[]
[]
[]
[]
[]
[null,{"$f":"IF(C18467=\"\",\"\",B18466+1)","v":""}]
[null,{"$f":"IF(C18468=\"\",\"\",B18467+1)","v":""}]
[null,{"$f":"IF(C18469=\"\",\"\",B18468+1)","v":""}]
[null,{"$f":"IF(C18470=\"\",\"\",B18469+1)","v":""}]
[null,{"$f":"IF(C18471=\"\",\"\",B18470+1)","v":""}]
[]
[]
[]
[]
[]
[]
[]
[]
[]
[]
[]
[]
[]
[]
[]
[]
[]
[]
[]
[]
[]
[]
[]
[]
[]
[]
[]
[]
[]
[null,{"$f":"IF(C18493=\"\",\"\",B18500+1)","v":""}]
[null,{"$f":"IF(C18494=\"\",\"\",B18501+1)","v":""}]
[null,{"$f":"IF(#REF!=\"\",\"\",B18502+1)","v":{"$error":"#REF!"}}]
[null,{"$f":"IF(C18504=\"\",\"\",B18503+1)","v":""}]
[]
[]
[]
[]
[]
[]
[]
[]
[]
[]
[]
[]
[]
[]
[]
[]
[]
[]
[]
[]
[]
[]
[]
[]
[]
[]
[]
[]
[null,{"$f":"IF(C18533=\"\",\"\",B18532+1)","v":""}]
[null,""]
[null,""]
[null,""]
[null,""]
[null,""]
[null,""]
[]
[]
[]
[]
[]
[]
[]
[]
[]
[]
[]
[]
[]
[]
[]
[]
[]
[]
[]
[]
[]
[]
[]
[]
[]
[]
[]
[]
[]
[]
[]
[]
[]
[]
[]
[]
[]
[]
[]
[]
[]
[]
[]
[]
[]
[]
[]
[]
[]
[]
[]
[]
[]
[]
[]
[]
[]
[]
[]
[]
[]
[]
[]
[]
[]
[]
[]
[]
[]
[]
[]
[]
[]
[]
[]
[]
[]
[]
[]
[]
[]
[]
[null,{"$f":"IF(C18614=\"\",\"\",B18621+1)","v":""}]
[null,{"$f":"IF(C18615=\"\",\"\",B18622+1)","v":""}]
[null,{"$f":"IF(#REF!=\"\",\"\",B18623+1)","v":{"$error":"#REF!"}}]
[]
[]
[]
[]
[]
[]
[]
[]
[]
[]
[]
[]
[]
[]
[]
[]
[]
[]
[]
[]
[]
[]
[]
[]
[]
[]
[]
[]
[]
[]
[null,{"$f":"IF(C18655=\"\",\"\",B18654+1)","v":""}]
[null,{"$f":"IF(#REF!=\"\",\"\",B18655+1)","v":{"$error":"#REF!"}}]
[null,{"$f":"IF(#REF!=\"\",\"\",B18656+1)","v":{"$error":"#REF!"}}]
[]
[]
[]
[]
[]
[]
[]
[]
[]
[]
[]
[]
[]
[]
[]
[]
[]
[null,{"$f":"IF(C18675=\"\",\"\",B18674+1)","v":""}]
[]
[]
[]
[]
[]
[]
[]
[]
[]
[]
[]
[]
[]
[]
[]
[]
[]
[null,{"$f":"IF(#REF!=\"\",\"\",B18692+1)","v":{"$error":"#REF!"}}]
[]
[]
[]
[]
[]
[]
[]
[]
[]
[]
[]
[]
[]
[]
[]
[]
[]
[]
[]
[]
[]
[null,{"$f":"IF(C18715=\"\",\"\",B18714+1)","v":""}]
[null,{"$f":"IF(C18716=\"\",\"\",B18715+1)","v":""}]
[]
[]
[]
[]
[]
[]
[]
[]
[]
[]
[]
[]
[]
[]
[]
[]
[]
[]
[]
[]
[]
[]
[]
[]
[]
[]
[]
[]
[]
[]
[]
[]
[]
[]
[]
[]
[]
[null,{"$f":"IF(C18754=\"\",\"\",B18753+1)","v":""}]
[null,{"$f":"IF(C18755=\"\",\"\",B18754+1)","v":""}]
[null,{"$f":"IF(C18756=\"\",\"\",B18755+1)","v":""}]
[null,{"$f":"IF(C18757=\"\",\"\",B18756+1)","v":""}]
[null,{"$f":"IF(C18758=\"\",\"\",B18757+1)","v":""}]
[]
[]
[]
[]
[]
[]
[]
[]
[]
[]
[]
[]
[]
[]
[]
[]
[]
[]
[]
[]
[]
[]
[]
[]
[]
[]
[]
[]
[]
[]
[]
[]
[]
[]
[]
[]
[]
[]
[]
[]
[]
[]
[]
[]
[]
[]
[]
[]
[]
[]
[]
[]
[]
[]
[]
[]
[]
[]
[]
[]
[]
[]
[]
[]
[]
[]
[]
[]
[]
[]
[]
[]
[]
[]
[]
[]
[]
[]
[]
[]
[]
[]
[]
[]
[]
[]
[]
[]
[]
[]
[]
[]
[]
[]
[]
[]
[null,{"$f":"IF(C18855=\"\",\"\",B18854+1)","v":""}]
[null,{"$f":"IF(C18856=\"\",\"\",B18855+1)","v":""}]
[]
[]
[]
[]
[]
[]
[]
[]
[]
[]
[]
[]
[]
[]
[]
[]
[]
[]
[]
[]
[]
[]
[null,{"$f":"IF(C18879=\"\",\"\",B18878+1)","v":""}]
[null,{"$f":"IF(C18867=\"\",\"\",B18879+1)","v":""}]
[null,{"$f":"IF(C18881=\"\",\"\",B18880+1)","v":""}]
[null,{"$f":"IF(C18882=\"\",\"\",B18881+1)","v":""}]
[]
[]
[]
[]
[]
[]
[]
[]
[]
[]
[]
[]
[]
[]
[null,{"$f":"IF(C18897=\"\",\"\",B18896+1)","v":""}]
[]
[]
[]
[]
[]
[]
[]
[]
[]
[]
[]
[]
[]
[]
[]
[]
[]
[]
[]
[]
[]
[null,{"$f":"IF(#REF!=\"\",\"\",B18918+1)","v":{"$error":"#REF!"}}]
[null,{"$f":"IF(C18907=\"\",\"\",B18919+1)","v":""}]
[null,{"$f":"IF(#REF!=\"\",\"\",B18920+1)","v":{"$error":"#REF!"}}]
[]
[]
[]
[]
[]
[]
[]
[]
[]
[]
[]
[]
[]
[]
[]
[]
[null,{"$f":"IF(C18938=\"\",\"\",B18937+1)","v":""}]
[]
[]
[]
[]
[]
[]
[]
[null,{"$f":"IF(C18946=\"\",\"\",B18945+1)","v":""}]
[]
[]
[]
[]
[]
[]
[]
[]
[]
[]
[]
[]
[]
[]
[]
[]
[]
[]
[]
[]
[]
[]
[]
[]
[null,{"$f":"IF(C18971=\"\",\"\",B18970+1)","v":""}]
[null,{"$f":"IF(C18972=\"\",\"\",B18971+1)","v":""}]
[null,{"$f":"IF(C18973=\"\",\"\",B18972+1)","v":""}]
[null,{"$f":"IF(C18974=\"\",\"\",B18973+1)","v":""}]
[]
[]
[]
[]
[]
[]
[]
[]
[]
[]
[]
[]
[]
[]
[]
[]
[]
[]
[]
[]
[]
[]
[]
[]
[]
[]
[]
[]
[]
[]
[]
[]
[]
[]
[]
[]
[]
[]
[]
[]
[]
[]
[]
[]
[]
[]
[]
[]
[]
[]
[]
[]
[]
[]
[]
[]
[]
[]
[]
[]
[]
[]
[]
[]
[null,{"$f":"IF(C19026=\"\",\"\",B19038+1)","v":""}]
[null,{"$f":"IF(C19040=\"\",\"\",B19039+1)","v":""}]
[]
[]
[]
[]
[]
[]
[]
[]
[]
[]
[]
[]
[]
[null,{"$f":"IF(C19041=\"\",\"\",B19053+1)","v":""}]
[]
[]
[]
[]
[]
[]
[]
[]
[]
[]
[]
[]
[]
[]
[]
[]
[]
[]
[]
[]
[null,{"$f":"IF(C19075=\"\",\"\",B19074+1)","v":""}]
[]
[]
[]
[]
[]
[]
[]
[]
[]
[null,{"$f":"IF(C19085=\"\",\"\",B19084+1)","v":""}]
[null,{"$f":"IF(C19078=\"\",\"\",B19085+1)","v":""}]
[null,{"$f":"IF(C19087=\"\",\"\",B19086+1)","v":""}]
[null,{"$f":"IF(C19088=\"\",\"\",B19087+1)","v":""}]
[null,{"$f":"IF(#REF!=\"\",\"\",B19088+1)","v":{"$error":"#REF!"}}]
[]
[]
[]
[]
[]
[]
[]
[]
[]
[]
[]
[]
[]
[]
[]
[]
[]
[]
[]
[]
[]
[]
[]
[]
[]
[]
[]
[]
[]
[]
[]
[]
[null,{"$f":"IF(C19122=\"\",\"\",B19121+1)","v":""}]
[]
[]
[]
[]
[]
[]
[]
[]
[]
[]
[]
[]
[]
[]
[null,{"$f":"IF(C19137=\"\",\"\",B19136+1)","v":""}]
[]
[]
[]
[]
[]
[]
[null,{"$f":"IF(C19144=\"\",\"\",B19143+1)","v":""}]
[null,{"$f":"IF(C19145=\"\",\"\",B19144+1)","v":""}]
[]
[]
[]
[]
[]
[]
[]
[]
[]
[]
[]
[]
[]
[null,{"$f":"IF(C19159=\"\",\"\",B19158+1)","v":""}]
[null,{"$f":"IF(C19160=\"\",\"\",B19159+1)","v":""}]
[null,{"$f":"IF(C19161=\"\",\"\",B19160+1)","v":""}]
[null,{"$f":"IF(C19162=\"\",\"\",B19161+1)","v":""}]
[]
[]
[]
[]
[]
[]
[]
[]
[]
[null,{"$f":"IF(C19172=\"\",\"\",B19171+1)","v":""}]
[null,{"$f":"IF(C19173=\"\",\"\",B19172+1)","v":""}]
[]
[]
[]
[]
[]
[]
[]
[]
[]
[]
[]
[]
[]
[]
[]
[]
[]
[null,{"$f":"IF(C19191=\"\",\"\",B19190+1)","v":""}]
[null,{"$f":"IF(C19192=\"\",\"\",B19191+1)","v":""}]
[null,{"$f":"IF(C19193=\"\",\"\",B19192+1)","v":""}]
[null,{"$f":"IF(C19194=\"\",\"\",B19193+1)","v":""}]
[]
[]
[]
[]
[]
[]
[]
[]
[]
[]
[]
[]
[]
[]
[]
[]
[]
[]
[]
[]
[]
[]
[]
[]
[]
[]
[]
[]
[]
[]
[]
[null,{"$f":"IF(C19226=\"\",\"\",B19225+1)","v":""}]
[null,{"$f":"IF(C19227=\"\",\"\",B19226+1)","v":""}]
[]
[]
[]
[]
[null,{"$f":"IF(C19232=\"\",\"\",B19231+1)","v":""}]
[null,{"$f":"IF(C19233=\"\",\"\",B19232+1)","v":""}]
[null,{"$f":"IF(C19234=\"\",\"\",B19233+1)","v":""}]
[]
[]
[]
[]
[]
[]
[]
[]
[]
[]
[]
[]
[]
[]
[]
[]
[]
[]
[]
[]
[]
[]
[]
[]
[null,{"$f":"IF(C19259=\"\",\"\",B19258+1)","v":""}]
[null,{"$f":"IF(C19260=\"\",\"\",B19259+1)","v":""}]
[]
[]
[]
[]
[]
[]
[]
[]
[]
[null,{"$f":"IF(C19270=\"\",\"\",B19269+1)","v":""}]
[null,{"$f":"IF(C19271=\"\",\"\",B19270+1)","v":""}]
[null,{"$f":"IF(#REF!=\"\",\"\",B19271+1)","v":{"$error":"#REF!"}}]
[null,{"$f":"IF(C19273=\"\",\"\",B19272+1)","v":""}]
[null,{"$f":"IF(C19274=\"\",\"\",B19273+1)","v":""}]
[null,{"$f":"IF(C19275=\"\",\"\",B19274+1)","v":""}]
[]
[]
[]
[]
[]
[]
[]
[]
[]
[]
[]
[]
[]
[]
[]
[]
[]
[]
[]
[]
[]
[]
[]
[]
[]
[]
[]
[]
[]
[]
[]
[]
[]
[]
[]
[]
[]
[]
[]
[null,{"$f":"IF(C19315=\"\",\"\",B19314+1)","v":""}]
[null,{"$f":"IF(C19316=\"\",\"\",B19315+1)","v":""}]
[]
[]
[]
[]
[]
[]
[]
[]
[]
[]
[]
[]
[]
[]
[null,{"$f":"IF(#REF!=\"\",\"\",B19330+1)","v":{"$error":"#REF!"}}]
[]
[]
[]
[]
[]
[]
[]
[]
[]
[]
[]
[]
[]
[]
[]
[]
[]
[]
[null,{"$f":"IF(C19350=\"\",\"\",B19349+1)","v":""}]
[null,{"$f":"IF(C19351=\"\",\"\",B19350+1)","v":""}]
[null,{"$f":"IF(C19352=\"\",\"\",B19351+1)","v":""}]
[]
[]
[]
[]
[]
[]
[null,{"$f":"IF(C19359=\"\",\"\",B19358+1)","v":""}]
[null,{"$f":"IF(C19360=\"\",\"\",B19359+1)","v":""}]
[]
[]
[]
[]
[]
[]
[null,{"$f":"IF(C19367=\"\",\"\",B19366+1)","v":""}]
[null,{"$f":"IF(C19368=\"\",\"\",B19367+1)","v":""}]
[null,{"$f":"IF(C19369=\"\",\"\",B19368+1)","v":""}]
[null,{"$f":"IF(C19370=\"\",\"\",B19369+1)","v":""}]
[null,{"$f":"IF(C19371=\"\",\"\",B19370+1)","v":""}]
[]
[]
[]
[]
[]
[]
[]
[]
[]
[null,{"$f":"IF(C19381=\"\",\"\",B19380+1)","v":""}]
[null,{"$f":"IF(C19374=\"\",\"\",B19381+1)","v":""}]
[]
[]
[]
[]
[]
[]
[]
[]
[]
[]
[]
[]
[]
[]
[]
[]
[null,{"$f":"IF(C19399=\"\",\"\",B19398+1)","v":""}]
[null,{"$f":"IF(C19392=\"\",\"\",B19399+1)","v":""}]
[]
[]
[]
[]
[]
[]
[]
[]
[]
[]
[]
[]
[]
[]
[]
[]
[]
[]
[]
[]
[]
[]
[]
[]
[]
[]
[]
[]
[]
[]
[]
[]
[]
[]
[]
[]
[]
[]
[]
[]
[]
[]
[]
[null,{"$f":"IF(C19444=\"\",\"\",B19443+1)","v":""}]
[]
[]
[]
[]
[]
[]
[]
[]
[]
[]
[]
[]
[null,{"$f":"IF(C19457=\"\",\"\",B19456+1)","v":""}]
[]
[]
[]
[]
[]
[]
[]
[]
[null,{"$f":"IF(C19466=\"\",\"\",B19465+1)","v":""}]
[null,{"$f":"IF(C19467=\"\",\"\",B19466+1)","v":""}]
[]
[]
[]
[]
[]
[]
[]
[]
[]
[]
[]
[]
[null,{"$f":"IF(C19480=\"\",\"\",B19479+1)","v":""}]
[]
[]
[]
[]
[]
[null,{"$f":"IF(C19486=\"\",\"\",B19485+1)","v":""}]
[]
[]
[]
[]
[]
[]
[null,{"$f":"IF(C19493=\"\",\"\",B19492+1)","v":""}]
[]
[]
[]
[]
[]
[]
[]
[]
[]
[null,{"$f":"IF(C19503=\"\",\"\",B19502+1)","v":""}]
[]
[]
[null,{"$f":"IF(C19506=\"\",\"\",B19505+1)","v":""}]
[null,{"$f":"IF(C19507=\"\",\"\",B19506+1)","v":""}]
[]
[]
[]
[]
[]
[]
[]
[]
[]
[]
[]
[]
[]
[]
[]
[]
[]
[]
[]
[]
[]
[]
[]
[]
[]
[]
[]
[]
[]
[]
[]
[]
[]
[]
[]
[]
[]
[]
[]
[]
[]
[]
[]
[]
[]
[]
[]
[]
[]
[]
[]
[]
[]
[]
[]
[]
[]
[]
[]
[]
[]
[]
[]
[]
[]
[]
[]
[]
[]
[]
[]
[]
[null,{"$f":"IF(C19580=\"\",\"\",B19579+1)","v":""}]
[null,{"$f":"IF(C19581=\"\",\"\",B19580+1)","v":""}]
[]
[]
[]
[]
[]
[]
[]
[]
[]
[]
[null,{"$f":"IF(C19592=\"\",\"\",B19591+1)","v":""}]
[]
[]
[]
[]
[]
[]
[]
[null,{"$f":"IF(#REF!=\"\",\"\",B19599+1)","v":{"$error":"#REF!"}}]
[]
[]
[]
[]
[]
[]
[]
[]
[]
[]
[]
[]
[]
[]
[]
[]
[]
[]
[]
[]
[]
[]
[]
[]
[]
[]
[]
[]
[]
[]
[]
[]
[]
[]
[]
[]
[]
[]
[]
[]
[]
[]
[null,{"$f":"IF(C19643=\"\",\"\",B19642+1)","v":""}]
[]
[]
[]
[]
[]
[]
[]
[]
[]
[]
[]
[]
[]
[]
[]
[null,{"$f":"IF(C19659=\"\",\"\",B19658+1)","v":""}]
[]
[]
[]
[]
[]
[null,{"$f":"IF(C19665=\"\",\"\",B19664+1)","v":""}]
[]
[]
[null,{"$f":"IF(C19668=\"\",\"\",B19667+1)","v":""}]
[]
[]
[]
[]
[]
[]
[null,{"$f":"IF(C19675=\"\",\"\",B19674+1)","v":""}]
[null,{"$f":"IF(C19676=\"\",\"\",B19675+1)","v":""}]
[]
[]
[]
[]
[]
[]
[]
[]
[]
[]
[]
[]
[]
[]
[null,{"$f":"IF(C19691=\"\",\"\",B19690+1)","v":""}]
[]
[]
[]
[]
[]
[]
[]
[null,{"$f":"IF(C19691=\"\",\"\",B19698+1)","v":""}]
[]
[]
[]
[]
[]
[]
[]
[]
[]
[null,{"$f":"IF(C19709=\"\",\"\",B19708+1)","v":""}]
[]
[]
[]
[]
[]
[]
[]
[]
[null,{"$f":"IF(C19718=\"\",\"\",B19717+1)","v":""}]
[]
[]
[]
[null,{"$f":"IF(C19722=\"\",\"\",B19721+1)","v":""}]
[]
[]
[]
[]
[]
[]
[]
[]
[]
[]
[]
[]
[null,{"$f":"IF(C19735=\"\",\"\",B19734+1)","v":""}]
[]
[]
[]
[null,{"$f":"IF(#REF!=\"\",\"\",B19738+1)","v":{"$error":"#REF!"}}]
[null,{"$f":"IF(C19740=\"\",\"\",B19739+1)","v":""}]
[]
[]
[]
[null,{"$f":"IF(#REF!=\"\",\"\",B19743+1)","v":{"$error":"#REF!"}}]
[null,{"$f":"IF(C19737=\"\",\"\",B19744+1)","v":""}]
[]
[]
[]
[]
[]
[]
[null,{"$f":"IF(C19739=\"\",\"\",B19751+1)","v":""}]
[null,{"$f":"IF(C19753=\"\",\"\",B19752+1)","v":""}]
[null,{"$f":"IF(C19754=\"\",\"\",B19753+1)","v":""}]
[null,{"$f":"IF(C19755=\"\",\"\",B19754+1)","v":""}]
[]
[]
[]
[]
[]
[]
[]
[]
[]
[]
[]
[]
[null,{"$f":"IF(C19768=\"\",\"\",B19767+1)","v":""}]
[null,{"$f":"IF(C19769=\"\",\"\",B19768+1)","v":""}]
[]
[null,{"$f":"IF(C19771=\"\",\"\",B19770+1)","v":""}]
[null,{"$f":"IF(C19772=\"\",\"\",B19771+1)","v":""}]
[]
[]
[]
[]
[null,{"$f":"IF(C19777=\"\",\"\",B19776+1)","v":""}]
[]
[]
[]
[]
[null,{"$f":"IF(C19782=\"\",\"\",B19781+1)","v":""}]
[]
[]
[]
[]
[]
[]
[null,{"$f":"IF(C19789=\"\",\"\",B19788+1)","v":""}]
[]
[]
[null,{"$f":"IF(C19792=\"\",\"\",B19791+1)","v":""}]
[]
[]
[]
[]
[null,{"$f":"IF(C19797=\"\",\"\",B19796+1)","v":""}]
[]
[]
[]
[]
[]
[]
[null,{"$f":"IF(C19796=\"\",\"\",B19803+1)","v":""}]
[]
[null,{"$f":"IF(C19806=\"\",\"\",B19805+1)","v":""}]
[]
[]
[]
[]
[]
[]
[]
[]
[]
[]
[]
[]
[]
[]
[]
[]
[]
[]
[]
[]
[]
[]
[]
[]
[]
[]
[]
[]
[null,{"$f":"IF(C19827=\"\",\"\",B19834+1)","v":""}]
[]
[]
[]
[]
[]
[]
[]
[]
[]
[]
[]
[]
[]
[]
[null,{"$f":"IF(C19850=\"\",\"\",B19849+1)","v":""}]
[]
[]
[]
[]
[]
[]
[]
[]
[]
[]
[]
[null,{"$f":"IF(C19862=\"\",\"\",B19861+1)","v":""}]
[null,{"$f":"IF(C19855=\"\",\"\",B19862+1)","v":""}]
[]
[]
[]
[]
[]
[]
[]
[null,{"$f":"IF(C19871=\"\",\"\",B19870+1)","v":""}]
[]
[]
[]
[]
[]
[]
[]
[]
[]
[]
[]
[]
[]
[]
[]
[]
[]
[null,{"$f":"IF(C19889=\"\",\"\",B19888+1)","v":""}]
[]
[]
[]
[]
[]
[]
[]
[]
[null,{"$f":"IF(C19898=\"\",\"\",B19897+1)","v":""}]
[null,{"$f":"IF(C19899=\"\",\"\",B19898+1)","v":""}]
[]
[]
[]
[null,{"$f":"IF(C19903=\"\",\"\",B19902+1)","v":""}]
[]
[]
[null,{"$f":"IF(C19906=\"\",\"\",B19905+1)","v":""}]
[]
[]
[]
[]
[]
[]
[]
[]
[]
[]
[null,{"$f":"IF(C19917=\"\",\"\",B19916+1)","v":""}]
[null,{"$f":"IF(C19910=\"\",\"\",B19917+1)","v":""}]
[null,{"$f":"IF(C19911=\"\",\"\",B19918+1)","v":""}]
[]
[]
[]
[]
[null,{"$f":"IF(C19924=\"\",\"\",B19923+1)","v":""}]
[]
[]
[]
[]
[]
[]
[]
[]
[]
[]
[]
[]
[]
[]
[]
[]
[]
[null,{"$f":"IF(C19942=\"\",\"\",B19941+1)","v":""}]
[null,{"$f":"IF(C19943=\"\",\"\",B19942+1)","v":""}]
[]
[]
[]
[]
[]
[]
[]
[]
[]
[]
[]
[]
[]
[null,{"$f":"IF(#REF!=\"\",\"\",B19956+1)","v":{"$error":"#REF!"}}]
[]
[]
[]
[null,{"$f":"IF(C19961=\"\",\"\",B19960+1)","v":""}]
[]
[]
[null,{"$f":"IF(C19964=\"\",\"\",B19963+1)","v":""}]
[]
[]
[]
[]
[]
[]
[]
[]
[]
[]
[]
[]
[]
[]
[]
[]
[]
[]
[]
[]
[]
[]
[]
[]
[]
[]
[null,{"$f":"IF(C19991=\"\",\"\",B19990+1)","v":""}]
[null,{"$f":"IF(C19992=\"\",\"\",B19991+1)","v":""}]
[null,{"$f":"IF(C19980=\"\",\"\",B19992+1)","v":""}]
[]
[]
[]
[]
[]
[]
[]
[null,{"$f":"IF(C20001=\"\",\"\",B20000+1)","v":""}]
[]
[]
[]
[null,{"$f":"IF(C20005=\"\",\"\",B20004+1)","v":""}]
[]
[]
[]
[null,{"$f":"IF(C20009=\"\",\"\",B20008+1)","v":""}]
[null,{"$f":"IF(C20010=\"\",\"\",B20009+1)","v":""}]
[]
[]
[]
[]
[]
[]
[]
[null,{"$f":"IF(C20018=\"\",\"\",B20017+1)","v":""}]

{"sheet":"Jenks iteration table","index":2,"n_rows":839,"n_cols":6,"rows_kept":839,"cut":false,"hidden":true,"merged":[]}
["Datapoints\\Groups",1,2,3,4,5]
[1,1,0,0,0,0]
[2,1,1,0,0,0]
[3,1,2,1,0,0]
[4,1,3,3,1,0]
[5,1,4,6,4,1]
[6,1,5,10,10,5]
[7,1,6,15,20,15]
[8,1,7,21,35,35]
[9,1,8,28,56,70]
[10,1,9,36,84,126]
[11,1,10,45,120,210]
[12,1,11,55,165,330]
[13,1,12,66,220,495]
[14,1,13,78,286,715]
[15,1,14,91,364,1001]
[16,1,15,105,455,1365]
[17,1,16,120,560,1820]
[18,1,17,136,680,2380]
[19,1,18,153,816,3060]
[20,1,19,171,969,3876]
[21,1,20,190,1140,4845]
[22,1,21,210,1330,5985]
[23,1,22,231,1540,7315]
[24,1,23,253,1771,8855]
[25,1,24,276,2024,10626]
[26,1,25,300,2300,12650]
[27,1,26,325,2600,14950]
[28,1,27,351,2925,17550]
[29,1,28,378,3276,20475]
[30,1,29,406,3654,23751]
[31,1,30,435,4060,27405]
[32,1,31,465,4495,31465]
[33,1,32,496,4960,35960]
[34,1,33,528,5456,40920]
[35,1,34,561,5984,46376]
[36,1,35,595,6545,52360]
[37,1,36,630,7140,58905]
[38,1,37,666,7770,66045]
[39,1,38,703,8436,73815]
[40,1,39,741,9139,82251]
[41,1,40,780,9880,91390]
[42,1,41,820,10660,101270]
[43,1,42,861,11480,111930]
[44,1,43,903,12341,123410]
[45,1,44,946,13244,135751]
[46,1,45,990,14190,148995]
[47,1,46,1035,15180,163185]
[48,1,47,1081,16215,178365]
[49,1,48,1128,17296,194580]
[50,1,49,1176,18424,211876]
[51,1,50,1225,19600,230300]
[52,1,51,1275,20825,249900]
[53,1,52,1326,22100,270725]
[54,1,53,1378,23426,292825]
[55,1,54,1431,24804,316251]
[56,1,55,1485,26235,341055]
[57,1,56,1540,27720,367290]
[58,1,57,1596,29260,395010]
[59,1,58,1653,30856,424270]
[60,1,59,1711,32509,455126]
[61,1,60,1770,34220,487635]
[62,1,61,1830,35990,521855]
[63,1,62,1891,37820,557845]
[64,1,63,1953,39711,595665]
[65,1,64,2016,41664,635376]
[66,1,65,2080,43680,677040]
[67,1,66,2145,45760,720720]
[68,1,67,2211,47905,766480]
[69,1,68,2278,50116,814385]
[70,1,69,2346,52394,864501]
[71,1,70,2415,54740,916895]
[72,1,71,2485,57155,971635]
[73,1,72,2556,59640,1028790]
[74,1,73,2628,62196,1088430]
[75,1,74,2701,64824,1150626]
[76,1,75,2775,67525,1215450]
[77,1,76,2850,70300,1282975]
[78,1,77,2926,73150,1353275]
[79,1,78,3003,76076,1426425]
[80,1,79,3081,79079,1502501]
[81,1,80,3160,82160,1581580]
[82,1,81,3240,85320,1663740]
[83,1,82,3321,88560,1749060]
[84,1,83,3403,91881,1837620]
[85,1,84,3486,95284,1929501]
[86,1,85,3570,98770,2024785]
[87,1,86,3655,102340,2123555]
[88,1,87,3741,105995,2225895]
[89,1,88,3828,109736,2331890]
[90,1,89,3916,113564,2441626]
[91,1,90,4005,117480,2555190]
[92,1,91,4095,121485,2672670]
[93,1,92,4186,125580,2794155]
[94,1,93,4278,129766,2919735]
[95,1,94,4371,134044,3049501]
[96,1,95,4465,138415,3183545]
[97,1,96,4560,142880,3321960]
[98,1,97,4656,147440,3464840]
[99,1,98,4753,152096,3612280]
[100,1,99,4851,156849,3764376]
[101,1,100,4950,161700,3921225]
[102,1,101,5050,166650,4082925]
[103,1,102,5151,171700,4249575]
[104,1,103,5253,176851,4421275]
[105,1,104,5356,182104,4598126]
[106,1,105,5460,187460,4780230]
[107,1,106,5565,192920,4967690]
[108,1,107,5671,198485,5160610]
[109,1,108,5778,204156,5359095]
[110,1,109,5886,209934,5563251]
[111,1,110,5995,215820,5773185]
[112,1,111,6105,221815,5989005]
[113,1,112,6216,227920,6210820]
[114,1,113,6328,234136,6438740]
[115,1,114,6441,240464,6672876]
[116,1,115,6555,246905,6913340]
[117,1,116,6670,253460,7160245]
[118,1,117,6786,260130,7413705]
[119,1,118,6903,266916,7673835]
[120,1,119,7021,273819,7940751]
[121,1,120,7140,280840,8214570]
[122,1,121,7260,287980,8495410]
[123,1,122,7381,295240,8783390]
[124,1,123,7503,302621,9078630]
[125,1,124,7626,310124,9381251]
[126,1,125,7750,317750,9691375]
[127,1,126,7875,325500,10009125]
[128,1,127,8001,333375,10334625]
[129,1,128,8128,341376,10668000]
[130,1,129,8256,349504,11009376]
[131,1,130,8385,357760,11358880]
[132,1,131,8515,366145,11716640]
[133,1,132,8646,374660,12082785]
[134,1,133,8778,383306,12457445]
[135,1,134,8911,392084,12840751]
[136,1,135,9045,400995,13232835]
[137,1,136,9180,410040,13633830]
[138,1,137,9316,419220,14043870]
[139,1,138,9453,428536,14463090]
[140,1,139,9591,437989,14891626]
[141,1,140,9730,447580,15329615]
[142,1,141,9870,457310,15777195]
[143,1,142,10011,467180,16234505]
[144,1,143,10153,477191,16701685]
[145,1,144,10296,487344,17178876]
[146,1,145,10440,497640,17666220]
[147,1,146,10585,508080,18163860]
[148,1,147,10731,518665,18671940]
[149,1,148,10878,529396,19190605]
[150,1,149,11026,540274,19720001]
[151,1,150,11175,551300,20260275]
[152,1,151,11325,562475,20811575]
[153,1,152,11476,573800,21374050]
[154,1,153,11628,585276,21947850]
[155,1,154,11781,596904,22533126]
[156,1,155,11935,608685,23130030]
[157,1,156,12090,620620,23738715]
[158,1,157,12246,632710,24359335]
[159,1,158,12403,644956,24992045]
[160,1,159,12561,657359,25637001]
[161,1,160,12720,669920,26294360]
[162,1,161,12880,682640,26964280]
[163,1,162,13041,695520,27646920]
[164,1,163,13203,708561,28342440]
[165,1,164,13366,721764,29051001]
[166,1,165,13530,735130,29772765]
[167,1,166,13695,748660,30507895]
[168,1,167,13861,762355,31256555]
[169,1,168,14028,776216,32018910]
[170,1,169,14196,790244,32795126]
[171,1,170,14365,804440,33585370]
[172,1,171,14535,818805,34389810]
[173,1,172,14706,833340,35208615]
[174,1,173,14878,848046,36041955]
[175,1,174,15051,862924,36890001]
[176,1,175,15225,877975,37752925]
[177,1,176,15400,893200,38630900]
[178,1,177,15576,908600,39524100]
[179,1,178,15753,924176,40432700]
[180,1,179,15931,939929,41356876]
[181,1,180,16110,955860,42296805]
[182,1,181,16290,971970,43252665]
[183,1,182,16471,988260,44224635]
[184,1,183,16653,1004731,45212895]
[185,1,184,16836,1021384,46217626]
[186,1,185,17020,1038220,47239010]
[187,1,186,17205,1055240,48277230]
[188,1,187,17391,1072445,49332470]
[189,1,188,17578,1089836,50404915]
[190,1,189,17766,1107414,51494751]
[191,1,190,17955,1125180,52602165]
[192,1,191,18145,1143135,53727345]
[193,1,192,18336,1161280,54870480]
[194,1,193,18528,1179616,56031760]
[195,1,194,18721,1198144,57211376]
[196,1,195,18915,1216865,58409520]
[197,1,196,19110,1235780,59626385]
[198,1,197,19306,1254890,60862165]
[199,1,198,19503,1274196,62117055]
[200,1,199,19701,1293699,63391251]
[201,1,200,19900,1313400,64684950]
[202,1,201,20100,1333300,65998350]
[203,1,202,20301,1353400,67331650]
[204,1,203,20503,1373701,68685050]
[205,1,204,20706,1394204,70058751]
[206,1,205,20910,1414910,71452955]
[207,1,206,21115,1435820,72867865]
[208,1,207,21321,1456935,74303685]
[209,1,208,21528,1478256,75760620]
[210,1,209,21736,1499784,77238876]
[211,1,210,21945,1521520,78738660]
[212,1,211,22155,1543465,80260180]
[213,1,212,22366,1565620,81803645]
[214,1,213,22578,1587986,83369265]
[215,1,214,22791,1610564,84957251]
[216,1,215,23005,1633355,86567815]
[217,1,216,23220,1656360,88201170]
[218,1,217,23436,1679580,89857530]
[219,1,218,23653,1703016,91537110]
[220,1,219,23871,1726669,93240126]
[221,1,220,24090,1750540,94966795]
[222,1,221,24310,1774630,96717335]
[223,1,222,24531,1798940,98491965]
[224,1,223,24753,1823471,100290905]
[225,1,224,24976,1848224,102114376]
[226,1,225,25200,1873200,103962600]
[227,1,226,25425,1898400,105835800]
[228,1,227,25651,1923825,107734200]
[229,1,228,25878,1949476,109658025]
[230,1,229,26106,1975354,111607501]
[231,1,230,26335,2001460,113582855]
[232,1,231,26565,2027795,115584315]
[233,1,232,26796,2054360,117612110]
[234,1,233,27028,2081156,119666470]
[235,1,234,27261,2108184,121747626]
[236,1,235,27495,2135445,123855810]
[237,1,236,27730,2162940,125991255]
[238,1,237,27966,2190670,128154195]
[239,1,238,28203,2218636,130344865]
[240,1,239,28441,2246839,132563501]
[241,1,240,28680,2275280,134810340]
[242,1,241,28920,2303960,137085620]
[243,1,242,29161,2332880,139389580]
[244,1,243,29403,2362041,141722460]
[245,1,244,29646,2391444,144084501]
[246,1,245,29890,2421090,146475945]
[247,1,246,30135,2450980,148897035]
[248,1,247,30381,2481115,151348015]
[249,1,248,30628,2511496,153829130]
[250,1,249,30876,2542124,156340626]
[251,1,250,31125,2573000,158882750]
[252,1,251,31375,2604125,161455750]
[253,1,252,31626,2635500,164059875]
[254,1,253,31878,2667126,166695375]
[255,1,254,32131,2699004,169362501]
[256,1,255,32385,2731135,172061505]
[257,1,256,32640,2763520,174792640]
[258,1,257,32896,2796160,177556160]
[259,1,258,33153,2829056,180352320]
[260,1,259,33411,2862209,183181376]
[261,1,260,33670,2895620,186043585]
[262,1,261,33930,2929290,188939205]
[263,1,262,34191,2963220,191868495]
[264,1,263,34453,2997411,194831715]
[265,1,264,34716,3031864,197829126]
[266,1,265,34980,3066580,200860990]
[267,1,266,35245,3101560,203927570]
[268,1,267,35511,3136805,207029130]
[269,1,268,35778,3172316,210165935]
[270,1,269,36046,3208094,213338251]
[271,1,270,36315,3244140,216546345]
[272,1,271,36585,3280455,219790485]
[273,1,272,36856,3317040,223070940]
[274,1,273,37128,3353896,226387980]
[275,1,274,37401,3391024,229741876]
[276,1,275,37675,3428425,233132900]
[277,1,276,37950,3466100,236561325]
[278,1,277,38226,3504050,240027425]
[279,1,278,38503,3542276,243531475]
[280,1,279,38781,3580779,247073751]
[281,1,280,39060,3619560,250654530]
[282,1,281,39340,3658620,254274090]
[283,1,282,39621,3697960,257932710]
[284,1,283,39903,3737581,261630670]
[285,1,284,40186,3777484,265368251]
[286,1,285,40470,3817670,269145735]
[287,1,286,40755,3858140,272963405]
[288,1,287,41041,3898895,276821545]
[289,1,288,41328,3939936,280720440]
[290,1,289,41616,3981264,284660376]
[291,1,290,41905,4022880,288641640]
[292,1,291,42195,4064785,292664520]
[293,1,292,42486,4106980,296729305]
[294,1,293,42778,4149466,300836285]
[295,1,294,43071,4192244,304985751]
[296,1,295,43365,4235315,309177995]
[297,1,296,43660,4278680,313413310]
[298,1,297,43956,4322340,317691990]
[299,1,298,44253,4366296,322014330]
[300,1,299,44551,4410549,326380626]
[301,1,300,44850,4455100,330791175]
[302,1,301,45150,4499950,335246275]
[303,1,302,45451,4545100,339746225]
[304,1,303,45753,4590551,344291325]
[305,1,304,46056,4636304,348881876]
[306,1,305,46360,4682360,353518180]
[307,1,306,46665,4728720,358200540]
[308,1,307,46971,4775385,362929260]
[309,1,308,47278,4822356,367704645]
[310,1,309,47586,4869634,372527001]
[311,1,310,47895,4917220,377396635]
[312,1,311,48205,4965115,382313855]
[313,1,312,48516,5013320,387278970]
[314,1,313,48828,5061836,392292290]
[315,1,314,49141,5110664,397354126]
[316,1,315,49455,5159805,402464790]
[317,1,316,49770,5209260,407624595]
[318,1,317,50086,5259030,412833855]
[319,1,318,50403,5309116,418092885]
[320,1,319,50721,5359519,423402001]
[321,1,320,51040,5410240,428761520]
[322,1,321,51360,5461280,434171760]
[323,1,322,51681,5512640,439633040]
[324,1,323,52003,5564321,445145680]
[325,1,324,52326,5616324,450710001]
[326,1,325,52650,5668650,456326325]
[327,1,326,52975,5721300,461994975]
[328,1,327,53301,5774275,467716275]
[329,1,328,53628,5827576,473490550]
[330,1,329,53956,5881204,479318126]
[331,1,330,54285,5935160,485199330]
[332,1,331,54615,5989445,491134490]
[333,1,332,54946,6044060,497123935]
[334,1,333,55278,6099006,503167995]
[335,1,334,55611,6154284,509267001]
[336,1,335,55945,6209895,515421285]
[337,1,336,56280,6265840,521631180]
[338,1,337,56616,6322120,527897020]
[339,1,338,56953,6378736,534219140]
[340,1,339,57291,6435689,540597876]
[341,1,340,57630,6492980,547033565]
[342,1,341,57970,6550610,553526545]
[343,1,342,58311,6608580,560077155]
[344,1,343,58653,6666891,566685735]
[345,1,344,58996,6725544,573352626]
[346,1,345,59340,6784540,580078170]
[347,1,346,59685,6843880,586862710]
[348,1,347,60031,6903565,593706590]
[349,1,348,60378,6963596,600610155]
[350,1,349,60726,7023974,607573751]
[351,1,350,61075,7084700,614597725]
[352,1,351,61425,7145775,621682425]
[353,1,352,61776,7207200,628828200]
[354,1,353,62128,7268976,636035400]
[355,1,354,62481,7331104,643304376]
[356,1,355,62835,7393585,650635480]
[357,1,356,63190,7456420,658029065]
[358,1,357,63546,7519610,665485485]
[359,1,358,63903,7583156,673005095]
[360,1,359,64261,7647059,680588251]
[361,1,360,64620,7711320,688235310]
[362,1,361,64980,7775940,695946630]
[363,1,362,65341,7840920,703722570]
[364,1,363,65703,7906261,711563490]
[365,1,364,66066,7971964,719469751]
[366,1,365,66430,8038030,727441715]
[367,1,366,66795,8104460,735479745]
[368,1,367,67161,8171255,743584205]
[369,1,368,67528,8238416,751755460]
[370,1,369,67896,8305944,759993876]
[371,1,370,68265,8373840,768299820]
[372,1,371,68635,8442105,776673660]
[373,1,372,69006,8510740,785115765]
[374,1,373,69378,8579746,793626505]
[375,1,374,69751,8649124,802206251]
[376,1,375,70125,8718875,810855375]
[377,1,376,70500,8789000,819574250]
[378,1,377,70876,8859500,828363250]
[379,1,378,71253,8930376,837222750]
[380,1,379,71631,9001629,846153126]
[381,1,380,72010,9073260,855154755]
[382,1,381,72390,9145270,864228015]
[383,1,382,72771,9217660,873373285]
[384,1,383,73153,9290431,882590945]
[385,1,384,73536,9363584,891881376]
[386,1,385,73920,9437120,901244960]
[387,1,386,74305,9511040,910682080]
[388,1,387,74691,9585345,920193120]
[389,1,388,75078,9660036,929778465]
[390,1,389,75466,9735114,939438501]
[391,1,390,75855,9810580,949173615]
[392,1,391,76245,9886435,958984195]
[393,1,392,76636,9962680,968870630]
[394,1,393,77028,10039316,978833310]
[395,1,394,77421,10116344,988872626]
[396,1,395,77815,10193765,998988970]
[397,1,396,78210,10271580,1009182735]
[398,1,397,78606,10349790,1019454315]
[399,1,398,79003,10428396,1029804105]
[400,1,399,79401,10507399,1040232501]
[401,1,400,79800,10586800,1050739900]
[402,1,401,80200,10666600,1061326700]
[403,1,402,80601,10746800,1071993300]
[404,1,403,81003,10827401,1082740100]
[405,1,404,81406,10908404,1093567501]
[406,1,405,81810,10989810,1104475905]
[407,1,406,82215,11071620,1115465715]
[408,1,407,82621,11153835,1126537335]
[409,1,408,83028,11236456,1137691170]
[410,1,409,83436,11319484,1148927626]
[411,1,410,83845,11402920,1160247110]
[412,1,411,84255,11486765,1171650030]
[413,1,412,84666,11571020,1183136795]
[414,1,413,85078,11655686,1194707815]
[415,1,414,85491,11740764,1206363501]
[416,1,415,85905,11826255,1218104265]
[417,1,416,86320,11912160,1229930520]
[418,1,417,86736,11998480,1241842680]
[419,1,418,87153,12085216,1253841160]
[420,1,419,87571,12172369,1265926376]
[421,1,420,87990,12259940,1278098745]
[422,1,421,88410,12347930,1290358685]
[423,1,422,88831,12436340,1302706615]
[424,1,423,89253,12525171,1315142955]
[425,1,424,89676,12614424,1327668126]
[426,1,425,90100,12704100,1340282550]
[427,1,426,90525,12794200,1352986650]
[428,1,427,90951,12884725,1365780850]
[429,1,428,91378,12975676,1378665575]
[430,1,429,91806,13067054,1391641251]
[431,1,430,92235,13158860,1404708305]
[432,1,431,92665,13251095,1417867165]
[433,1,432,93096,13343760,1431118260]
[434,1,433,93528,13436856,1444462020]
[435,1,434,93961,13530384,1457898876]
[436,1,435,94395,13624345,1471429260]
[437,1,436,94830,13718740,1485053605]
[438,1,437,95266,13813570,1498772345]
[439,1,438,95703,13908836,1512585915]
[440,1,439,96141,14004539,1526494751]
[441,1,440,96580,14100680,1540499290]
[442,1,441,97020,14197260,1554599970]
[443,1,442,97461,14294280,1568797230]
[444,1,443,97903,14391741,1583091510]
[445,1,444,98346,14489644,1597483251]
[446,1,445,98790,14587990,1611972895]
[447,1,446,99235,14686780,1626560885]
[448,1,447,99681,14786015,1641247665]
[449,1,448,100128,14885696,1656033680]
[450,1,449,100576,14985824,1670919376]
[451,1,450,101025,15086400,1685905200]
[452,1,451,101475,15187425,1700991600]
[453,1,452,101926,15288900,1716179025]
[454,1,453,102378,15390826,1731467925]
[455,1,454,102831,15493204,1746858751]
[456,1,455,103285,15596035,1762351955]
[457,1,456,103740,15699320,1777947990]
[458,1,457,104196,15803060,1793647310]
[459,1,458,104653,15907256,1809450370]
[460,1,459,105111,16011909,1825357626]
[461,1,460,105570,16117020,1841369535]
[462,1,461,106030,16222590,1857486555]
[463,1,462,106491,16328620,1873709145]
[464,1,463,106953,16435111,1890037765]
[465,1,464,107416,16542064,1906472876]
[466,1,465,107880,16649480,1923014940]
[467,1,466,108345,16757360,1939664420]
[468,1,467,108811,16865705,1956421780]
[469,1,468,109278,16974516,1973287485]
[470,1,469,109746,17083794,1990262001]
[471,1,470,110215,17193540,2007345795]
[472,1,471,110685,17303755,2024539335]
[473,1,472,111156,17414440,2041843090]
[474,1,473,111628,17525596,2059257530]
[475,1,474,112101,17637224,2076783126]
[476,1,475,112575,17749325,2094420350]
[477,1,476,113050,17861900,2112169675]
[478,1,477,113526,17974950,2130031575]
[479,1,478,114003,18088476,2148006525]
[480,1,479,114481,18202479,2166095001]
[481,1,480,114960,18316960,2184297480]
[482,1,481,115440,18431920,2202614440]
[483,1,482,115921,18547360,2221046360]
[484,1,483,116403,18663281,2239593720]
[485,1,484,116886,18779684,2258257001]
[486,1,485,117370,18896570,2277036685]
[487,1,486,117855,19013940,2295933255]
[488,1,487,118341,19131795,2314947195]
[489,1,488,118828,19250136,2334078990]
[490,1,489,119316,19368964,2353329126]
[491,1,490,119805,19488280,2372698090]
[492,1,491,120295,19608085,2392186370]
[493,1,492,120786,19728380,2411794455]
[494,1,493,121278,19849166,2431522835]
[495,1,494,121771,19970444,2451372001]
[496,1,495,122265,20092215,2471342445]
[497,1,496,122760,20214480,2491434660]
[498,1,497,123256,20337240,2511649140]
[499,1,498,123753,20460496,2531986380]
[500,1,499,124251,20584249,2552446876]
[501,1,500,124750,20708500,2573031125]
[502,1,501,125250,20833250,2593739625]
[503,1,502,125751,20958500,2614572875]
[504,1,503,126253,21084251,2635531375]
[505,1,504,126756,21210504,2656615626]
[506,1,505,127260,21337260,2677826130]
[507,1,506,127765,21464520,2699163390]
[508,1,507,128271,21592285,2720627910]
[509,1,508,128778,21720556,2742220195]
[510,1,509,129286,21849334,2763940751]
[511,1,510,129795,21978620,2785790085]
[512,1,511,130305,22108415,2807768705]
[513,1,512,130816,22238720,2829877120]
[514,1,513,131328,22369536,2852115840]
[515,1,514,131841,22500864,2874485376]
[516,1,515,132355,22632705,2896986240]
[517,1,516,132870,22765060,2919618945]
[518,1,517,133386,22897930,2942384005]
[519,1,518,133903,23031316,2965281935]
[520,1,519,134421,23165219,2988313251]
[521,1,520,134940,23299640,3011478470]
[522,1,521,135460,23434580,3034778110]
[523,1,522,135981,23570040,3058212690]
[524,1,523,136503,23706021,3081782730]
[525,1,524,137026,23842524,3105488751]
[526,1,525,137550,23979550,3129331275]
[527,1,526,138075,24117100,3153310825]
[528,1,527,138601,24255175,3177427925]
[529,1,528,139128,24393776,3201683100]
[530,1,529,139656,24532904,3226076876]
[531,1,530,140185,24672560,3250609780]
[532,1,531,140715,24812745,3275282340]
[533,1,532,141246,24953460,3300095085]
[534,1,533,141778,25094706,3325048545]
[535,1,534,142311,25236484,3350143251]
[536,1,535,142845,25378795,3375379735]
[537,1,536,143380,25521640,3400758530]
[538,1,537,143916,25665020,3426280170]
[539,1,538,144453,25808936,3451945190]
[540,1,539,144991,25953389,3477754126]
[541,1,540,145530,26098380,3503707515]
[542,1,541,146070,26243910,3529805895]
[543,1,542,146611,26389980,3556049805]
[544,1,543,147153,26536591,3582439785]
[545,1,544,147696,26683744,3608976376]
[546,1,545,148240,26831440,3635660120]
[547,1,546,148785,26979680,3662491560]
[548,1,547,149331,27128465,3689471240]
[549,1,548,149878,27277796,3716599705]
[550,1,549,150426,27427674,3743877501]
[551,1,550,150975,27578100,3771305175]
[552,1,551,151525,27729075,3798883275]
[553,1,552,152076,27880600,3826612350]
[554,1,553,152628,28032676,3854492950]
[555,1,554,153181,28185304,3882525626]
[556,1,555,153735,28338485,3910710930]
[557,1,556,154290,28492220,3939049415]
[558,1,557,154846,28646510,3967541635]
[559,1,558,155403,28801356,3996188145]
[560,1,559,155961,28956759,4024989501]
[561,1,560,156520,29112720,4053946260]
[562,1,561,157080,29269240,4083058980]
[563,1,562,157641,29426320,4112328220]
[564,1,563,158203,29583961,4141754540]
[565,1,564,158766,29742164,4171338501]
[566,1,565,159330,29900930,4201080665]
[567,1,566,159895,30060260,4230981595]
[568,1,567,160461,30220155,4261041855]
[569,1,568,161028,30380616,4291262010]
[570,1,569,161596,30541644,4321642626]
[571,1,570,162165,30703240,4352184270]
[572,1,571,162735,30865405,4382887510]
[573,1,572,163306,31028140,4413752915]
[574,1,573,163878,31191446,4444781055]
[575,1,574,164451,31355324,4475972501]
[576,1,575,165025,31519775,4507327825]
[577,1,576,165600,31684800,4538847600]
[578,1,577,166176,31850400,4570532400]
[579,1,578,166753,32016576,4602382800]
[580,1,579,167331,32183329,4634399376]
[581,1,580,167910,32350660,4666582705]
[582,1,581,168490,32518570,4698933365]
[583,1,582,169071,32687060,4731451935]
[584,1,583,169653,32856131,4764138995]
[585,1,584,170236,33025784,4796995126]
[586,1,585,170820,33196020,4830020910]
[587,1,586,171405,33366840,4863216930]
[588,1,587,171991,33538245,4896583770]
[589,1,588,172578,33710236,4930122015]
[590,1,589,173166,33882814,4963832251]
[591,1,590,173755,34055980,4997715065]
[592,1,591,174345,34229735,5031771045]
[593,1,592,174936,34404080,5066000780]
[594,1,593,175528,34579016,5100404860]
[595,1,594,176121,34754544,5134983876]
[596,1,595,176715,34930665,5169738420]
[597,1,596,177310,35107380,5204669085]
[598,1,597,177906,35284690,5239776465]
[599,1,598,178503,35462596,5275061155]
[600,1,599,179101,35641099,5310523751]
[601,1,600,179700,35820200,5346164850]
[602,1,601,180300,35999900,5381985050]
[603,1,602,180901,36180200,5417984950]
[604,1,603,181503,36361101,5454165150]
[605,1,604,182106,36542604,5490526251]
[606,1,605,182710,36724710,5527068855]
[607,1,606,183315,36907420,5563793565]
[608,1,607,183921,37090735,5600700985]
[609,1,608,184528,37274656,5637791720]
[610,1,609,185136,37459184,5675066376]
[611,1,610,185745,37644320,5712525560]
[612,1,611,186355,37830065,5750169880]
[613,1,612,186966,38016420,5787999945]
[614,1,613,187578,38203386,5826016365]
[615,1,614,188191,38390964,5864219751]
[616,1,615,188805,38579155,5902610715]
[617,1,616,189420,38767960,5941189870]
[618,1,617,190036,38957380,5979957830]
[619,1,618,190653,39147416,6018915210]
[620,1,619,191271,39338069,6058062626]
[621,1,620,191890,39529340,6097400695]
[622,1,621,192510,39721230,6136930035]
[623,1,622,193131,39913740,6176651265]
[624,1,623,193753,40106871,6216565005]
[625,1,624,194376,40300624,6256671876]
[626,1,625,195000,40495000,6296972500]
[627,1,626,195625,40690000,6337467500]
[628,1,627,196251,40885625,6378157500]
[629,1,628,196878,41081876,6419043125]
[630,1,629,197506,41278754,6460125001]
[631,1,630,198135,41476260,6501403755]
[632,1,631,198765,41674395,6542880015]
[633,1,632,199396,41873160,6584554410]
[634,1,633,200028,42072556,6626427570]
[635,1,634,200661,42272584,6668500126]
[636,1,635,201295,42473245,6710772710]
[637,1,636,201930,42674540,6753245955]
[638,1,637,202566,42876470,6795920495]
[639,1,638,203203,43079036,6838796965]
[640,1,639,203841,43282239,6881876001]
[641,1,640,204480,43486080,6925158240]
[642,1,641,205120,43690560,6968644320]
[643,1,642,205761,43895680,7012334880]
[644,1,643,206403,44101441,7056230560]
[645,1,644,207046,44307844,7100332001]
[646,1,645,207690,44514890,7144639845]
[647,1,646,208335,44722580,7189154735]
[648,1,647,208981,44930915,7233877315]
[649,1,648,209628,45139896,7278808230]
[650,1,649,210276,45349524,7323948126]
[651,1,650,210925,45559800,7369297650]
[652,1,651,211575,45770725,7414857450]
[653,1,652,212226,45982300,7460628175]
[654,1,653,212878,46194526,7506610475]
[655,1,654,213531,46407404,7552805001]
[656,1,655,214185,46620935,7599212405]
[657,1,656,214840,46835120,7645833340]
[658,1,657,215496,47049960,7692668460]
[659,1,658,216153,47265456,7739718420]
[660,1,659,216811,47481609,7786983876]
[661,1,660,217470,47698420,7834465485]
[662,1,661,218130,47915890,7882163905]
[663,1,662,218791,48134020,7930079795]
[664,1,663,219453,48352811,7978213815]
[665,1,664,220116,48572264,8026566626]
[666,1,665,220780,48792380,8075138890]
[667,1,666,221445,49013160,8123931270]
[668,1,667,222111,49234605,8172944430]
[669,1,668,222778,49456716,8222179035]
[670,1,669,223446,49679494,8271635751]
[671,1,670,224115,49902940,8321315245]
[672,1,671,224785,50127055,8371218185]
[673,1,672,225456,50351840,8421345240]
[674,1,673,226128,50577296,8471697080]
[675,1,674,226801,50803424,8522274376]
[676,1,675,227475,51030225,8573077800]
[677,1,676,228150,51257700,8624108025]
[678,1,677,228826,51485850,8675365725]
[679,1,678,229503,51714676,8726851575]
[680,1,679,230181,51944179,8778566251]
[681,1,680,230860,52174360,8830510430]
[682,1,681,231540,52405220,8882684790]
[683,1,682,232221,52636760,8935090010]
[684,1,683,232903,52868981,8987726770]
[685,1,684,233586,53101884,9040595751]
[686,1,685,234270,53335470,9093697635]
[687,1,686,234955,53569740,9147033105]
[688,1,687,235641,53804695,9200602845]
[689,1,688,236328,54040336,9254407540]
[690,1,689,237016,54276664,9308447876]
[691,1,690,237705,54513680,9362724540]
[692,1,691,238395,54751385,9417238220]
[693,1,692,239086,54989780,9471989605]
[694,1,693,239778,55228866,9526979385]
[695,1,694,240471,55468644,9582208251]
[696,1,695,241165,55709115,9637676895]
[697,1,696,241860,55950280,9693386010]
[698,1,697,242556,56192140,9749336290]
[699,1,698,243253,56434696,9805528430]
[700,1,699,243951,56677949,9861963126]
[701,1,700,244650,56921900,9918641075]
[702,1,701,245350,57166550,9975562975]
[703,1,702,246051,57411900,10032729525]
[704,1,703,246753,57657951,10090141425]
[705,1,704,247456,57904704,10147799376]
[706,1,705,248160,58152160,10205704080]
[707,1,706,248865,58400320,10263856240]
[708,1,707,249571,58649185,10322256560]
[709,1,708,250278,58898756,10380905745]
[710,1,709,250986,59149034,10439804501]
[711,1,710,251695,59400020,10498953535]
[712,1,711,252405,59651715,10558353555]
[713,1,712,253116,59904120,10618005270]
[714,1,713,253828,60157236,10677909390]
[715,1,714,254541,60411064,10738066626]
[716,1,715,255255,60665605,10798477690]
[717,1,716,255970,60920860,10859143295]
[718,1,717,256686,61176830,10920064155]
[719,1,718,257403,61433516,10981240985]
[720,1,719,258121,61690919,11042674501]
[721,1,720,258840,61949040,11104365420]
[722,1,721,259560,62207880,11166314460]
[723,1,722,260281,62467440,11228522340]
[724,1,723,261003,62727721,11290989780]
[725,1,724,261726,62988724,11353717501]
[726,1,725,262450,63250450,11416706225]
[727,1,726,263175,63512900,11479956675]
[728,1,727,263901,63776075,11543469575]
[729,1,728,264628,64039976,11607245650]
[730,1,729,265356,64304604,11671285626]
[731,1,730,266085,64569960,11735590230]
[732,1,731,266815,64836045,11800160190]
[733,1,732,267546,65102860,11864996235]
[734,1,733,268278,65370406,11930099095]
[735,1,734,269011,65638684,11995469501]
[736,1,735,269745,65907695,12061108185]
[737,1,736,270480,66177440,12127015880]
[738,1,737,271216,66447920,12193193320]
[739,1,738,271953,66719136,12259641240]
[740,1,739,272691,66991089,12326360376]
[741,1,740,273430,67263780,12393351465]
[742,1,741,274170,67537210,12460615245]
[743,1,742,274911,67811380,12528152455]
[744,1,743,275653,68086291,12595963835]
[745,1,744,276396,68361944,12664050126]
[746,1,745,277140,68638340,12732412070]
[747,1,746,277885,68915480,12801050410]
[748,1,747,278631,69193365,12869965890]
[749,1,748,279378,69471996,12939159255]
[750,1,749,280126,69751374,13008631251]
[751,1,750,280875,70031500,13078382625]
[752,1,751,281625,70312375,13148414125]
[753,1,752,282376,70594000,13218726500]
[754,1,753,283128,70876376,13289320500]
[755,1,754,283881,71159504,13360196876]
[756,1,755,284635,71443385,13431356380]
[757,1,756,285390,71728020,13502799765]
[758,1,757,286146,72013410,13574527785]
[759,1,758,286903,72299556,13646541195]
[760,1,759,287661,72586459,13718840751]
[761,1,760,288420,72874120,13791427210]
[762,1,761,289180,73162540,13864301330]
[763,1,762,289941,73451720,13937463870]
[764,1,763,290703,73741661,14010915590]
[765,1,764,291466,74032364,14084657251]
[766,1,765,292230,74323830,14158689615]
[767,1,766,292995,74616060,14233013445]
[768,1,767,293761,74909055,14307629505]
[769,1,768,294528,75202816,14382538560]
[770,1,769,295296,75497344,14457741376]
[771,1,770,296065,75792640,14533238720]
[772,1,771,296835,76088705,14609031360]
[773,1,772,297606,76385540,14685120065]
[774,1,773,298378,76683146,14761505605]
[775,1,774,299151,76981524,14838188751]
[776,1,775,299925,77280675,14915170275]
[777,1,776,300700,77580600,14992450950]
[778,1,777,301476,77881300,15070031550]
[779,1,778,302253,78182776,15147912850]
[780,1,779,303031,78485029,15226095626]
[781,1,780,303810,78788060,15304580655]
[782,1,781,304590,79091870,15383368715]
[783,1,782,305371,79396460,15462460585]
[784,1,783,306153,79701831,15541857045]
[785,1,784,306936,80007984,15621558876]
[786,1,785,307720,80314920,15701566860]
[787,1,786,308505,80622640,15781881780]
[788,1,787,309291,80931145,15862504420]
[789,1,788,310078,81240436,15943435565]
[790,1,789,310866,81550514,16024676001]
[791,1,790,311655,81861380,16106226515]
[792,1,791,312445,82173035,16188087895]
[793,1,792,313236,82485480,16270260930]
[794,1,793,314028,82798716,16352746410]
[795,1,794,314821,83112744,16435545126]
[796,1,795,315615,83427565,16518657870]
[797,1,796,316410,83743180,16602085435]
[798,1,797,317206,84059590,16685828615]
[799,1,798,318003,84376796,16769888205]
[800,1,799,318801,84694799,16854265001]
[801,1,800,319600,85013600,16938959800]
[802,1,801,320400,85333200,17023973400]
[803,1,802,321201,85653600,17109306600]
[804,1,803,322003,85974801,17194960200]
[805,1,804,322806,86296804,17280935001]
[806,1,805,323610,86619610,17367231805]
[807,1,806,324415,86943220,17453851415]
[808,1,807,325221,87267635,17540794635]
[809,1,808,326028,87592856,17628062270]
[810,1,809,326836,87918884,17715655126]
[811,1,810,327645,88245720,17803574010]
[812,1,811,328455,88573365,17891819730]
[813,1,812,329266,88901820,17980393095]
[814,1,813,330078,89231086,18069294915]
[815,1,814,330891,89561164,18158526001]
[816,1,815,331705,89892055,18248087165]
[817,1,816,332520,90223760,18337979220]
[818,1,817,333336,90556280,18428202980]
[819,1,818,334153,90889616,18518759260]
[820,1,819,334971,91223769,18609648876]
[821,1,820,335790,91558740,18700872645]
[822,1,821,336610,91894530,18792431385]
[823,1,822,337431,92231140,18884325915]
[824,1,823,338253,92568571,18976557055]
[825,1,824,339076,92906824,19069125626]
[826,1,825,339900,93245900,19162032450]
[827,1,826,340725,93585800,19255278350]
[828,1,827,341551,93926525,19348864150]
[829,1,828,342378,94268076,19442790675]
[830,1,829,343206,94610454,19537058751]
[831,1,830,344035,94953660,19631669205]
[832,1,831,344865,95297695,19726622865]
[833,1,832,345696,95642560,19821920560]
[834,1,833,346528,95988256,19917563120]
[835,1,834,347361,96334784,20013551376]
[836,1,835,348195,96682145,20109886160]
[837,1,836,349030,97030340,20206568305]
[838,1,837,349866,97379370,20303598645]

{"sheet":"PivotSheet","index":3,"n_rows":366,"n_cols":4,"rows_kept":366,"cut":false,"hidden":true,"merged":[]}
["Data","Count of Data",null,"Pivot Index"]
[2,1,null,{"$f":"IF(A2=\"\",\"\",1)","v":1}]
[3,2,null,{"$f":"IF(A3=\"\",\"\",D2+1)","v":2}]
[4,1,null,{"$f":"IF(A4=\"\",\"\",D3+1)","v":3}]
[5,1,null,4]
[6,1,null,5]
[10,2,null,6]
[11,1,null,7]
[12,1,null,8]
[14,1,null,9]
[15,1,null,10]
[17,1,null,11]
[21,1,null,12]
[22,1,null,13]
[25,1,null,14]
[28,1,null,15]
[29,3,null,16]
[30,2,null,17]
[34,1,null,18]
[39,2,null,19]
[41,1,null,20]
[42,1,null,21]
[45,2,null,22]
[47,1,null,23]
[49,1,null,24]
[50,1,null,25]
[51,1,null,26]
[53,1,null,27]
[54,1,null,28]
[55,1,null,29]
[61,1,null,30]
[62,2,null,31]
[63,1,null,32]
[66,1,null,33]
[67,1,null,34]
[68,1,null,35]
[69,2,null,36]
[72,1,null,37]
[75,2,null,38]
[78,1,null,39]
[79,2,null,40]
[82,3,null,41]
[84,1,null,42]
[85,2,null,43]
[87,2,null,44]
[88,2,null,45]
[89,3,null,46]
[90,1,null,47]
[94,1,null,48]
[97,1,null,49]
[98,1,null,50]
[99,1,null,51]
[100,1,null,52]
[102,2,null,53]
[104,2,null,54]
[106,3,null,55]
[108,1,null,56]
[109,1,null,57]
[110,1,null,58]
[111,1,null,59]
[114,1,null,60]
[118,1,null,61]
[121,1,null,62]
[122,2,null,63]
[123,3,null,64]
[125,2,null,65]
[127,1,null,66]
[128,1,null,{"$f":"IF(A68=\"\",\"\",D67+1)","v":67}]
[129,1,null,68]
[133,1,null,69]
[135,1,null,70]
[137,3,null,71]
[139,1,null,72]
[140,1,null,73]
[141,2,null,74]
[144,1,null,75]
[145,2,null,76]
[147,1,null,77]
[150,1,null,78]
[154,1,null,79]
[155,2,null,80]
[156,3,null,81]
[158,1,null,82]
[159,1,null,83]
[161,2,null,84]
[165,1,null,85]
[166,2,null,86]
[167,1,null,87]
[168,1,null,88]
[169,1,null,89]
[170,1,null,90]
[171,3,null,91]
[172,2,null,92]
[174,1,null,93]
[177,1,null,94]
[178,2,null,95]
[179,2,null,96]
[181,3,null,97]
[182,1,null,98]
[186,2,null,99]
[187,2,null,100]
[189,1,null,101]
[190,2,null,102]
[191,2,null,103]
[196,1,null,104]
[197,1,null,105]
[203,1,null,106]
[204,1,null,107]
[206,1,null,108]
[208,1,null,109]
[213,3,null,110]
[214,1,null,111]
[217,1,null,112]
[218,2,null,113]
[220,1,null,114]
[222,1,null,115]
[226,1,null,116]
[227,1,null,117]
[228,1,null,118]
[229,2,null,119]
[235,1,null,120]
[236,1,null,121]
[238,1,null,122]
[239,2,null,123]
[241,2,null,124]
[244,1,null,125]
[248,1,null,126]
[249,3,null,127]
[252,2,null,128]
[256,1,null,129]
[257,1,null,130]
[258,1,null,{"$f":"IF(A132=\"\",\"\",D131+1)","v":131}]
[260,1,null,132]
[264,1,null,133]
[265,1,null,134]
[266,1,null,135]
[267,2,null,136]
[269,2,null,137]
[270,1,null,138]
[273,1,null,139]
[275,1,null,140]
[277,1,null,141]
[278,1,null,142]
[280,1,null,143]
[282,1,null,144]
[286,1,null,145]
[289,2,null,146]
[291,1,null,147]
[292,3,null,148]
[293,1,null,149]
[294,1,null,150]
[295,4,null,151]
[296,1,null,152]
[297,2,null,153]
[301,1,null,154]
[302,1,null,155]
[303,1,null,156]
[305,1,null,157]
[306,1,null,158]
[308,1,null,159]
[309,1,null,160]
[310,1,null,161]
[313,1,null,162]
[314,1,null,163]
[315,1,null,164]
[319,1,null,165]
[321,1,null,166]
[324,1,null,167]
[326,2,null,168]
[327,1,null,169]
[328,2,null,170]
[329,2,null,171]
[330,1,null,172]
[332,3,null,173]
[334,1,null,174]
[335,1,null,175]
[337,2,null,176]
[338,1,null,177]
[339,2,null,178]
[343,1,null,179]
[345,2,null,180]
[346,2,null,181]
[347,1,null,182]
[349,1,null,183]
[350,1,null,184]
[351,1,null,185]
[353,1,null,186]
[354,1,null,187]
[356,2,null,188]
[359,1,null,189]
[361,1,null,190]
[362,3,null,191]
[363,1,null,192]
[365,1,null,193]
[366,1,null,194]
[368,1,null,{"$f":"IF(A196=\"\",\"\",D195+1)","v":195}]
[369,2,null,196]
[373,1,null,197]
[375,1,null,198]
[376,1,null,199]
[378,1,null,200]
[380,1,null,201]
[381,1,null,202]
[382,1,null,203]
[383,1,null,204]
[385,1,null,205]
[388,1,null,206]
[389,1,null,207]
[390,2,null,208]
[391,1,null,209]
[392,1,null,210]
[393,1,null,211]
[394,1,null,212]
[395,1,null,213]
[398,1,null,214]
[399,2,null,215]
[403,1,null,216]
[405,1,null,217]
[406,1,null,218]
[408,1,null,219]
[411,3,null,220]
[416,1,null,221]
[417,2,null,222]
[418,1,null,223]
[419,1,null,224]
[421,1,null,225]
[423,1,null,226]
[428,1,null,227]
[435,2,null,228]
[439,1,null,229]
[441,1,null,230]
[447,1,null,231]
[449,1,null,232]
[453,3,null,233]
[455,1,null,234]
[459,2,null,235]
[460,1,null,236]
[461,1,null,237]
[466,1,null,238]
[467,1,null,239]
[469,2,null,240]
[475,1,null,241]
[476,3,null,242]
[480,1,null,243]
[483,1,null,244]
[484,1,null,245]
[485,1,null,246]
[487,1,null,247]
[488,3,null,248]
[489,2,null,249]
[490,1,null,250]
[494,1,null,251]
[496,1,null,252]
[497,1,null,253]
[498,2,null,254]
["(blank)",null,null,255]
[null,null,null,""]
[null,null,null,""]
[null,null,null,""]
[null,null,null,{"$f":"IF(A260=\"\",\"\",D259+1)","v":""}]
[null,null,null,""]
[null,null,null,""]
[null,null,null,""]
[null,null,null,""]
[null,null,null,""]
[null,null,null,""]
[null,null,null,""]
[null,null,null,""]
[null,null,null,""]
[null,null,null,""]
[null,null,null,""]
[null,null,null,""]
[null,null,null,""]
[null,null,null,""]
[null,null,null,""]
[null,null,null,""]
[null,null,null,""]
[null,null,null,""]
[null,null,null,""]
[null,null,null,""]
[null,null,null,""]
[null,null,null,""]
[null,null,null,""]
[null,null,null,""]
[null,null,null,""]
[null,null,null,""]
[null,null,null,""]
[null,null,null,""]
[null,null,null,""]
[null,null,null,""]
[null,null,null,""]
[null,null,null,""]
[null,null,null,""]
[null,null,null,""]
[null,null,null,""]
[null,null,null,""]
[null,null,null,""]
[null,null,null,""]
[null,null,null,""]
[null,null,null,""]
[null,null,null,""]
[null,null,null,""]
[null,null,null,""]
[null,null,null,""]
[null,null,null,""]
[null,null,null,""]
[null,null,null,""]
[null,null,null,""]
[null,null,null,""]
[null,null,null,""]
[null,null,null,""]
[null,null,null,""]
[null,null,null,""]
[null,null,null,""]
[null,null,null,""]
[null,null,null,""]
[null,null,null,""]
[null,null,null,""]
[null,null,null,""]
[null,null,null,""]
[null,null,null,""]
[null,null,null,""]
[null,null,null,""]
[null,null,null,{"$f":"IF(A324=\"\",\"\",D323+1)","v":""}]
[null,null,null,""]
[null,null,null,""]
[null,null,null,""]
[null,null,null,""]
[null,null,null,""]
[null,null,null,""]
[null,null,null,""]
[null,null,null,""]
[null,null,null,""]
[null,null,null,""]
[null,null,null,""]
[null,null,null,""]
[null,null,null,""]
[null,null,null,""]
[null,null,null,""]
[null,null,null,""]
[null,null,null,""]
[null,null,null,""]
[null,null,null,""]
[null,null,null,""]
[null,null,null,""]
[null,null,null,""]
[null,null,null,""]
[null,null,null,""]
[null,null,null,""]
[null,null,null,""]
[null,null,null,""]
[null,null,null,""]
[null,null,null,""]
[null,null,null,""]
[null,null,null,""]
[null,null,null,""]
[null,null,null,""]
[null,null,null,""]
[null,null,null,""]
[null,null,null,""]
[null,null,null,""]
[null,null,null,""]
[null,null,null,""]
[null,null,null,""]
[null,null,null,""]
[null,null,null,""]

{"sheet":"Jenks","index":4,"n_rows":366,"n_cols":22,"rows_kept":366,"cut":false,"hidden":true,"merged":[]}
["Data","Group","Frequency","Group 1","Group 2","Group 3","Group 4","Group 5","Cum. Freq"]
[{"$f":"PivotSheet!A2","v":2},"a",{"$f":"PivotSheet!B2","v":1},{"$f":"IF(B2=\"a\",1,NA())","v":1},{"$f":"IF(B2=\"b\",1,NA())","v":{"$error":"#N/A"}},{"$f":"IF(B2=\"c\",1,NA())","v":{"$error":"#N/A"}},{"$f":"IF(B2=\"d\",1,NA())","v":{"$error":"#N/A"}},{"$f":"IF(B2=\"e\",1,NA())","v":{"$error":"#N/A"}},{"$f":"C2/SUM($C$2:$C$10000)","v":2.881844380403458E-3},"2 levels of Intensity",null,null,null,null,null,null,null,null,null,"Group",null,"Std. Dev"]
[{"$f":"PivotSheet!A3","v":3},"a",{"$f":"PivotSheet!B3","v":2},{"$f":"IF(B3=\"a\",1,NA())","v":1},{"$f":"IF(B3=\"b\",1,NA())","v":{"$error":"#N/A"}},{"$f":"IF(B3=\"c\",1,NA())","v":{"$error":"#N/A"}},{"$f":"IF(B3=\"d\",1,NA())","v":{"$error":"#N/A"}},{"$f":"IF(B3=\"e\",1,NA())","v":{"$error":"#N/A"}},{"$f":"C3/SUM($C$2:$C$10000)+I2","v":8.6455331412103736E-3},null,"Min Value","Max Value",null,null,null,null,null,null,null,"a","Min Value",{"$f":"INDEX($K$4:$L$26,MATCH(1,(Data!$F$2=$M$4:$M$26)*(T3=$N$4:$N$26),0),MATCH(U3,$K$3:$L$3,0))","v":2}]
[{"$f":"PivotSheet!A4","v":4},"a",{"$f":"PivotSheet!B4","v":1},1,{"$error":"#N/A"},{"$error":"#N/A"},{"$error":"#N/A"},{"$error":"#N/A"},{"$f":"C4/SUM($C$2:$C$10000)+I3","v":1.1527377521613832E-2},"A-Size",{"$f":"MIN(IF($B$2:$B$365=\"A\",$A$2:$A$365))","v":2},{"$f":"MAX(IF($B$2:$B$365=\"A\",$A$2:$A$365))","v":161},2,"a",null,null,null,null,null,"a","Max Value",{"$f":"INDEX($K$4:$L$26,MATCH(1,(Data!$F$2=$M$4:$M$26)*(T4=$N$4:$N$26),0),MATCH(U4,$K$3:$L$3,0))","v":161}]
[{"$f":"PivotSheet!A5","v":5},"a",{"$f":"PivotSheet!B5","v":1},1,{"$error":"#N/A"},{"$error":"#N/A"},{"$error":"#N/A"},{"$error":"#N/A"},1.4409221902017291E-2,"B-Size",{"$f":"MIN(IF($B$2:$B$365=\"B\",$A$2:$A$365))","v":165},{"$f":"MAX(IF($B$2:$B$365=\"B\",$A$2:$A$365))","v":321},2,"b",null,null,null,null,null,"b","Min Value",{"$f":"INDEX($K$4:$L$26,MATCH(1,(Data!$F$2=$M$4:$M$26)*(T5=$N$4:$N$26),0),MATCH(U5,$K$3:$L$3,0))","v":165}]
[{"$f":"PivotSheet!A6","v":6},"a",{"$f":"PivotSheet!B6","v":1},1,{"$error":"#N/A"},{"$error":"#N/A"},{"$error":"#N/A"},{"$error":"#N/A"},1.7291066282420747E-2,null,null,null,null,null,null,null,null,null,null,"b","Max Value",{"$f":"INDEX($K$4:$L$26,MATCH(1,(Data!$F$2=$M$4:$M$26)*(T6=$N$4:$N$26),0),MATCH(U6,$K$3:$L$3,0))","v":321}]
[{"$f":"PivotSheet!A7","v":10},"a",{"$f":"PivotSheet!B7","v":2},1,{"$error":"#N/A"},{"$error":"#N/A"},{"$error":"#N/A"},{"$error":"#N/A"},2.3054755043227664E-2,"3 Levels of Intensity",null,null,null,null,null,null,null,null,null,"c","Min Value",{"$f":"INDEX($K$4:$L$26,MATCH(1,(Data!$F$2=$M$4:$M$26)*(T7=$N$4:$N$26),0),MATCH(U7,$K$3:$L$3,0))","v":324}]
[{"$f":"PivotSheet!A8","v":11},"a",{"$f":"PivotSheet!B8","v":1},1,{"$error":"#N/A"},{"$error":"#N/A"},{"$error":"#N/A"},{"$error":"#N/A"},2.5936599423631121E-2,null,null,null,null,null,null,null,null,null,null,"c","Max Value",{"$f":"INDEX($K$4:$L$26,MATCH(1,(Data!$F$2=$M$4:$M$26)*(T8=$N$4:$N$26),0),MATCH(U8,$K$3:$L$3,0))","v":498}]
[{"$f":"PivotSheet!A9","v":12},"a",{"$f":"PivotSheet!B9","v":1},1,{"$error":"#N/A"},{"$error":"#N/A"},{"$error":"#N/A"},{"$error":"#N/A"},2.8818443804034578E-2,"A-Size",{"$f":"MIN(IF($B$2:$B$365=\"A\",$A$2:$A$365))","v":2},{"$f":"MAX(IF($B$2:$B$365=\"A\",$A$2:$A$365))","v":161},3,"a",null,null,null,null,null,"d","Min Value",{"$f":"INDEX($K$4:$L$26,MATCH(1,(Data!$F$2=$M$4:$M$26)*(T9=$N$4:$N$26),0),MATCH(U9,$K$3:$L$3,0))","v":{"$error":"#N/A"}}]
[{"$f":"PivotSheet!A10","v":14},"a",{"$f":"PivotSheet!B10","v":1},1,{"$error":"#N/A"},{"$error":"#N/A"},{"$error":"#N/A"},{"$error":"#N/A"},3.1700288184438034E-2,"B-Size",{"$f":"MIN(IF($B$2:$B$365=\"B\",$A$2:$A$365))","v":165},{"$f":"MAX(IF($B$2:$B$365=\"B\",$A$2:$A$365))","v":321},3,"b",null,null,null,null,null,"d","Max Value",{"$f":"INDEX($K$4:$L$26,MATCH(1,(Data!$F$2=$M$4:$M$26)*(T10=$N$4:$N$26),0),MATCH(U10,$K$3:$L$3,0))","v":{"$error":"#N/A"}}]
[{"$f":"PivotSheet!A11","v":15},"a",{"$f":"PivotSheet!B11","v":1},1,{"$error":"#N/A"},{"$error":"#N/A"},{"$error":"#N/A"},{"$error":"#N/A"},3.4582132564841495E-2,"C-Size",{"$f":"MIN(IF($B$2:$B$365=\"C\",$A$2:$A$365))","v":324},{"$f":"MAX(IF($B$2:$B$365=\"C\",$A$2:$A$365))","v":498},3,"c",null,null,null,null,null,"e","Min Value",{"$f":"INDEX($K$4:$L$26,MATCH(1,(Data!$F$2=$M$4:$M$26)*(T11=$N$4:$N$26),0),MATCH(U11,$K$3:$L$3,0))","v":{"$error":"#N/A"}}]
[{"$f":"PivotSheet!A12","v":17},"a",{"$f":"PivotSheet!B12","v":1},1,{"$error":"#N/A"},{"$error":"#N/A"},{"$error":"#N/A"},{"$error":"#N/A"},3.7463976945244955E-2,null,null,null,null,null,null,null,null,null,null,"e","Max Value",{"$f":"INDEX($K$4:$L$26,MATCH(1,(Data!$F$2=$M$4:$M$26)*(T12=$N$4:$N$26),0),MATCH(U12,$K$3:$L$3,0))","v":{"$error":"#N/A"}}]
[{"$f":"PivotSheet!A13","v":21},"a",{"$f":"PivotSheet!B13","v":1},1,{"$error":"#N/A"},{"$error":"#N/A"},{"$error":"#N/A"},{"$error":"#N/A"},4.0345821325648415E-2,"4 Levels of Intensity"]
[{"$f":"PivotSheet!A14","v":22},"a",{"$f":"PivotSheet!B14","v":1},1,{"$error":"#N/A"},{"$error":"#N/A"},{"$error":"#N/A"},{"$error":"#N/A"},4.3227665706051875E-2]
[{"$f":"PivotSheet!A15","v":25},"a",{"$f":"PivotSheet!B15","v":1},1,{"$error":"#N/A"},{"$error":"#N/A"},{"$error":"#N/A"},{"$error":"#N/A"},4.6109510086455335E-2,"A-Size",{"$f":"MIN(IF($B$2:$B$365=\"A\",$A$2:$A$365))","v":2},{"$f":"MAX(IF($B$2:$B$365=\"A\",$A$2:$A$365))","v":161},4,"a"]
[{"$f":"PivotSheet!A16","v":28},"a",{"$f":"PivotSheet!B16","v":1},1,{"$error":"#N/A"},{"$error":"#N/A"},{"$error":"#N/A"},{"$error":"#N/A"},4.8991354466858796E-2,"B-Size",{"$f":"MIN(IF($B$2:$B$365=\"B\",$A$2:$A$365))","v":165},{"$f":"MAX(IF($B$2:$B$365=\"B\",$A$2:$A$365))","v":321},4,"b"]
[{"$f":"PivotSheet!A17","v":29},"a",{"$f":"PivotSheet!B17","v":3},1,{"$error":"#N/A"},{"$error":"#N/A"},{"$error":"#N/A"},{"$error":"#N/A"},5.7636887608069169E-2,"C-Size",{"$f":"MIN(IF($B$2:$B$365=\"C\",$A$2:$A$365))","v":324},{"$f":"MAX(IF($B$2:$B$365=\"C\",$A$2:$A$365))","v":498},4,"c"]
[{"$f":"PivotSheet!A18","v":30},"a",{"$f":"PivotSheet!B18","v":2},1,{"$error":"#N/A"},{"$error":"#N/A"},{"$error":"#N/A"},{"$error":"#N/A"},6.3400576368876083E-2,"D-Size",{"$f":"MIN(IF($B$2:$B$365=\"D\",$A$2:$A$365))","v":0},{"$f":"MAX(IF($B$2:$B$365=\"D\",$A$2:$A$365))","v":0},4,"d"]
[{"$f":"PivotSheet!A19","v":34},"a",{"$f":"PivotSheet!B19","v":1},1,{"$error":"#N/A"},{"$error":"#N/A"},{"$error":"#N/A"},{"$error":"#N/A"},6.6282420749279536E-2]
[{"$f":"PivotSheet!A20","v":39},"a",{"$f":"PivotSheet!B20","v":2},1,{"$error":"#N/A"},{"$error":"#N/A"},{"$error":"#N/A"},{"$error":"#N/A"},7.2046109510086456E-2,"5 Levels of Intensity"]
[{"$f":"PivotSheet!A21","v":41},"a",{"$f":"PivotSheet!B21","v":1},1,{"$error":"#N/A"},{"$error":"#N/A"},{"$error":"#N/A"},{"$error":"#N/A"},7.492795389048991E-2]
[{"$f":"PivotSheet!A22","v":42},"a",{"$f":"PivotSheet!B22","v":1},1,{"$error":"#N/A"},{"$error":"#N/A"},{"$error":"#N/A"},{"$error":"#N/A"},7.7809798270893363E-2,"A-Size",{"$f":"MIN(IF($B$2:$B$365=\"A\",$A$2:$A$365))","v":2},{"$f":"MAX(IF($B$2:$B$365=\"A\",$A$2:$A$365))","v":161},5,"a"]
[{"$f":"PivotSheet!A23","v":45},"a",{"$f":"PivotSheet!B23","v":2},1,{"$error":"#N/A"},{"$error":"#N/A"},{"$error":"#N/A"},{"$error":"#N/A"},8.3573487031700283E-2,"B-Size",{"$f":"MIN(IF($B$2:$B$365=\"B\",$A$2:$A$365))","v":165},{"$f":"MAX(IF($B$2:$B$365=\"B\",$A$2:$A$365))","v":321},5,"b"]
[{"$f":"PivotSheet!A24","v":47},"a",{"$f":"PivotSheet!B24","v":1},1,{"$error":"#N/A"},{"$error":"#N/A"},{"$error":"#N/A"},{"$error":"#N/A"},8.6455331412103736E-2,"C-Size",{"$f":"MIN(IF($B$2:$B$365=\"C\",$A$2:$A$365))","v":324},{"$f":"MAX(IF($B$2:$B$365=\"C\",$A$2:$A$365))","v":498},5,"c"]
[{"$f":"PivotSheet!A25","v":49},"a",{"$f":"PivotSheet!B25","v":1},1,{"$error":"#N/A"},{"$error":"#N/A"},{"$error":"#N/A"},{"$error":"#N/A"},8.933717579250719E-2,"D-Size",{"$f":"MIN(IF($B$2:$B$365=\"D\",$A$2:$A$365))","v":0},{"$f":"MAX(IF($B$2:$B$365=\"D\",$A$2:$A$365))","v":0},5,"d"]
[{"$f":"PivotSheet!A26","v":50},"a",{"$f":"PivotSheet!B26","v":1},1,{"$error":"#N/A"},{"$error":"#N/A"},{"$error":"#N/A"},{"$error":"#N/A"},9.2219020172910643E-2,"E-size",{"$f":"MIN(IF($B$2:$B$365=\"E\",$A$2:$A$365))","v":0},{"$f":"MAX(IF($B$2:$B$365=\"E\",$A$2:$A$365))","v":0},5,"e"]
[{"$f":"PivotSheet!A27","v":51},"a",{"$f":"PivotSheet!B27","v":1},1,{"$error":"#N/A"},{"$error":"#N/A"},{"$error":"#N/A"},{"$error":"#N/A"},9.5100864553314096E-2]
[{"$f":"PivotSheet!A28","v":53},"a",{"$f":"PivotSheet!B28","v":1},1,{"$error":"#N/A"},{"$error":"#N/A"},{"$error":"#N/A"},{"$error":"#N/A"},9.7982708933717549E-2]
[{"$f":"PivotSheet!A29","v":54},"a",{"$f":"PivotSheet!B29","v":1},1,{"$error":"#N/A"},{"$error":"#N/A"},{"$error":"#N/A"},{"$error":"#N/A"},0.100864553314121]
[{"$f":"PivotSheet!A30","v":55},"a",{"$f":"PivotSheet!B30","v":1},1,{"$error":"#N/A"},{"$error":"#N/A"},{"$error":"#N/A"},{"$error":"#N/A"},0.10374639769452446]
[{"$f":"PivotSheet!A31","v":61},"a",{"$f":"PivotSheet!B31","v":1},1,{"$error":"#N/A"},{"$error":"#N/A"},{"$error":"#N/A"},{"$error":"#N/A"},0.10662824207492791]
[{"$f":"PivotSheet!A32","v":62},"a",{"$f":"PivotSheet!B32","v":2},1,{"$error":"#N/A"},{"$error":"#N/A"},{"$error":"#N/A"},{"$error":"#N/A"},0.11239193083573483]
[{"$f":"PivotSheet!A33","v":63},"a",{"$f":"PivotSheet!B33","v":1},1,{"$error":"#N/A"},{"$error":"#N/A"},{"$error":"#N/A"},{"$error":"#N/A"},0.11527377521613828]
[{"$f":"PivotSheet!A34","v":66},"a",{"$f":"PivotSheet!B34","v":1},1,{"$error":"#N/A"},{"$error":"#N/A"},{"$error":"#N/A"},{"$error":"#N/A"},0.11815561959654174]
[{"$f":"PivotSheet!A35","v":67},"a",{"$f":"PivotSheet!B35","v":1},1,{"$error":"#N/A"},{"$error":"#N/A"},{"$error":"#N/A"},{"$error":"#N/A"},0.12103746397694519]
[{"$f":"PivotSheet!A36","v":68},"a",{"$f":"PivotSheet!B36","v":1},1,{"$error":"#N/A"},{"$error":"#N/A"},{"$error":"#N/A"},{"$error":"#N/A"},0.12391930835734864]
[{"$f":"PivotSheet!A37","v":69},"a",{"$f":"PivotSheet!B37","v":2},1,{"$error":"#N/A"},{"$error":"#N/A"},{"$error":"#N/A"},{"$error":"#N/A"},0.12968299711815556]
[{"$f":"PivotSheet!A38","v":72},"a",{"$f":"PivotSheet!B38","v":1},1,{"$error":"#N/A"},{"$error":"#N/A"},{"$error":"#N/A"},{"$error":"#N/A"},0.13256484149855902]
[{"$f":"PivotSheet!A39","v":75},"a",{"$f":"PivotSheet!B39","v":2},1,{"$error":"#N/A"},{"$error":"#N/A"},{"$error":"#N/A"},{"$error":"#N/A"},0.13832853025936592]
[{"$f":"PivotSheet!A40","v":78},"a",{"$f":"PivotSheet!B40","v":1},1,{"$error":"#N/A"},{"$error":"#N/A"},{"$error":"#N/A"},{"$error":"#N/A"},0.14121037463976938]
[{"$f":"PivotSheet!A41","v":79},"a",{"$f":"PivotSheet!B41","v":2},1,{"$error":"#N/A"},{"$error":"#N/A"},{"$error":"#N/A"},{"$error":"#N/A"},0.14697406340057628]
[{"$f":"PivotSheet!A42","v":82},"a",{"$f":"PivotSheet!B42","v":3},1,{"$error":"#N/A"},{"$error":"#N/A"},{"$error":"#N/A"},{"$error":"#N/A"},0.15561959654178667]
[{"$f":"PivotSheet!A43","v":84},"a",{"$f":"PivotSheet!B43","v":1},1,{"$error":"#N/A"},{"$error":"#N/A"},{"$error":"#N/A"},{"$error":"#N/A"},0.15850144092219012]
[{"$f":"PivotSheet!A44","v":85},"a",{"$f":"PivotSheet!B44","v":2},1,{"$error":"#N/A"},{"$error":"#N/A"},{"$error":"#N/A"},{"$error":"#N/A"},0.16426512968299703]
[{"$f":"PivotSheet!A45","v":87},"a",{"$f":"PivotSheet!B45","v":2},1,{"$error":"#N/A"},{"$error":"#N/A"},{"$error":"#N/A"},{"$error":"#N/A"},0.17002881844380394]
[{"$f":"PivotSheet!A46","v":88},"a",{"$f":"PivotSheet!B46","v":2},1,{"$error":"#N/A"},{"$error":"#N/A"},{"$error":"#N/A"},{"$error":"#N/A"},0.17579250720461084]
[{"$f":"PivotSheet!A47","v":89},"a",{"$f":"PivotSheet!B47","v":3},1,{"$error":"#N/A"},{"$error":"#N/A"},{"$error":"#N/A"},{"$error":"#N/A"},0.18443804034582123]
[{"$f":"PivotSheet!A48","v":90},"a",{"$f":"PivotSheet!B48","v":1},1,{"$error":"#N/A"},{"$error":"#N/A"},{"$error":"#N/A"},{"$error":"#N/A"},0.18731988472622468]
[{"$f":"PivotSheet!A49","v":94},"a",{"$f":"PivotSheet!B49","v":1},1,{"$error":"#N/A"},{"$error":"#N/A"},{"$error":"#N/A"},{"$error":"#N/A"},0.19020172910662814]
[{"$f":"PivotSheet!A50","v":97},"a",{"$f":"PivotSheet!B50","v":1},1,{"$error":"#N/A"},{"$error":"#N/A"},{"$error":"#N/A"},{"$error":"#N/A"},0.19308357348703159]
[{"$f":"PivotSheet!A51","v":98},"a",{"$f":"PivotSheet!B51","v":1},1,{"$error":"#N/A"},{"$error":"#N/A"},{"$error":"#N/A"},{"$error":"#N/A"},0.19596541786743504]
[{"$f":"PivotSheet!A52","v":99},"a",{"$f":"PivotSheet!B52","v":1},1,{"$error":"#N/A"},{"$error":"#N/A"},{"$error":"#N/A"},{"$error":"#N/A"},0.1988472622478385]
[{"$f":"PivotSheet!A53","v":100},"a",{"$f":"PivotSheet!B53","v":1},1,{"$error":"#N/A"},{"$error":"#N/A"},{"$error":"#N/A"},{"$error":"#N/A"},0.20172910662824195]
[{"$f":"PivotSheet!A54","v":102},"a",{"$f":"PivotSheet!B54","v":2},1,{"$error":"#N/A"},{"$error":"#N/A"},{"$error":"#N/A"},{"$error":"#N/A"},0.20749279538904886]
[{"$f":"PivotSheet!A55","v":104},"a",{"$f":"PivotSheet!B55","v":2},1,{"$error":"#N/A"},{"$error":"#N/A"},{"$error":"#N/A"},{"$error":"#N/A"},0.21325648414985576]
[{"$f":"PivotSheet!A56","v":106},"a",{"$f":"PivotSheet!B56","v":3},1,{"$error":"#N/A"},{"$error":"#N/A"},{"$error":"#N/A"},{"$error":"#N/A"},0.22190201729106615]
[{"$f":"PivotSheet!A57","v":108},"a",{"$f":"PivotSheet!B57","v":1},1,{"$error":"#N/A"},{"$error":"#N/A"},{"$error":"#N/A"},{"$error":"#N/A"},0.2247838616714696]
[{"$f":"PivotSheet!A58","v":109},"a",{"$f":"PivotSheet!B58","v":1},1,{"$error":"#N/A"},{"$error":"#N/A"},{"$error":"#N/A"},{"$error":"#N/A"},0.22766570605187306]
[{"$f":"PivotSheet!A59","v":110},"a",{"$f":"PivotSheet!B59","v":1},1,{"$error":"#N/A"},{"$error":"#N/A"},{"$error":"#N/A"},{"$error":"#N/A"},0.23054755043227651]
[{"$f":"PivotSheet!A60","v":111},"a",{"$f":"PivotSheet!B60","v":1},1,{"$error":"#N/A"},{"$error":"#N/A"},{"$error":"#N/A"},{"$error":"#N/A"},0.23342939481267996]
[{"$f":"PivotSheet!A61","v":114},"a",{"$f":"PivotSheet!B61","v":1},1,{"$error":"#N/A"},{"$error":"#N/A"},{"$error":"#N/A"},{"$error":"#N/A"},0.23631123919308342]
[{"$f":"PivotSheet!A62","v":118},"a",{"$f":"PivotSheet!B62","v":1},1,{"$error":"#N/A"},{"$error":"#N/A"},{"$error":"#N/A"},{"$error":"#N/A"},0.23919308357348687]
[{"$f":"PivotSheet!A63","v":121},"a",{"$f":"PivotSheet!B63","v":1},1,{"$error":"#N/A"},{"$error":"#N/A"},{"$error":"#N/A"},{"$error":"#N/A"},0.24207492795389032]
[{"$f":"PivotSheet!A64","v":122},"a",{"$f":"PivotSheet!B64","v":2},1,{"$error":"#N/A"},{"$error":"#N/A"},{"$error":"#N/A"},{"$error":"#N/A"},0.24783861671469723]
[{"$f":"PivotSheet!A65","v":123},"a",{"$f":"PivotSheet!B65","v":3},1,{"$error":"#N/A"},{"$error":"#N/A"},{"$error":"#N/A"},{"$error":"#N/A"},0.25648414985590762]
[{"$f":"PivotSheet!A66","v":125},"a",{"$f":"PivotSheet!B66","v":2},1,{"$error":"#N/A"},{"$error":"#N/A"},{"$error":"#N/A"},{"$error":"#N/A"},0.26224783861671452]
[{"$f":"PivotSheet!A67","v":127},"a",{"$f":"PivotSheet!B67","v":1},{"$f":"IF(B67=\"a\",1,NA())","v":1},{"$f":"IF(B67=\"b\",1,NA())","v":{"$error":"#N/A"}},{"$f":"IF(B67=\"c\",1,NA())","v":{"$error":"#N/A"}},{"$f":"IF(B67=\"d\",1,NA())","v":{"$error":"#N/A"}},{"$f":"IF(B67=\"e\",1,NA())","v":{"$error":"#N/A"}},0.26512968299711798]
[{"$f":"PivotSheet!A68","v":128},"a",{"$f":"PivotSheet!B68","v":1},1,{"$error":"#N/A"},{"$error":"#N/A"},{"$error":"#N/A"},{"$error":"#N/A"},{"$f":"C68/SUM($C$2:$C$10000)+I67","v":0.26801152737752143}]
[{"$f":"PivotSheet!A69","v":129},"a",{"$f":"PivotSheet!B69","v":1},1,{"$error":"#N/A"},{"$error":"#N/A"},{"$error":"#N/A"},{"$error":"#N/A"},0.27089337175792488]
[{"$f":"PivotSheet!A70","v":133},"a",{"$f":"PivotSheet!B70","v":1},1,{"$error":"#N/A"},{"$error":"#N/A"},{"$error":"#N/A"},{"$error":"#N/A"},0.27377521613832834]
[{"$f":"PivotSheet!A71","v":135},"a",{"$f":"PivotSheet!B71","v":1},1,{"$error":"#N/A"},{"$error":"#N/A"},{"$error":"#N/A"},{"$error":"#N/A"},0.27665706051873179]
[{"$f":"PivotSheet!A72","v":137},"a",{"$f":"PivotSheet!B72","v":3},1,{"$error":"#N/A"},{"$error":"#N/A"},{"$error":"#N/A"},{"$error":"#N/A"},0.28530259365994215]
[{"$f":"PivotSheet!A73","v":139},"a",{"$f":"PivotSheet!B73","v":1},1,{"$error":"#N/A"},{"$error":"#N/A"},{"$error":"#N/A"},{"$error":"#N/A"},0.2881844380403456]
[{"$f":"PivotSheet!A74","v":140},"a",{"$f":"PivotSheet!B74","v":1},1,{"$error":"#N/A"},{"$error":"#N/A"},{"$error":"#N/A"},{"$error":"#N/A"},0.29106628242074906]
[{"$f":"PivotSheet!A75","v":141},"a",{"$f":"PivotSheet!B75","v":2},1,{"$error":"#N/A"},{"$error":"#N/A"},{"$error":"#N/A"},{"$error":"#N/A"},0.29682997118155596]
[{"$f":"PivotSheet!A76","v":144},"a",{"$f":"PivotSheet!B76","v":1},1,{"$error":"#N/A"},{"$error":"#N/A"},{"$error":"#N/A"},{"$error":"#N/A"},0.29971181556195942]
[{"$f":"PivotSheet!A77","v":145},"a",{"$f":"PivotSheet!B77","v":2},1,{"$error":"#N/A"},{"$error":"#N/A"},{"$error":"#N/A"},{"$error":"#N/A"},0.30547550432276632]
[{"$f":"PivotSheet!A78","v":147},"a",{"$f":"PivotSheet!B78","v":1},1,{"$error":"#N/A"},{"$error":"#N/A"},{"$error":"#N/A"},{"$error":"#N/A"},0.30835734870316978]
[{"$f":"PivotSheet!A79","v":150},"a",{"$f":"PivotSheet!B79","v":1},1,{"$error":"#N/A"},{"$error":"#N/A"},{"$error":"#N/A"},{"$error":"#N/A"},0.31123919308357323]
[{"$f":"PivotSheet!A80","v":154},"a",{"$f":"PivotSheet!B80","v":1},1,{"$error":"#N/A"},{"$error":"#N/A"},{"$error":"#N/A"},{"$error":"#N/A"},0.31412103746397668]
[{"$f":"PivotSheet!A81","v":155},"a",{"$f":"PivotSheet!B81","v":2},1,{"$error":"#N/A"},{"$error":"#N/A"},{"$error":"#N/A"},{"$error":"#N/A"},0.31988472622478359]
[{"$f":"PivotSheet!A82","v":156},"a",{"$f":"PivotSheet!B82","v":3},1,{"$error":"#N/A"},{"$error":"#N/A"},{"$error":"#N/A"},{"$error":"#N/A"},0.32853025936599395]
[{"$f":"PivotSheet!A83","v":158},"a",{"$f":"PivotSheet!B83","v":1},1,{"$error":"#N/A"},{"$error":"#N/A"},{"$error":"#N/A"},{"$error":"#N/A"},0.3314121037463974]
[{"$f":"PivotSheet!A84","v":159},"a",{"$f":"PivotSheet!B84","v":1},1,{"$error":"#N/A"},{"$error":"#N/A"},{"$error":"#N/A"},{"$error":"#N/A"},0.33429394812680086]
[{"$f":"PivotSheet!A85","v":161},"a",{"$f":"PivotSheet!B85","v":2},1,{"$error":"#N/A"},{"$error":"#N/A"},{"$error":"#N/A"},{"$error":"#N/A"},0.34005763688760776]
[{"$f":"PivotSheet!A86","v":165},"b",{"$f":"PivotSheet!B86","v":1},{"$error":"#N/A"},1,{"$error":"#N/A"},{"$error":"#N/A"},{"$error":"#N/A"},0.34293948126801121]
[{"$f":"PivotSheet!A87","v":166},"b",{"$f":"PivotSheet!B87","v":2},{"$error":"#N/A"},1,{"$error":"#N/A"},{"$error":"#N/A"},{"$error":"#N/A"},0.34870317002881812]
[{"$f":"PivotSheet!A88","v":167},"b",{"$f":"PivotSheet!B88","v":1},{"$error":"#N/A"},1,{"$error":"#N/A"},{"$error":"#N/A"},{"$error":"#N/A"},0.35158501440922157]
[{"$f":"PivotSheet!A89","v":168},"b",{"$f":"PivotSheet!B89","v":1},{"$error":"#N/A"},1,{"$error":"#N/A"},{"$error":"#N/A"},{"$error":"#N/A"},0.35446685878962503]
[{"$f":"PivotSheet!A90","v":169},"b",{"$f":"PivotSheet!B90","v":1},{"$error":"#N/A"},1,{"$error":"#N/A"},{"$error":"#N/A"},{"$error":"#N/A"},0.35734870317002848]
[{"$f":"PivotSheet!A91","v":170},"b",{"$f":"PivotSheet!B91","v":1},{"$error":"#N/A"},1,{"$error":"#N/A"},{"$error":"#N/A"},{"$error":"#N/A"},0.36023054755043193]
[{"$f":"PivotSheet!A92","v":171},"b",{"$f":"PivotSheet!B92","v":3},{"$error":"#N/A"},1,{"$error":"#N/A"},{"$error":"#N/A"},{"$error":"#N/A"},0.36887608069164229]
[{"$f":"PivotSheet!A93","v":172},"b",{"$f":"PivotSheet!B93","v":2},{"$error":"#N/A"},1,{"$error":"#N/A"},{"$error":"#N/A"},{"$error":"#N/A"},0.3746397694524492]
[{"$f":"PivotSheet!A94","v":174},"b",{"$f":"PivotSheet!B94","v":1},{"$error":"#N/A"},1,{"$error":"#N/A"},{"$error":"#N/A"},{"$error":"#N/A"},0.37752161383285265]
[{"$f":"PivotSheet!A95","v":177},"b",{"$f":"PivotSheet!B95","v":1},{"$error":"#N/A"},1,{"$error":"#N/A"},{"$error":"#N/A"},{"$error":"#N/A"},0.38040345821325611]
[{"$f":"PivotSheet!A96","v":178},"b",{"$f":"PivotSheet!B96","v":2},{"$error":"#N/A"},1,{"$error":"#N/A"},{"$error":"#N/A"},{"$error":"#N/A"},0.38616714697406301]
[{"$f":"PivotSheet!A97","v":179},"b",{"$f":"PivotSheet!B97","v":2},{"$error":"#N/A"},1,{"$error":"#N/A"},{"$error":"#N/A"},{"$error":"#N/A"},0.39193083573486992]
[{"$f":"PivotSheet!A98","v":181},"b",{"$f":"PivotSheet!B98","v":3},{"$error":"#N/A"},1,{"$error":"#N/A"},{"$error":"#N/A"},{"$error":"#N/A"},0.40057636887608028]
[{"$f":"PivotSheet!A99","v":182},"b",{"$f":"PivotSheet!B99","v":1},{"$error":"#N/A"},1,{"$error":"#N/A"},{"$error":"#N/A"},{"$error":"#N/A"},0.40345821325648373]
[{"$f":"PivotSheet!A100","v":186},"b",{"$f":"PivotSheet!B100","v":2},{"$error":"#N/A"},1,{"$error":"#N/A"},{"$error":"#N/A"},{"$error":"#N/A"},0.40922190201729064]
[{"$f":"PivotSheet!A101","v":187},"b",{"$f":"PivotSheet!B101","v":2},{"$error":"#N/A"},1,{"$error":"#N/A"},{"$error":"#N/A"},{"$error":"#N/A"},0.41498559077809755]
[{"$f":"PivotSheet!A102","v":189},"b",{"$f":"PivotSheet!B102","v":1},{"$error":"#N/A"},1,{"$error":"#N/A"},{"$error":"#N/A"},{"$error":"#N/A"},0.417867435158501]
[{"$f":"PivotSheet!A103","v":190},"b",{"$f":"PivotSheet!B103","v":2},{"$error":"#N/A"},1,{"$error":"#N/A"},{"$error":"#N/A"},{"$error":"#N/A"},0.42363112391930791]
[{"$f":"PivotSheet!A104","v":191},"b",{"$f":"PivotSheet!B104","v":2},{"$error":"#N/A"},1,{"$error":"#N/A"},{"$error":"#N/A"},{"$error":"#N/A"},0.42939481268011481]
[{"$f":"PivotSheet!A105","v":196},"b",{"$f":"PivotSheet!B105","v":1},{"$error":"#N/A"},1,{"$error":"#N/A"},{"$error":"#N/A"},{"$error":"#N/A"},0.43227665706051827]
[{"$f":"PivotSheet!A106","v":197},"b",{"$f":"PivotSheet!B106","v":1},{"$error":"#N/A"},1,{"$error":"#N/A"},{"$error":"#N/A"},{"$error":"#N/A"},0.43515850144092172]
[{"$f":"PivotSheet!A107","v":203},"b",{"$f":"PivotSheet!B107","v":1},{"$error":"#N/A"},1,{"$error":"#N/A"},{"$error":"#N/A"},{"$error":"#N/A"},0.43804034582132517]
[{"$f":"PivotSheet!A108","v":204},"b",{"$f":"PivotSheet!B108","v":1},{"$error":"#N/A"},1,{"$error":"#N/A"},{"$error":"#N/A"},{"$error":"#N/A"},0.44092219020172863]
[{"$f":"PivotSheet!A109","v":206},"b",{"$f":"PivotSheet!B109","v":1},{"$error":"#N/A"},1,{"$error":"#N/A"},{"$error":"#N/A"},{"$error":"#N/A"},0.44380403458213208]
[{"$f":"PivotSheet!A110","v":208},"b",{"$f":"PivotSheet!B110","v":1},{"$error":"#N/A"},1,{"$error":"#N/A"},{"$error":"#N/A"},{"$error":"#N/A"},0.44668587896253553]
[{"$f":"PivotSheet!A111","v":213},"b",{"$f":"PivotSheet!B111","v":3},{"$error":"#N/A"},1,{"$error":"#N/A"},{"$error":"#N/A"},{"$error":"#N/A"},0.45533141210374589]
[{"$f":"PivotSheet!A112","v":214},"b",{"$f":"PivotSheet!B112","v":1},{"$error":"#N/A"},1,{"$error":"#N/A"},{"$error":"#N/A"},{"$error":"#N/A"},0.45821325648414934]
[{"$f":"PivotSheet!A113","v":217},"b",{"$f":"PivotSheet!B113","v":1},{"$error":"#N/A"},1,{"$error":"#N/A"},{"$error":"#N/A"},{"$error":"#N/A"},0.4610951008645528]
[{"$f":"PivotSheet!A114","v":218},"b",{"$f":"PivotSheet!B114","v":2},{"$error":"#N/A"},1,{"$error":"#N/A"},{"$error":"#N/A"},{"$error":"#N/A"},0.4668587896253597]
[{"$f":"PivotSheet!A115","v":220},"b",{"$f":"PivotSheet!B115","v":1},{"$error":"#N/A"},1,{"$error":"#N/A"},{"$error":"#N/A"},{"$error":"#N/A"},0.46974063400576316]
[{"$f":"PivotSheet!A116","v":222},"b",{"$f":"PivotSheet!B116","v":1},{"$error":"#N/A"},1,{"$error":"#N/A"},{"$error":"#N/A"},{"$error":"#N/A"},0.47262247838616661]
[{"$f":"PivotSheet!A117","v":226},"b",{"$f":"PivotSheet!B117","v":1},{"$error":"#N/A"},1,{"$error":"#N/A"},{"$error":"#N/A"},{"$error":"#N/A"},0.47550432276657006]
[{"$f":"PivotSheet!A118","v":227},"b",{"$f":"PivotSheet!B118","v":1},{"$error":"#N/A"},1,{"$error":"#N/A"},{"$error":"#N/A"},{"$error":"#N/A"},0.47838616714697352]
[{"$f":"PivotSheet!A119","v":228},"b",{"$f":"PivotSheet!B119","v":1},{"$error":"#N/A"},1,{"$error":"#N/A"},{"$error":"#N/A"},{"$error":"#N/A"},0.48126801152737697]
[{"$f":"PivotSheet!A120","v":229},"b",{"$f":"PivotSheet!B120","v":2},{"$error":"#N/A"},1,{"$error":"#N/A"},{"$error":"#N/A"},{"$error":"#N/A"},0.48703170028818388]
[{"$f":"PivotSheet!A121","v":235},"b",{"$f":"PivotSheet!B121","v":1},{"$error":"#N/A"},1,{"$error":"#N/A"},{"$error":"#N/A"},{"$error":"#N/A"},0.48991354466858733]
[{"$f":"PivotSheet!A122","v":236},"b",{"$f":"PivotSheet!B122","v":1},{"$error":"#N/A"},1,{"$error":"#N/A"},{"$error":"#N/A"},{"$error":"#N/A"},0.49279538904899078]
[{"$f":"PivotSheet!A123","v":238},"b",{"$f":"PivotSheet!B123","v":1},{"$error":"#N/A"},1,{"$error":"#N/A"},{"$error":"#N/A"},{"$error":"#N/A"},0.49567723342939424]
[{"$f":"PivotSheet!A124","v":239},"b",{"$f":"PivotSheet!B124","v":2},{"$error":"#N/A"},1,{"$error":"#N/A"},{"$error":"#N/A"},{"$error":"#N/A"},0.5014409221902012]
[{"$f":"PivotSheet!A125","v":241},"b",{"$f":"PivotSheet!B125","v":2},{"$error":"#N/A"},1,{"$error":"#N/A"},{"$error":"#N/A"},{"$error":"#N/A"},0.50720461095100811]
[{"$f":"PivotSheet!A126","v":244},"b",{"$f":"PivotSheet!B126","v":1},{"$error":"#N/A"},1,{"$error":"#N/A"},{"$error":"#N/A"},{"$error":"#N/A"},0.51008645533141161]
[{"$f":"PivotSheet!A127","v":248},"b",{"$f":"PivotSheet!B127","v":1},{"$error":"#N/A"},1,{"$error":"#N/A"},{"$error":"#N/A"},{"$error":"#N/A"},0.51296829971181512]
[{"$f":"PivotSheet!A128","v":249},"b",{"$f":"PivotSheet!B128","v":3},{"$error":"#N/A"},1,{"$error":"#N/A"},{"$error":"#N/A"},{"$error":"#N/A"},0.52161383285302554]
[{"$f":"PivotSheet!A129","v":252},"b",{"$f":"PivotSheet!B129","v":2},{"$error":"#N/A"},1,{"$error":"#N/A"},{"$error":"#N/A"},{"$error":"#N/A"},0.52737752161383245]
[{"$f":"PivotSheet!A130","v":256},"b",{"$f":"PivotSheet!B130","v":1},{"$error":"#N/A"},1,{"$error":"#N/A"},{"$error":"#N/A"},{"$error":"#N/A"},0.53025936599423595]
[{"$f":"PivotSheet!A131","v":257},"b",{"$f":"PivotSheet!B131","v":1},{"$f":"IF(B131=\"a\",1,NA())","v":{"$error":"#N/A"}},{"$f":"IF(B131=\"b\",1,NA())","v":1},{"$f":"IF(B131=\"c\",1,NA())","v":{"$error":"#N/A"}},{"$f":"IF(B131=\"d\",1,NA())","v":{"$error":"#N/A"}},{"$f":"IF(B131=\"e\",1,NA())","v":{"$error":"#N/A"}},0.53314121037463946]
[{"$f":"PivotSheet!A132","v":258},"b",{"$f":"PivotSheet!B132","v":1},{"$error":"#N/A"},1,{"$error":"#N/A"},{"$error":"#N/A"},{"$error":"#N/A"},{"$f":"C132/SUM($C$2:$C$10000)+I131","v":0.53602305475504297}]
[{"$f":"PivotSheet!A133","v":260},"b",{"$f":"PivotSheet!B133","v":1},{"$error":"#N/A"},1,{"$error":"#N/A"},{"$error":"#N/A"},{"$error":"#N/A"},0.53890489913544648]
[{"$f":"PivotSheet!A134","v":264},"b",{"$f":"PivotSheet!B134","v":1},{"$error":"#N/A"},1,{"$error":"#N/A"},{"$error":"#N/A"},{"$error":"#N/A"},0.54178674351584999]
[{"$f":"PivotSheet!A135","v":265},"b",{"$f":"PivotSheet!B135","v":1},{"$error":"#N/A"},1,{"$error":"#N/A"},{"$error":"#N/A"},{"$error":"#N/A"},0.5446685878962535]
[{"$f":"PivotSheet!A136","v":266},"b",{"$f":"PivotSheet!B136","v":1},{"$error":"#N/A"},1,{"$error":"#N/A"},{"$error":"#N/A"},{"$error":"#N/A"},0.54755043227665701]
[{"$f":"PivotSheet!A137","v":267},"b",{"$f":"PivotSheet!B137","v":2},{"$error":"#N/A"},1,{"$error":"#N/A"},{"$error":"#N/A"},{"$error":"#N/A"},0.55331412103746391]
[{"$f":"PivotSheet!A138","v":269},"b",{"$f":"PivotSheet!B138","v":2},{"$error":"#N/A"},1,{"$error":"#N/A"},{"$error":"#N/A"},{"$error":"#N/A"},0.55907780979827082]
[{"$f":"PivotSheet!A139","v":270},"b",{"$f":"PivotSheet!B139","v":1},{"$error":"#N/A"},1,{"$error":"#N/A"},{"$error":"#N/A"},{"$error":"#N/A"},0.56195965417867433]
[{"$f":"PivotSheet!A140","v":273},"b",{"$f":"PivotSheet!B140","v":1},{"$error":"#N/A"},1,{"$error":"#N/A"},{"$error":"#N/A"},{"$error":"#N/A"},0.56484149855907784]
[{"$f":"PivotSheet!A141","v":275},"b",{"$f":"PivotSheet!B141","v":1},{"$error":"#N/A"},1,{"$error":"#N/A"},{"$error":"#N/A"},{"$error":"#N/A"},0.56772334293948135]
[{"$f":"PivotSheet!A142","v":277},"b",{"$f":"PivotSheet!B142","v":1},{"$error":"#N/A"},1,{"$error":"#N/A"},{"$error":"#N/A"},{"$error":"#N/A"},0.57060518731988485]
[{"$f":"PivotSheet!A143","v":278},"b",{"$f":"PivotSheet!B143","v":1},{"$error":"#N/A"},1,{"$error":"#N/A"},{"$error":"#N/A"},{"$error":"#N/A"},0.57348703170028836]
[{"$f":"PivotSheet!A144","v":280},"b",{"$f":"PivotSheet!B144","v":1},{"$error":"#N/A"},1,{"$error":"#N/A"},{"$error":"#N/A"},{"$error":"#N/A"},0.57636887608069187]
[{"$f":"PivotSheet!A145","v":282},"b",{"$f":"PivotSheet!B145","v":1},{"$error":"#N/A"},1,{"$error":"#N/A"},{"$error":"#N/A"},{"$error":"#N/A"},0.57925072046109538]
[{"$f":"PivotSheet!A146","v":286},"b",{"$f":"PivotSheet!B146","v":1},{"$error":"#N/A"},1,{"$error":"#N/A"},{"$error":"#N/A"},{"$error":"#N/A"},0.58213256484149889]
[{"$f":"PivotSheet!A147","v":289},"b",{"$f":"PivotSheet!B147","v":2},{"$error":"#N/A"},1,{"$error":"#N/A"},{"$error":"#N/A"},{"$error":"#N/A"},0.5878962536023058]
[{"$f":"PivotSheet!A148","v":291},"b",{"$f":"PivotSheet!B148","v":1},{"$error":"#N/A"},1,{"$error":"#N/A"},{"$error":"#N/A"},{"$error":"#N/A"},0.5907780979827093]
[{"$f":"PivotSheet!A149","v":292},"b",{"$f":"PivotSheet!B149","v":3},{"$error":"#N/A"},1,{"$error":"#N/A"},{"$error":"#N/A"},{"$error":"#N/A"},0.59942363112391972]
[{"$f":"PivotSheet!A150","v":293},"b",{"$f":"PivotSheet!B150","v":1},{"$error":"#N/A"},1,{"$error":"#N/A"},{"$error":"#N/A"},{"$error":"#N/A"},0.60230547550432323]
[{"$f":"PivotSheet!A151","v":294},"b",{"$f":"PivotSheet!B151","v":1},{"$error":"#N/A"},1,{"$error":"#N/A"},{"$error":"#N/A"},{"$error":"#N/A"},0.60518731988472674]
[{"$f":"PivotSheet!A152","v":295},"b",{"$f":"PivotSheet!B152","v":4},{"$error":"#N/A"},1,{"$error":"#N/A"},{"$error":"#N/A"},{"$error":"#N/A"},0.61671469740634055]
[{"$f":"PivotSheet!A153","v":296},"b",{"$f":"PivotSheet!B153","v":1},{"$error":"#N/A"},1,{"$error":"#N/A"},{"$error":"#N/A"},{"$error":"#N/A"},0.61959654178674406]
[{"$f":"PivotSheet!A154","v":297},"b",{"$f":"PivotSheet!B154","v":2},{"$error":"#N/A"},1,{"$error":"#N/A"},{"$error":"#N/A"},{"$error":"#N/A"},0.62536023054755097]
[{"$f":"PivotSheet!A155","v":301},"b",{"$f":"PivotSheet!B155","v":1},{"$error":"#N/A"},1,{"$error":"#N/A"},{"$error":"#N/A"},{"$error":"#N/A"},0.62824207492795447]
[{"$f":"PivotSheet!A156","v":302},"b",{"$f":"PivotSheet!B156","v":1},{"$error":"#N/A"},1,{"$error":"#N/A"},{"$error":"#N/A"},{"$error":"#N/A"},0.63112391930835798]
[{"$f":"PivotSheet!A157","v":303},"b",{"$f":"PivotSheet!B157","v":1},{"$error":"#N/A"},1,{"$error":"#N/A"},{"$error":"#N/A"},{"$error":"#N/A"},0.63400576368876149]
[{"$f":"PivotSheet!A158","v":305},"b",{"$f":"PivotSheet!B158","v":1},{"$error":"#N/A"},1,{"$error":"#N/A"},{"$error":"#N/A"},{"$error":"#N/A"},0.636887608069165]
[{"$f":"PivotSheet!A159","v":306},"b",{"$f":"PivotSheet!B159","v":1},{"$error":"#N/A"},1,{"$error":"#N/A"},{"$error":"#N/A"},{"$error":"#N/A"},0.63976945244956851]
[{"$f":"PivotSheet!A160","v":308},"b",{"$f":"PivotSheet!B160","v":1},{"$error":"#N/A"},1,{"$error":"#N/A"},{"$error":"#N/A"},{"$error":"#N/A"},0.64265129682997202]
[{"$f":"PivotSheet!A161","v":309},"b",{"$f":"PivotSheet!B161","v":1},{"$error":"#N/A"},1,{"$error":"#N/A"},{"$error":"#N/A"},{"$error":"#N/A"},0.64553314121037553]
[{"$f":"PivotSheet!A162","v":310},"b",{"$f":"PivotSheet!B162","v":1},{"$error":"#N/A"},1,{"$error":"#N/A"},{"$error":"#N/A"},{"$error":"#N/A"},0.64841498559077904]
[{"$f":"PivotSheet!A163","v":313},"b",{"$f":"PivotSheet!B163","v":1},{"$error":"#N/A"},1,{"$error":"#N/A"},{"$error":"#N/A"},{"$error":"#N/A"},0.65129682997118254]
[{"$f":"PivotSheet!A164","v":314},"b",{"$f":"PivotSheet!B164","v":1},{"$error":"#N/A"},1,{"$error":"#N/A"},{"$error":"#N/A"},{"$error":"#N/A"},0.65417867435158605]
[{"$f":"PivotSheet!A165","v":315},"b",{"$f":"PivotSheet!B165","v":1},{"$error":"#N/A"},1,{"$error":"#N/A"},{"$error":"#N/A"},{"$error":"#N/A"},0.65706051873198956]
[{"$f":"PivotSheet!A166","v":319},"b",{"$f":"PivotSheet!B166","v":1},{"$error":"#N/A"},1,{"$error":"#N/A"},{"$error":"#N/A"},{"$error":"#N/A"},0.65994236311239307]
[{"$f":"PivotSheet!A167","v":321},"b",{"$f":"PivotSheet!B167","v":1},{"$error":"#N/A"},1,{"$error":"#N/A"},{"$error":"#N/A"},{"$error":"#N/A"},0.66282420749279658]
[{"$f":"PivotSheet!A168","v":324},"c",{"$f":"PivotSheet!B168","v":1},{"$error":"#N/A"},{"$error":"#N/A"},1,{"$error":"#N/A"},{"$error":"#N/A"},0.66570605187320009]
[{"$f":"PivotSheet!A169","v":326},"c",{"$f":"PivotSheet!B169","v":2},{"$error":"#N/A"},{"$error":"#N/A"},1,{"$error":"#N/A"},{"$error":"#N/A"},0.671469740634007]
[{"$f":"PivotSheet!A170","v":327},"c",{"$f":"PivotSheet!B170","v":1},{"$error":"#N/A"},{"$error":"#N/A"},1,{"$error":"#N/A"},{"$error":"#N/A"},0.6743515850144105]
[{"$f":"PivotSheet!A171","v":328},"c",{"$f":"PivotSheet!B171","v":2},{"$error":"#N/A"},{"$error":"#N/A"},1,{"$error":"#N/A"},{"$error":"#N/A"},0.68011527377521741]
[{"$f":"PivotSheet!A172","v":329},"c",{"$f":"PivotSheet!B172","v":2},{"$error":"#N/A"},{"$error":"#N/A"},1,{"$error":"#N/A"},{"$error":"#N/A"},0.68587896253602432]
[{"$f":"PivotSheet!A173","v":330},"c",{"$f":"PivotSheet!B173","v":1},{"$error":"#N/A"},{"$error":"#N/A"},1,{"$error":"#N/A"},{"$error":"#N/A"},0.68876080691642783]
[{"$f":"PivotSheet!A174","v":332},"c",{"$f":"PivotSheet!B174","v":3},{"$error":"#N/A"},{"$error":"#N/A"},1,{"$error":"#N/A"},{"$error":"#N/A"},0.69740634005763824]
[{"$f":"PivotSheet!A175","v":334},"c",{"$f":"PivotSheet!B175","v":1},{"$error":"#N/A"},{"$error":"#N/A"},1,{"$error":"#N/A"},{"$error":"#N/A"},0.70028818443804175]
[{"$f":"PivotSheet!A176","v":335},"c",{"$f":"PivotSheet!B176","v":1},{"$error":"#N/A"},{"$error":"#N/A"},1,{"$error":"#N/A"},{"$error":"#N/A"},0.70317002881844526]
[{"$f":"PivotSheet!A177","v":337},"c",{"$f":"PivotSheet!B177","v":2},{"$error":"#N/A"},{"$error":"#N/A"},1,{"$error":"#N/A"},{"$error":"#N/A"},0.70893371757925217]
[{"$f":"PivotSheet!A178","v":338},"c",{"$f":"PivotSheet!B178","v":1},{"$error":"#N/A"},{"$error":"#N/A"},1,{"$error":"#N/A"},{"$error":"#N/A"},0.71181556195965567]
[{"$f":"PivotSheet!A179","v":339},"c",{"$f":"PivotSheet!B179","v":2},{"$error":"#N/A"},{"$error":"#N/A"},1,{"$error":"#N/A"},{"$error":"#N/A"},0.71757925072046258]
[{"$f":"PivotSheet!A180","v":343},"c",{"$f":"PivotSheet!B180","v":1},{"$error":"#N/A"},{"$error":"#N/A"},1,{"$error":"#N/A"},{"$error":"#N/A"},0.72046109510086609]
[{"$f":"PivotSheet!A181","v":345},"c",{"$f":"PivotSheet!B181","v":2},{"$error":"#N/A"},{"$error":"#N/A"},1,{"$error":"#N/A"},{"$error":"#N/A"},0.726224783861673]
[{"$f":"PivotSheet!A182","v":346},"c",{"$f":"PivotSheet!B182","v":2},{"$error":"#N/A"},{"$error":"#N/A"},1,{"$error":"#N/A"},{"$error":"#N/A"},0.7319884726224799]
[{"$f":"PivotSheet!A183","v":347},"c",{"$f":"PivotSheet!B183","v":1},{"$error":"#N/A"},{"$error":"#N/A"},1,{"$error":"#N/A"},{"$error":"#N/A"},0.73487031700288341]
[{"$f":"PivotSheet!A184","v":349},"c",{"$f":"PivotSheet!B184","v":1},{"$error":"#N/A"},{"$error":"#N/A"},1,{"$error":"#N/A"},{"$error":"#N/A"},0.73775216138328692]
[{"$f":"PivotSheet!A185","v":350},"c",{"$f":"PivotSheet!B185","v":1},{"$error":"#N/A"},{"$error":"#N/A"},1,{"$error":"#N/A"},{"$error":"#N/A"},0.74063400576369043]
[{"$f":"PivotSheet!A186","v":351},"c",{"$f":"PivotSheet!B186","v":1},{"$error":"#N/A"},{"$error":"#N/A"},1,{"$error":"#N/A"},{"$error":"#N/A"},0.74351585014409394]
[{"$f":"PivotSheet!A187","v":353},"c",{"$f":"PivotSheet!B187","v":1},{"$error":"#N/A"},{"$error":"#N/A"},1,{"$error":"#N/A"},{"$error":"#N/A"},0.74639769452449745]
[{"$f":"PivotSheet!A188","v":354},"c",{"$f":"PivotSheet!B188","v":1},{"$error":"#N/A"},{"$error":"#N/A"},1,{"$error":"#N/A"},{"$error":"#N/A"},0.74927953890490095]
[{"$f":"PivotSheet!A189","v":356},"c",{"$f":"PivotSheet!B189","v":2},{"$error":"#N/A"},{"$error":"#N/A"},1,{"$error":"#N/A"},{"$error":"#N/A"},0.75504322766570786]
[{"$f":"PivotSheet!A190","v":359},"c",{"$f":"PivotSheet!B190","v":1},{"$error":"#N/A"},{"$error":"#N/A"},1,{"$error":"#N/A"},{"$error":"#N/A"},0.75792507204611137]
[{"$f":"PivotSheet!A191","v":361},"c",{"$f":"PivotSheet!B191","v":1},{"$error":"#N/A"},{"$error":"#N/A"},1,{"$error":"#N/A"},{"$error":"#N/A"},0.76080691642651488]
[{"$f":"PivotSheet!A192","v":362},"c",{"$f":"PivotSheet!B192","v":3},{"$error":"#N/A"},{"$error":"#N/A"},1,{"$error":"#N/A"},{"$error":"#N/A"},0.76945244956772529]
[{"$f":"PivotSheet!A193","v":363},"c",{"$f":"PivotSheet!B193","v":1},{"$error":"#N/A"},{"$error":"#N/A"},1,{"$error":"#N/A"},{"$error":"#N/A"},0.7723342939481288]
[{"$f":"PivotSheet!A194","v":365},"c",{"$f":"PivotSheet!B194","v":1},{"$error":"#N/A"},{"$error":"#N/A"},1,{"$error":"#N/A"},{"$error":"#N/A"},0.77521613832853231]
[{"$f":"PivotSheet!A195","v":366},"c",{"$f":"PivotSheet!B195","v":1},{"$f":"IF(B195=\"a\",1,NA())","v":{"$error":"#N/A"}},{"$f":"IF(B195=\"b\",1,NA())","v":{"$error":"#N/A"}},{"$f":"IF(B195=\"c\",1,NA())","v":1},{"$f":"IF(B195=\"d\",1,NA())","v":{"$error":"#N/A"}},{"$f":"IF(B195=\"e\",1,NA())","v":{"$error":"#N/A"}},0.77809798270893582]
[{"$f":"PivotSheet!A196","v":368},"c",{"$f":"PivotSheet!B196","v":1},{"$error":"#N/A"},{"$error":"#N/A"},1,{"$error":"#N/A"},{"$error":"#N/A"},{"$f":"C196/SUM($C$2:$C$10000)+I195","v":0.78097982708933933}]
[{"$f":"PivotSheet!A197","v":369},"c",{"$f":"PivotSheet!B197","v":2},{"$error":"#N/A"},{"$error":"#N/A"},1,{"$error":"#N/A"},{"$error":"#N/A"},0.78674351585014624]
[{"$f":"PivotSheet!A198","v":373},"c",{"$f":"PivotSheet!B198","v":1},{"$error":"#N/A"},{"$error":"#N/A"},1,{"$error":"#N/A"},{"$error":"#N/A"},0.78962536023054974]
[{"$f":"PivotSheet!A199","v":375},"c",{"$f":"PivotSheet!B199","v":1},{"$error":"#N/A"},{"$error":"#N/A"},1,{"$error":"#N/A"},{"$error":"#N/A"},0.79250720461095325]
[{"$f":"PivotSheet!A200","v":376},"c",{"$f":"PivotSheet!B200","v":1},{"$error":"#N/A"},{"$error":"#N/A"},1,{"$error":"#N/A"},{"$error":"#N/A"},0.79538904899135676]
[{"$f":"PivotSheet!A201","v":378},"c",{"$f":"PivotSheet!B201","v":1},{"$error":"#N/A"},{"$error":"#N/A"},1,{"$error":"#N/A"},{"$error":"#N/A"},0.79827089337176027]
[{"$f":"PivotSheet!A202","v":380},"c",{"$f":"PivotSheet!B202","v":1},{"$error":"#N/A"},{"$error":"#N/A"},1,{"$error":"#N/A"},{"$error":"#N/A"},0.80115273775216378]
[{"$f":"PivotSheet!A203","v":381},"c",{"$f":"PivotSheet!B203","v":1},{"$error":"#N/A"},{"$error":"#N/A"},1,{"$error":"#N/A"},{"$error":"#N/A"},0.80403458213256729]
[{"$f":"PivotSheet!A204","v":382},"c",{"$f":"PivotSheet!B204","v":1},{"$error":"#N/A"},{"$error":"#N/A"},1,{"$error":"#N/A"},{"$error":"#N/A"},0.8069164265129708]
[{"$f":"PivotSheet!A205","v":383},"c",{"$f":"PivotSheet!B205","v":1},{"$error":"#N/A"},{"$error":"#N/A"},1,{"$error":"#N/A"},{"$error":"#N/A"},0.80979827089337431]
[{"$f":"PivotSheet!A206","v":385},"c",{"$f":"PivotSheet!B206","v":1},{"$error":"#N/A"},{"$error":"#N/A"},1,{"$error":"#N/A"},{"$error":"#N/A"},0.81268011527377781]
[{"$f":"PivotSheet!A207","v":388},"c",{"$f":"PivotSheet!B207","v":1},{"$error":"#N/A"},{"$error":"#N/A"},1,{"$error":"#N/A"},{"$error":"#N/A"},0.81556195965418132]
[{"$f":"PivotSheet!A208","v":389},"c",{"$f":"PivotSheet!B208","v":1},{"$error":"#N/A"},{"$error":"#N/A"},1,{"$error":"#N/A"},{"$error":"#N/A"},0.81844380403458483]
[{"$f":"PivotSheet!A209","v":390},"c",{"$f":"PivotSheet!B209","v":2},{"$error":"#N/A"},{"$error":"#N/A"},1,{"$error":"#N/A"},{"$error":"#N/A"},0.82420749279539174]
[{"$f":"PivotSheet!A210","v":391},"c",{"$f":"PivotSheet!B210","v":1},{"$error":"#N/A"},{"$error":"#N/A"},1,{"$error":"#N/A"},{"$error":"#N/A"},0.82708933717579525]
[{"$f":"PivotSheet!A211","v":392},"c",{"$f":"PivotSheet!B211","v":1},{"$error":"#N/A"},{"$error":"#N/A"},1,{"$error":"#N/A"},{"$error":"#N/A"},0.82997118155619876]
[{"$f":"PivotSheet!A212","v":393},"c",{"$f":"PivotSheet!B212","v":1},{"$error":"#N/A"},{"$error":"#N/A"},1,{"$error":"#N/A"},{"$error":"#N/A"},0.83285302593660226]
[{"$f":"PivotSheet!A213","v":394},"c",{"$f":"PivotSheet!B213","v":1},{"$error":"#N/A"},{"$error":"#N/A"},1,{"$error":"#N/A"},{"$error":"#N/A"},0.83573487031700577]
[{"$f":"PivotSheet!A214","v":395},"c",{"$f":"PivotSheet!B214","v":1},{"$error":"#N/A"},{"$error":"#N/A"},1,{"$error":"#N/A"},{"$error":"#N/A"},0.83861671469740928]
[{"$f":"PivotSheet!A215","v":398},"c",{"$f":"PivotSheet!B215","v":1},{"$error":"#N/A"},{"$error":"#N/A"},1,{"$error":"#N/A"},{"$error":"#N/A"},0.84149855907781279]
[{"$f":"PivotSheet!A216","v":399},"c",{"$f":"PivotSheet!B216","v":2},{"$error":"#N/A"},{"$error":"#N/A"},1,{"$error":"#N/A"},{"$error":"#N/A"},0.8472622478386197]
[{"$f":"PivotSheet!A217","v":403},"c",{"$f":"PivotSheet!B217","v":1},{"$error":"#N/A"},{"$error":"#N/A"},1,{"$error":"#N/A"},{"$error":"#N/A"},0.85014409221902321]
[{"$f":"PivotSheet!A218","v":405},"c",{"$f":"PivotSheet!B218","v":1},{"$error":"#N/A"},{"$error":"#N/A"},1,{"$error":"#N/A"},{"$error":"#N/A"},0.85302593659942672]
[{"$f":"PivotSheet!A219","v":406},"c",{"$f":"PivotSheet!B219","v":1},{"$error":"#N/A"},{"$error":"#N/A"},1,{"$error":"#N/A"},{"$error":"#N/A"},0.85590778097983022]
[{"$f":"PivotSheet!A220","v":408},"c",{"$f":"PivotSheet!B220","v":1},{"$error":"#N/A"},{"$error":"#N/A"},1,{"$error":"#N/A"},{"$error":"#N/A"},0.85878962536023373]
[{"$f":"PivotSheet!A221","v":411},"c",{"$f":"PivotSheet!B221","v":3},{"$error":"#N/A"},{"$error":"#N/A"},1,{"$error":"#N/A"},{"$error":"#N/A"},0.86743515850144415]
[{"$f":"PivotSheet!A222","v":416},"c",{"$f":"PivotSheet!B222","v":1},{"$error":"#N/A"},{"$error":"#N/A"},1,{"$error":"#N/A"},{"$error":"#N/A"},0.87031700288184766]
[{"$f":"PivotSheet!A223","v":417},"c",{"$f":"PivotSheet!B223","v":2},{"$error":"#N/A"},{"$error":"#N/A"},1,{"$error":"#N/A"},{"$error":"#N/A"},0.87608069164265456]
[{"$f":"PivotSheet!A224","v":418},"c",{"$f":"PivotSheet!B224","v":1},{"$error":"#N/A"},{"$error":"#N/A"},1,{"$error":"#N/A"},{"$error":"#N/A"},0.87896253602305807]
[{"$f":"PivotSheet!A225","v":419},"c",{"$f":"PivotSheet!B225","v":1},{"$error":"#N/A"},{"$error":"#N/A"},1,{"$error":"#N/A"},{"$error":"#N/A"},0.88184438040346158]
[{"$f":"PivotSheet!A226","v":421},"c",{"$f":"PivotSheet!B226","v":1},{"$error":"#N/A"},{"$error":"#N/A"},1,{"$error":"#N/A"},{"$error":"#N/A"},0.88472622478386509]
[{"$f":"PivotSheet!A227","v":423},"c",{"$f":"PivotSheet!B227","v":1},{"$error":"#N/A"},{"$error":"#N/A"},1,{"$error":"#N/A"},{"$error":"#N/A"},0.8876080691642686]
[{"$f":"PivotSheet!A228","v":428},"c",{"$f":"PivotSheet!B228","v":1},{"$error":"#N/A"},{"$error":"#N/A"},1,{"$error":"#N/A"},{"$error":"#N/A"},0.89048991354467211]
[{"$f":"PivotSheet!A229","v":435},"c",{"$f":"PivotSheet!B229","v":2},{"$error":"#N/A"},{"$error":"#N/A"},1,{"$error":"#N/A"},{"$error":"#N/A"},0.89625360230547901]
[{"$f":"PivotSheet!A230","v":439},"c",{"$f":"PivotSheet!B230","v":1},{"$error":"#N/A"},{"$error":"#N/A"},1,{"$error":"#N/A"},{"$error":"#N/A"},0.89913544668588252]
[{"$f":"PivotSheet!A231","v":441},"c",{"$f":"PivotSheet!B231","v":1},{"$error":"#N/A"},{"$error":"#N/A"},1,{"$error":"#N/A"},{"$error":"#N/A"},0.90201729106628603]
[{"$f":"PivotSheet!A232","v":447},"c",{"$f":"PivotSheet!B232","v":1},{"$error":"#N/A"},{"$error":"#N/A"},1,{"$error":"#N/A"},{"$error":"#N/A"},0.90489913544668954]
[{"$f":"PivotSheet!A233","v":449},"c",{"$f":"PivotSheet!B233","v":1},{"$error":"#N/A"},{"$error":"#N/A"},1,{"$error":"#N/A"},{"$error":"#N/A"},0.90778097982709305]
[{"$f":"PivotSheet!A234","v":453},"c",{"$f":"PivotSheet!B234","v":3},{"$error":"#N/A"},{"$error":"#N/A"},1,{"$error":"#N/A"},{"$error":"#N/A"},0.91642651296830346]
[{"$f":"PivotSheet!A235","v":455},"c",{"$f":"PivotSheet!B235","v":1},{"$error":"#N/A"},{"$error":"#N/A"},1,{"$error":"#N/A"},{"$error":"#N/A"},0.91930835734870697]
[{"$f":"PivotSheet!A236","v":459},"c",{"$f":"PivotSheet!B236","v":2},{"$error":"#N/A"},{"$error":"#N/A"},1,{"$error":"#N/A"},{"$error":"#N/A"},0.92507204610951388]
[{"$f":"PivotSheet!A237","v":460},"c",{"$f":"PivotSheet!B237","v":1},{"$error":"#N/A"},{"$error":"#N/A"},1,{"$error":"#N/A"},{"$error":"#N/A"},0.92795389048991739]
[{"$f":"PivotSheet!A238","v":461},"c",{"$f":"PivotSheet!B238","v":1},{"$error":"#N/A"},{"$error":"#N/A"},1,{"$error":"#N/A"},{"$error":"#N/A"},0.9308357348703209]
[{"$f":"PivotSheet!A239","v":466},"c",{"$f":"PivotSheet!B239","v":1},{"$error":"#N/A"},{"$error":"#N/A"},1,{"$error":"#N/A"},{"$error":"#N/A"},0.93371757925072441]
[{"$f":"PivotSheet!A240","v":467},"c",{"$f":"PivotSheet!B240","v":1},{"$error":"#N/A"},{"$error":"#N/A"},1,{"$error":"#N/A"},{"$error":"#N/A"},0.93659942363112791]
[{"$f":"PivotSheet!A241","v":469},"c",{"$f":"PivotSheet!B241","v":2},{"$error":"#N/A"},{"$error":"#N/A"},1,{"$error":"#N/A"},{"$error":"#N/A"},0.94236311239193482]
[{"$f":"PivotSheet!A242","v":475},"c",{"$f":"PivotSheet!B242","v":1},{"$error":"#N/A"},{"$error":"#N/A"},1,{"$error":"#N/A"},{"$error":"#N/A"},0.94524495677233833]
[{"$f":"PivotSheet!A243","v":476},"c",{"$f":"PivotSheet!B243","v":3},{"$error":"#N/A"},{"$error":"#N/A"},1,{"$error":"#N/A"},{"$error":"#N/A"},0.95389048991354874]
[{"$f":"PivotSheet!A244","v":480},"c",{"$f":"PivotSheet!B244","v":1},{"$error":"#N/A"},{"$error":"#N/A"},1,{"$error":"#N/A"},{"$error":"#N/A"},0.95677233429395225]
[{"$f":"PivotSheet!A245","v":483},"c",{"$f":"PivotSheet!B245","v":1},{"$error":"#N/A"},{"$error":"#N/A"},1,{"$error":"#N/A"},{"$error":"#N/A"},0.95965417867435576]
[{"$f":"PivotSheet!A246","v":484},"c",{"$f":"PivotSheet!B246","v":1},{"$error":"#N/A"},{"$error":"#N/A"},1,{"$error":"#N/A"},{"$error":"#N/A"},0.96253602305475927]
[{"$f":"PivotSheet!A247","v":485},"c",{"$f":"PivotSheet!B247","v":1},{"$error":"#N/A"},{"$error":"#N/A"},1,{"$error":"#N/A"},{"$error":"#N/A"},0.96541786743516278]
[{"$f":"PivotSheet!A248","v":487},"c",{"$f":"PivotSheet!B248","v":1},{"$error":"#N/A"},{"$error":"#N/A"},1,{"$error":"#N/A"},{"$error":"#N/A"},0.96829971181556629]
[{"$f":"PivotSheet!A249","v":488},"c",{"$f":"PivotSheet!B249","v":3},{"$error":"#N/A"},{"$error":"#N/A"},1,{"$error":"#N/A"},{"$error":"#N/A"},0.9769452449567767]
[{"$f":"PivotSheet!A250","v":489},"c",{"$f":"PivotSheet!B250","v":2},{"$error":"#N/A"},{"$error":"#N/A"},1,{"$error":"#N/A"},{"$error":"#N/A"},0.98270893371758361]
[{"$f":"PivotSheet!A251","v":490},"c",{"$f":"PivotSheet!B251","v":1},{"$error":"#N/A"},{"$error":"#N/A"},1,{"$error":"#N/A"},{"$error":"#N/A"},0.98559077809798712]
[{"$f":"PivotSheet!A252","v":494},"c",{"$f":"PivotSheet!B252","v":1},{"$error":"#N/A"},{"$error":"#N/A"},1,{"$error":"#N/A"},{"$error":"#N/A"},0.98847262247839063]
[{"$f":"PivotSheet!A253","v":496},"c",{"$f":"PivotSheet!B253","v":1},{"$error":"#N/A"},{"$error":"#N/A"},1,{"$error":"#N/A"},{"$error":"#N/A"},0.99135446685879414]
[{"$f":"PivotSheet!A254","v":497},"c",{"$f":"PivotSheet!B254","v":1},{"$error":"#N/A"},{"$error":"#N/A"},1,{"$error":"#N/A"},{"$error":"#N/A"},0.99423631123919765]
[{"$f":"PivotSheet!A255","v":498},"c",{"$f":"PivotSheet!B255","v":2},{"$error":"#N/A"},{"$error":"#N/A"},1,{"$error":"#N/A"},{"$error":"#N/A"},1.0000000000000047]
[{"$f":"PivotSheet!A256","v":"(blank)"},null,{"$f":"PivotSheet!B256","v":0},{"$error":"#N/A"},{"$error":"#N/A"},{"$error":"#N/A"},{"$error":"#N/A"},{"$error":"#N/A"},1.0000000000000047]
[{"$f":"PivotSheet!A257","v":0},null,{"$f":"PivotSheet!B257","v":0},{"$error":"#N/A"},{"$error":"#N/A"},{"$error":"#N/A"},{"$error":"#N/A"},{"$error":"#N/A"},1.0000000000000047]
[{"$f":"PivotSheet!A258","v":0},null,{"$f":"PivotSheet!B258","v":0},{"$error":"#N/A"},{"$error":"#N/A"},{"$error":"#N/A"},{"$error":"#N/A"},{"$error":"#N/A"},1.0000000000000047]
[{"$f":"PivotSheet!A259","v":0},null,{"$f":"PivotSheet!B259","v":0},{"$f":"IF(B259=\"a\",1,NA())","v":{"$error":"#N/A"}},{"$f":"IF(B259=\"b\",1,NA())","v":{"$error":"#N/A"}},{"$f":"IF(B259=\"c\",1,NA())","v":{"$error":"#N/A"}},{"$f":"IF(B259=\"d\",1,NA())","v":{"$error":"#N/A"}},{"$f":"IF(B259=\"e\",1,NA())","v":{"$error":"#N/A"}},1.0000000000000047]
[{"$f":"PivotSheet!A260","v":0},null,{"$f":"PivotSheet!B260","v":0},{"$error":"#N/A"},{"$error":"#N/A"},{"$error":"#N/A"},{"$error":"#N/A"},{"$error":"#N/A"},{"$f":"C260/SUM($C$2:$C$10000)+I259","v":1.0000000000000047}]
[{"$f":"PivotSheet!A261","v":0},null,{"$f":"PivotSheet!B261","v":0},{"$error":"#N/A"},{"$error":"#N/A"},{"$error":"#N/A"},{"$error":"#N/A"},{"$error":"#N/A"},1.0000000000000047]
[{"$f":"PivotSheet!A262","v":0},null,{"$f":"PivotSheet!B262","v":0},{"$error":"#N/A"},{"$error":"#N/A"},{"$error":"#N/A"},{"$error":"#N/A"},{"$error":"#N/A"},1.0000000000000047]
[{"$f":"PivotSheet!A263","v":0},null,{"$f":"PivotSheet!B263","v":0},{"$error":"#N/A"},{"$error":"#N/A"},{"$error":"#N/A"},{"$error":"#N/A"},{"$error":"#N/A"},1.0000000000000047]
[{"$f":"PivotSheet!A264","v":0},null,{"$f":"PivotSheet!B264","v":0},{"$error":"#N/A"},{"$error":"#N/A"},{"$error":"#N/A"},{"$error":"#N/A"},{"$error":"#N/A"},1.0000000000000047]
[{"$f":"PivotSheet!A265","v":0},null,{"$f":"PivotSheet!B265","v":0},{"$error":"#N/A"},{"$error":"#N/A"},{"$error":"#N/A"},{"$error":"#N/A"},{"$error":"#N/A"},1.0000000000000047]
[{"$f":"PivotSheet!A266","v":0},null,{"$f":"PivotSheet!B266","v":0},{"$error":"#N/A"},{"$error":"#N/A"},{"$error":"#N/A"},{"$error":"#N/A"},{"$error":"#N/A"},1.0000000000000047]
[{"$f":"PivotSheet!A267","v":0},null,{"$f":"PivotSheet!B267","v":0},{"$error":"#N/A"},{"$error":"#N/A"},{"$error":"#N/A"},{"$error":"#N/A"},{"$error":"#N/A"},1.0000000000000047]
[{"$f":"PivotSheet!A268","v":0},null,{"$f":"PivotSheet!B268","v":0},{"$error":"#N/A"},{"$error":"#N/A"},{"$error":"#N/A"},{"$error":"#N/A"},{"$error":"#N/A"},1.0000000000000047]
[{"$f":"PivotSheet!A269","v":0},null,{"$f":"PivotSheet!B269","v":0},{"$error":"#N/A"},{"$error":"#N/A"},{"$error":"#N/A"},{"$error":"#N/A"},{"$error":"#N/A"},1.0000000000000047]
[{"$f":"PivotSheet!A270","v":0},null,{"$f":"PivotSheet!B270","v":0},{"$error":"#N/A"},{"$error":"#N/A"},{"$error":"#N/A"},{"$error":"#N/A"},{"$error":"#N/A"},1.0000000000000047]
[{"$f":"PivotSheet!A271","v":0},null,{"$f":"PivotSheet!B271","v":0},{"$error":"#N/A"},{"$error":"#N/A"},{"$error":"#N/A"},{"$error":"#N/A"},{"$error":"#N/A"},1.0000000000000047]
[{"$f":"PivotSheet!A272","v":0},null,{"$f":"PivotSheet!B272","v":0},{"$error":"#N/A"},{"$error":"#N/A"},{"$error":"#N/A"},{"$error":"#N/A"},{"$error":"#N/A"},1.0000000000000047]
[{"$f":"PivotSheet!A273","v":0},null,{"$f":"PivotSheet!B273","v":0},{"$error":"#N/A"},{"$error":"#N/A"},{"$error":"#N/A"},{"$error":"#N/A"},{"$error":"#N/A"},1.0000000000000047]
[{"$f":"PivotSheet!A274","v":0},null,{"$f":"PivotSheet!B274","v":0},{"$error":"#N/A"},{"$error":"#N/A"},{"$error":"#N/A"},{"$error":"#N/A"},{"$error":"#N/A"},1.0000000000000047]
[{"$f":"PivotSheet!A275","v":0},null,{"$f":"PivotSheet!B275","v":0},{"$error":"#N/A"},{"$error":"#N/A"},{"$error":"#N/A"},{"$error":"#N/A"},{"$error":"#N/A"},1.0000000000000047]
[{"$f":"PivotSheet!A276","v":0},null,{"$f":"PivotSheet!B276","v":0},{"$error":"#N/A"},{"$error":"#N/A"},{"$error":"#N/A"},{"$error":"#N/A"},{"$error":"#N/A"},1.0000000000000047]
[{"$f":"PivotSheet!A277","v":0},null,{"$f":"PivotSheet!B277","v":0},{"$error":"#N/A"},{"$error":"#N/A"},{"$error":"#N/A"},{"$error":"#N/A"},{"$error":"#N/A"},1.0000000000000047]
[{"$f":"PivotSheet!A278","v":0},null,{"$f":"PivotSheet!B278","v":0},{"$error":"#N/A"},{"$error":"#N/A"},{"$error":"#N/A"},{"$error":"#N/A"},{"$error":"#N/A"},1.0000000000000047]
[{"$f":"PivotSheet!A279","v":0},null,{"$f":"PivotSheet!B279","v":0},{"$error":"#N/A"},{"$error":"#N/A"},{"$error":"#N/A"},{"$error":"#N/A"},{"$error":"#N/A"},1.0000000000000047]
[{"$f":"PivotSheet!A280","v":0},null,{"$f":"PivotSheet!B280","v":0},{"$error":"#N/A"},{"$error":"#N/A"},{"$error":"#N/A"},{"$error":"#N/A"},{"$error":"#N/A"},1.0000000000000047]
[{"$f":"PivotSheet!A281","v":0},null,{"$f":"PivotSheet!B281","v":0},{"$error":"#N/A"},{"$error":"#N/A"},{"$error":"#N/A"},{"$error":"#N/A"},{"$error":"#N/A"},1.0000000000000047]
[{"$f":"PivotSheet!A282","v":0},null,{"$f":"PivotSheet!B282","v":0},{"$error":"#N/A"},{"$error":"#N/A"},{"$error":"#N/A"},{"$error":"#N/A"},{"$error":"#N/A"},1.0000000000000047]
[{"$f":"PivotSheet!A283","v":0},null,{"$f":"PivotSheet!B283","v":0},{"$error":"#N/A"},{"$error":"#N/A"},{"$error":"#N/A"},{"$error":"#N/A"},{"$error":"#N/A"},1.0000000000000047]
[{"$f":"PivotSheet!A284","v":0},null,{"$f":"PivotSheet!B284","v":0},{"$error":"#N/A"},{"$error":"#N/A"},{"$error":"#N/A"},{"$error":"#N/A"},{"$error":"#N/A"},1.0000000000000047]
[{"$f":"PivotSheet!A285","v":0},null,{"$f":"PivotSheet!B285","v":0},{"$error":"#N/A"},{"$error":"#N/A"},{"$error":"#N/A"},{"$error":"#N/A"},{"$error":"#N/A"},1.0000000000000047]
[{"$f":"PivotSheet!A286","v":0},null,{"$f":"PivotSheet!B286","v":0},{"$error":"#N/A"},{"$error":"#N/A"},{"$error":"#N/A"},{"$error":"#N/A"},{"$error":"#N/A"},1.0000000000000047]
[{"$f":"PivotSheet!A287","v":0},null,{"$f":"PivotSheet!B287","v":0},{"$error":"#N/A"},{"$error":"#N/A"},{"$error":"#N/A"},{"$error":"#N/A"},{"$error":"#N/A"},1.0000000000000047]
[{"$f":"PivotSheet!A288","v":0},null,{"$f":"PivotSheet!B288","v":0},{"$error":"#N/A"},{"$error":"#N/A"},{"$error":"#N/A"},{"$error":"#N/A"},{"$error":"#N/A"},1.0000000000000047]
[{"$f":"PivotSheet!A289","v":0},null,{"$f":"PivotSheet!B289","v":0},{"$error":"#N/A"},{"$error":"#N/A"},{"$error":"#N/A"},{"$error":"#N/A"},{"$error":"#N/A"},1.0000000000000047]
[{"$f":"PivotSheet!A290","v":0},null,{"$f":"PivotSheet!B290","v":0},{"$error":"#N/A"},{"$error":"#N/A"},{"$error":"#N/A"},{"$error":"#N/A"},{"$error":"#N/A"},1.0000000000000047]
[{"$f":"PivotSheet!A291","v":0},null,{"$f":"PivotSheet!B291","v":0},{"$error":"#N/A"},{"$error":"#N/A"},{"$error":"#N/A"},{"$error":"#N/A"},{"$error":"#N/A"},1.0000000000000047]
[{"$f":"PivotSheet!A292","v":0},null,{"$f":"PivotSheet!B292","v":0},{"$error":"#N/A"},{"$error":"#N/A"},{"$error":"#N/A"},{"$error":"#N/A"},{"$error":"#N/A"},1.0000000000000047]
[{"$f":"PivotSheet!A293","v":0},null,{"$f":"PivotSheet!B293","v":0},{"$error":"#N/A"},{"$error":"#N/A"},{"$error":"#N/A"},{"$error":"#N/A"},{"$error":"#N/A"},1.0000000000000047]
[{"$f":"PivotSheet!A294","v":0},null,{"$f":"PivotSheet!B294","v":0},{"$error":"#N/A"},{"$error":"#N/A"},{"$error":"#N/A"},{"$error":"#N/A"},{"$error":"#N/A"},1.0000000000000047]
[{"$f":"PivotSheet!A295","v":0},null,{"$f":"PivotSheet!B295","v":0},{"$error":"#N/A"},{"$error":"#N/A"},{"$error":"#N/A"},{"$error":"#N/A"},{"$error":"#N/A"},1.0000000000000047]
[{"$f":"PivotSheet!A296","v":0},null,{"$f":"PivotSheet!B296","v":0},{"$error":"#N/A"},{"$error":"#N/A"},{"$error":"#N/A"},{"$error":"#N/A"},{"$error":"#N/A"},1.0000000000000047]
[{"$f":"PivotSheet!A297","v":0},null,{"$f":"PivotSheet!B297","v":0},{"$error":"#N/A"},{"$error":"#N/A"},{"$error":"#N/A"},{"$error":"#N/A"},{"$error":"#N/A"},1.0000000000000047]
[{"$f":"PivotSheet!A298","v":0},null,{"$f":"PivotSheet!B298","v":0},{"$error":"#N/A"},{"$error":"#N/A"},{"$error":"#N/A"},{"$error":"#N/A"},{"$error":"#N/A"},1.0000000000000047]
[{"$f":"PivotSheet!A299","v":0},null,{"$f":"PivotSheet!B299","v":0},{"$error":"#N/A"},{"$error":"#N/A"},{"$error":"#N/A"},{"$error":"#N/A"},{"$error":"#N/A"},1.0000000000000047]
[{"$f":"PivotSheet!A300","v":0},null,{"$f":"PivotSheet!B300","v":0},{"$error":"#N/A"},{"$error":"#N/A"},{"$error":"#N/A"},{"$error":"#N/A"},{"$error":"#N/A"},1.0000000000000047]
[{"$f":"PivotSheet!A301","v":0},null,{"$f":"PivotSheet!B301","v":0},{"$error":"#N/A"},{"$error":"#N/A"},{"$error":"#N/A"},{"$error":"#N/A"},{"$error":"#N/A"},1.0000000000000047]
[{"$f":"PivotSheet!A302","v":0},null,{"$f":"PivotSheet!B302","v":0},{"$error":"#N/A"},{"$error":"#N/A"},{"$error":"#N/A"},{"$error":"#N/A"},{"$error":"#N/A"},1.0000000000000047]
[{"$f":"PivotSheet!A303","v":0},null,{"$f":"PivotSheet!B303","v":0},{"$error":"#N/A"},{"$error":"#N/A"},{"$error":"#N/A"},{"$error":"#N/A"},{"$error":"#N/A"},1.0000000000000047]
[{"$f":"PivotSheet!A304","v":0},null,{"$f":"PivotSheet!B304","v":0},{"$error":"#N/A"},{"$error":"#N/A"},{"$error":"#N/A"},{"$error":"#N/A"},{"$error":"#N/A"},1.0000000000000047]
[{"$f":"PivotSheet!A305","v":0},null,{"$f":"PivotSheet!B305","v":0},{"$error":"#N/A"},{"$error":"#N/A"},{"$error":"#N/A"},{"$error":"#N/A"},{"$error":"#N/A"},1.0000000000000047]
[{"$f":"PivotSheet!A306","v":0},null,{"$f":"PivotSheet!B306","v":0},{"$error":"#N/A"},{"$error":"#N/A"},{"$error":"#N/A"},{"$error":"#N/A"},{"$error":"#N/A"},1.0000000000000047]
[{"$f":"PivotSheet!A307","v":0},null,{"$f":"PivotSheet!B307","v":0},{"$error":"#N/A"},{"$error":"#N/A"},{"$error":"#N/A"},{"$error":"#N/A"},{"$error":"#N/A"},1.0000000000000047]
[{"$f":"PivotSheet!A308","v":0},null,{"$f":"PivotSheet!B308","v":0},{"$error":"#N/A"},{"$error":"#N/A"},{"$error":"#N/A"},{"$error":"#N/A"},{"$error":"#N/A"},1.0000000000000047]
[{"$f":"PivotSheet!A309","v":0},null,{"$f":"PivotSheet!B309","v":0},{"$error":"#N/A"},{"$error":"#N/A"},{"$error":"#N/A"},{"$error":"#N/A"},{"$error":"#N/A"},1.0000000000000047]
[{"$f":"PivotSheet!A310","v":0},null,{"$f":"PivotSheet!B310","v":0},{"$error":"#N/A"},{"$error":"#N/A"},{"$error":"#N/A"},{"$error":"#N/A"},{"$error":"#N/A"},1.0000000000000047]
[{"$f":"PivotSheet!A311","v":0},null,{"$f":"PivotSheet!B311","v":0},{"$error":"#N/A"},{"$error":"#N/A"},{"$error":"#N/A"},{"$error":"#N/A"},{"$error":"#N/A"},1.0000000000000047]
[{"$f":"PivotSheet!A312","v":0},null,{"$f":"PivotSheet!B312","v":0},{"$error":"#N/A"},{"$error":"#N/A"},{"$error":"#N/A"},{"$error":"#N/A"},{"$error":"#N/A"},1.0000000000000047]
[{"$f":"PivotSheet!A313","v":0},null,{"$f":"PivotSheet!B313","v":0},{"$error":"#N/A"},{"$error":"#N/A"},{"$error":"#N/A"},{"$error":"#N/A"},{"$error":"#N/A"},1.0000000000000047]
[{"$f":"PivotSheet!A314","v":0},null,{"$f":"PivotSheet!B314","v":0},{"$error":"#N/A"},{"$error":"#N/A"},{"$error":"#N/A"},{"$error":"#N/A"},{"$error":"#N/A"},1.0000000000000047]
[{"$f":"PivotSheet!A315","v":0},null,{"$f":"PivotSheet!B315","v":0},{"$error":"#N/A"},{"$error":"#N/A"},{"$error":"#N/A"},{"$error":"#N/A"},{"$error":"#N/A"},1.0000000000000047]
[{"$f":"PivotSheet!A316","v":0},null,{"$f":"PivotSheet!B316","v":0},{"$error":"#N/A"},{"$error":"#N/A"},{"$error":"#N/A"},{"$error":"#N/A"},{"$error":"#N/A"},1.0000000000000047]
[{"$f":"PivotSheet!A317","v":0},null,{"$f":"PivotSheet!B317","v":0},{"$error":"#N/A"},{"$error":"#N/A"},{"$error":"#N/A"},{"$error":"#N/A"},{"$error":"#N/A"},1.0000000000000047]
[{"$f":"PivotSheet!A318","v":0},null,{"$f":"PivotSheet!B318","v":0},{"$error":"#N/A"},{"$error":"#N/A"},{"$error":"#N/A"},{"$error":"#N/A"},{"$error":"#N/A"},1.0000000000000047]
[{"$f":"PivotSheet!A319","v":0},null,{"$f":"PivotSheet!B319","v":0},{"$error":"#N/A"},{"$error":"#N/A"},{"$error":"#N/A"},{"$error":"#N/A"},{"$error":"#N/A"},1.0000000000000047]
[{"$f":"PivotSheet!A320","v":0},null,{"$f":"PivotSheet!B320","v":0},{"$error":"#N/A"},{"$error":"#N/A"},{"$error":"#N/A"},{"$error":"#N/A"},{"$error":"#N/A"},1.0000000000000047]
[{"$f":"PivotSheet!A321","v":0},null,{"$f":"PivotSheet!B321","v":0},{"$error":"#N/A"},{"$error":"#N/A"},{"$error":"#N/A"},{"$error":"#N/A"},{"$error":"#N/A"},1.0000000000000047]
[{"$f":"PivotSheet!A322","v":0},null,{"$f":"PivotSheet!B322","v":0},{"$error":"#N/A"},{"$error":"#N/A"},{"$error":"#N/A"},{"$error":"#N/A"},{"$error":"#N/A"},1.0000000000000047]
[{"$f":"PivotSheet!A323","v":0},null,{"$f":"PivotSheet!B323","v":0},{"$f":"IF(B323=\"a\",1,NA())","v":{"$error":"#N/A"}},{"$f":"IF(B323=\"b\",1,NA())","v":{"$error":"#N/A"}},{"$f":"IF(B323=\"c\",1,NA())","v":{"$error":"#N/A"}},{"$f":"IF(B323=\"d\",1,NA())","v":{"$error":"#N/A"}},{"$f":"IF(B323=\"e\",1,NA())","v":{"$error":"#N/A"}},1.0000000000000047]
[{"$f":"PivotSheet!A324","v":0},null,{"$f":"PivotSheet!B324","v":0},{"$error":"#N/A"},{"$error":"#N/A"},{"$error":"#N/A"},{"$error":"#N/A"},{"$error":"#N/A"},{"$f":"C324/SUM($C$2:$C$10000)+I323","v":1.0000000000000047}]
[{"$f":"PivotSheet!A325","v":0},null,{"$f":"PivotSheet!B325","v":0},{"$error":"#N/A"},{"$error":"#N/A"},{"$error":"#N/A"},{"$error":"#N/A"},{"$error":"#N/A"},1.0000000000000047]
[{"$f":"PivotSheet!A326","v":0},null,{"$f":"PivotSheet!B326","v":0},{"$error":"#N/A"},{"$error":"#N/A"},{"$error":"#N/A"},{"$error":"#N/A"},{"$error":"#N/A"},1.0000000000000047]
[{"$f":"PivotSheet!A327","v":0},null,{"$f":"PivotSheet!B327","v":0},{"$error":"#N/A"},{"$error":"#N/A"},{"$error":"#N/A"},{"$error":"#N/A"},{"$error":"#N/A"},1.0000000000000047]
[{"$f":"PivotSheet!A328","v":0},null,{"$f":"PivotSheet!B328","v":0},{"$error":"#N/A"},{"$error":"#N/A"},{"$error":"#N/A"},{"$error":"#N/A"},{"$error":"#N/A"},1.0000000000000047]
[{"$f":"PivotSheet!A329","v":0},null,{"$f":"PivotSheet!B329","v":0},{"$error":"#N/A"},{"$error":"#N/A"},{"$error":"#N/A"},{"$error":"#N/A"},{"$error":"#N/A"},1.0000000000000047]
[{"$f":"PivotSheet!A330","v":0},null,{"$f":"PivotSheet!B330","v":0},{"$error":"#N/A"},{"$error":"#N/A"},{"$error":"#N/A"},{"$error":"#N/A"},{"$error":"#N/A"},1.0000000000000047]
[{"$f":"PivotSheet!A331","v":0},null,{"$f":"PivotSheet!B331","v":0},{"$error":"#N/A"},{"$error":"#N/A"},{"$error":"#N/A"},{"$error":"#N/A"},{"$error":"#N/A"},1.0000000000000047]
[{"$f":"PivotSheet!A332","v":0},null,{"$f":"PivotSheet!B332","v":0},{"$error":"#N/A"},{"$error":"#N/A"},{"$error":"#N/A"},{"$error":"#N/A"},{"$error":"#N/A"},1.0000000000000047]
[{"$f":"PivotSheet!A333","v":0},null,{"$f":"PivotSheet!B333","v":0},{"$error":"#N/A"},{"$error":"#N/A"},{"$error":"#N/A"},{"$error":"#N/A"},{"$error":"#N/A"},1.0000000000000047]
[{"$f":"PivotSheet!A334","v":0},null,{"$f":"PivotSheet!B334","v":0},{"$error":"#N/A"},{"$error":"#N/A"},{"$error":"#N/A"},{"$error":"#N/A"},{"$error":"#N/A"},1.0000000000000047]
[{"$f":"PivotSheet!A335","v":0},null,{"$f":"PivotSheet!B335","v":0},{"$error":"#N/A"},{"$error":"#N/A"},{"$error":"#N/A"},{"$error":"#N/A"},{"$error":"#N/A"},1.0000000000000047]
[{"$f":"PivotSheet!A336","v":0},null,{"$f":"PivotSheet!B336","v":0},{"$error":"#N/A"},{"$error":"#N/A"},{"$error":"#N/A"},{"$error":"#N/A"},{"$error":"#N/A"},1.0000000000000047]
[{"$f":"PivotSheet!A337","v":0},null,{"$f":"PivotSheet!B337","v":0},{"$error":"#N/A"},{"$error":"#N/A"},{"$error":"#N/A"},{"$error":"#N/A"},{"$error":"#N/A"},1.0000000000000047]
[{"$f":"PivotSheet!A338","v":0},null,{"$f":"PivotSheet!B338","v":0},{"$error":"#N/A"},{"$error":"#N/A"},{"$error":"#N/A"},{"$error":"#N/A"},{"$error":"#N/A"},1.0000000000000047]
[{"$f":"PivotSheet!A339","v":0},null,{"$f":"PivotSheet!B339","v":0},{"$error":"#N/A"},{"$error":"#N/A"},{"$error":"#N/A"},{"$error":"#N/A"},{"$error":"#N/A"},1.0000000000000047]
[{"$f":"PivotSheet!A340","v":0},null,{"$f":"PivotSheet!B340","v":0},{"$error":"#N/A"},{"$error":"#N/A"},{"$error":"#N/A"},{"$error":"#N/A"},{"$error":"#N/A"},1.0000000000000047]
[{"$f":"PivotSheet!A341","v":0},null,{"$f":"PivotSheet!B341","v":0},{"$error":"#N/A"},{"$error":"#N/A"},{"$error":"#N/A"},{"$error":"#N/A"},{"$error":"#N/A"},1.0000000000000047]
[{"$f":"PivotSheet!A342","v":0},null,{"$f":"PivotSheet!B342","v":0},{"$error":"#N/A"},{"$error":"#N/A"},{"$error":"#N/A"},{"$error":"#N/A"},{"$error":"#N/A"},1.0000000000000047]
[{"$f":"PivotSheet!A343","v":0},null,{"$f":"PivotSheet!B343","v":0},{"$error":"#N/A"},{"$error":"#N/A"},{"$error":"#N/A"},{"$error":"#N/A"},{"$error":"#N/A"},1.0000000000000047]
[{"$f":"PivotSheet!A344","v":0},null,{"$f":"PivotSheet!B344","v":0},{"$error":"#N/A"},{"$error":"#N/A"},{"$error":"#N/A"},{"$error":"#N/A"},{"$error":"#N/A"},1.0000000000000047]
[{"$f":"PivotSheet!A345","v":0},null,{"$f":"PivotSheet!B345","v":0},{"$error":"#N/A"},{"$error":"#N/A"},{"$error":"#N/A"},{"$error":"#N/A"},{"$error":"#N/A"},1.0000000000000047]
[{"$f":"PivotSheet!A346","v":0},null,{"$f":"PivotSheet!B346","v":0},{"$error":"#N/A"},{"$error":"#N/A"},{"$error":"#N/A"},{"$error":"#N/A"},{"$error":"#N/A"},1.0000000000000047]
[{"$f":"PivotSheet!A347","v":0},null,{"$f":"PivotSheet!B347","v":0},{"$error":"#N/A"},{"$error":"#N/A"},{"$error":"#N/A"},{"$error":"#N/A"},{"$error":"#N/A"},1.0000000000000047]
[{"$f":"PivotSheet!A348","v":0},null,{"$f":"PivotSheet!B348","v":0},{"$error":"#N/A"},{"$error":"#N/A"},{"$error":"#N/A"},{"$error":"#N/A"},{"$error":"#N/A"},1.0000000000000047]
[{"$f":"PivotSheet!A349","v":0},null,{"$f":"PivotSheet!B349","v":0},{"$error":"#N/A"},{"$error":"#N/A"},{"$error":"#N/A"},{"$error":"#N/A"},{"$error":"#N/A"},1.0000000000000047]
[{"$f":"PivotSheet!A350","v":0},null,{"$f":"PivotSheet!B350","v":0},{"$error":"#N/A"},{"$error":"#N/A"},{"$error":"#N/A"},{"$error":"#N/A"},{"$error":"#N/A"},1.0000000000000047]
[{"$f":"PivotSheet!A351","v":0},null,{"$f":"PivotSheet!B351","v":0},{"$error":"#N/A"},{"$error":"#N/A"},{"$error":"#N/A"},{"$error":"#N/A"},{"$error":"#N/A"},1.0000000000000047]
[{"$f":"PivotSheet!A352","v":0},null,{"$f":"PivotSheet!B352","v":0},{"$error":"#N/A"},{"$error":"#N/A"},{"$error":"#N/A"},{"$error":"#N/A"},{"$error":"#N/A"},1.0000000000000047]
[{"$f":"PivotSheet!A353","v":0},null,{"$f":"PivotSheet!B353","v":0},{"$error":"#N/A"},{"$error":"#N/A"},{"$error":"#N/A"},{"$error":"#N/A"},{"$error":"#N/A"},1.0000000000000047]
[{"$f":"PivotSheet!A354","v":0},null,{"$f":"PivotSheet!B354","v":0},{"$error":"#N/A"},{"$error":"#N/A"},{"$error":"#N/A"},{"$error":"#N/A"},{"$error":"#N/A"},1.0000000000000047]
[{"$f":"PivotSheet!A355","v":0},null,{"$f":"PivotSheet!B355","v":0},{"$error":"#N/A"},{"$error":"#N/A"},{"$error":"#N/A"},{"$error":"#N/A"},{"$error":"#N/A"},1.0000000000000047]
[{"$f":"PivotSheet!A356","v":0},null,{"$f":"PivotSheet!B356","v":0},{"$error":"#N/A"},{"$error":"#N/A"},{"$error":"#N/A"},{"$error":"#N/A"},{"$error":"#N/A"},1.0000000000000047]
[{"$f":"PivotSheet!A357","v":0},null,{"$f":"PivotSheet!B357","v":0},{"$error":"#N/A"},{"$error":"#N/A"},{"$error":"#N/A"},{"$error":"#N/A"},{"$error":"#N/A"},1.0000000000000047]
[{"$f":"PivotSheet!A358","v":0},null,{"$f":"PivotSheet!B358","v":0},{"$error":"#N/A"},{"$error":"#N/A"},{"$error":"#N/A"},{"$error":"#N/A"},{"$error":"#N/A"},1.0000000000000047]
[{"$f":"PivotSheet!A359","v":0},null,{"$f":"PivotSheet!B359","v":0},{"$error":"#N/A"},{"$error":"#N/A"},{"$error":"#N/A"},{"$error":"#N/A"},{"$error":"#N/A"},1.0000000000000047]
[{"$f":"PivotSheet!A360","v":0},null,{"$f":"PivotSheet!B360","v":0},{"$error":"#N/A"},{"$error":"#N/A"},{"$error":"#N/A"},{"$error":"#N/A"},{"$error":"#N/A"},1.0000000000000047]
[{"$f":"PivotSheet!A361","v":0},null,{"$f":"PivotSheet!B361","v":0},{"$error":"#N/A"},{"$error":"#N/A"},{"$error":"#N/A"},{"$error":"#N/A"},{"$error":"#N/A"},1.0000000000000047]
[{"$f":"PivotSheet!A362","v":0},null,{"$f":"PivotSheet!B362","v":0},{"$error":"#N/A"},{"$error":"#N/A"},{"$error":"#N/A"},{"$error":"#N/A"},{"$error":"#N/A"},1.0000000000000047]
[{"$f":"PivotSheet!A363","v":0},null,{"$f":"PivotSheet!B363","v":0},{"$error":"#N/A"},{"$error":"#N/A"},{"$error":"#N/A"},{"$error":"#N/A"},{"$error":"#N/A"},1.0000000000000047]
[{"$f":"PivotSheet!A364","v":0},null,{"$f":"PivotSheet!B364","v":0},{"$error":"#N/A"},{"$error":"#N/A"},{"$error":"#N/A"},{"$error":"#N/A"},{"$error":"#N/A"},1.0000000000000047]
[{"$f":"PivotSheet!A365","v":0},null,{"$f":"PivotSheet!B365","v":0},{"$error":"#N/A"},{"$error":"#N/A"},{"$error":"#N/A"},{"$error":"#N/A"},{"$error":"#N/A"},1.0000000000000047]
[{"$f":"PivotSheet!A366","v":0},null,{"$f":"PivotSheet!B366","v":0},{"$error":"#N/A"},{"$error":"#N/A"},{"$error":"#N/A"},{"$error":"#N/A"},{"$error":"#N/A"},1.0000000000000047]

{"sheet":"Std. Dev","index":5,"n_rows":365,"n_cols":22,"rows_kept":365,"cut":false,"hidden":true,"merged":[]}
["Data","Frequency","Group","Group 1","Group 2","Group 3","Group 4","Group 5","Cum. Freq"]
[{"$f":"PivotSheet!A2","v":2},{"$f":"PivotSheet!B2","v":1},{"$f":"IF(A2<=$V$4,\"a\",IF(A2<=$V$6,\"b\",IF(A2<=$V$8,\"c\",IF(A2<=$V$10,\"d\",IF(A2<=$V$12,\"e\",\"ERROR\")))))","v":"a"},{"$f":"IF(C2=\"a\",1,NA())","v":1},{"$f":"IF(C2=\"b\",1,NA())","v":{"$error":"#N/A"}},{"$f":"IF(C2=\"c\",1,NA())","v":{"$error":"#N/A"}},{"$f":"IF(C2=\"d\",1,NA())","v":{"$error":"#N/A"}},{"$f":"IF(C2=\"e\",1,NA())","v":{"$error":"#N/A"}},{"$f":"B2/SUM($B$2:$B$10000)","v":2.881844380403458E-3},"2 levels of Intensity",null,null,null,null,null,null,null,null,null,"Group",null,"Std. Dev"]
[{"$f":"PivotSheet!A3","v":3},{"$f":"PivotSheet!B3","v":2},"a",{"$f":"IF(C3=\"a\",1,NA())","v":1},{"$f":"IF(C3=\"b\",1,NA())","v":{"$error":"#N/A"}},{"$f":"IF(C3=\"c\",1,NA())","v":{"$error":"#N/A"}},{"$f":"IF(C3=\"d\",1,NA())","v":{"$error":"#N/A"}},{"$f":"IF(C3=\"e\",1,NA())","v":{"$error":"#N/A"}},{"$f":"B3/SUM($B$2:$B$10000)+I2","v":8.6455331412103736E-3},null,"Min Value","Max Value",null,null,null,null,null,null,null,"a","Min Value",{"$f":"INDEX($K$4:$L$26,MATCH(1,(Data!$F$2=$M$4:$M$26)*(T3=$N$4:$N$26),0),MATCH(U3,$K$3:$L$3,0))","v":2}]
[{"$f":"PivotSheet!A4","v":4},{"$f":"PivotSheet!B4","v":1},"a",1,{"$error":"#N/A"},{"$error":"#N/A"},{"$error":"#N/A"},{"$error":"#N/A"},{"$f":"B4/SUM($B$2:$B$10000)+I3","v":1.1527377521613832E-2},"A-Size",{"$f":"MIN([0]!Data_Plot)","v":2},{"$f":"MAX(AVERAGE([0]!Data_Plot),K4)","v":241.85878962536023},2,"a",null,null,null,null,null,"a","Max Value",{"$f":"INDEX($K$4:$L$26,MATCH(1,(Data!$F$2=$M$4:$M$26)*(T4=$N$4:$N$26),0),MATCH(U4,$K$3:$L$3,0))","v":101.81618586118071}]
[{"$f":"PivotSheet!A5","v":5},{"$f":"PivotSheet!B5","v":1},"a",1,{"$error":"#N/A"},{"$error":"#N/A"},{"$error":"#N/A"},{"$error":"#N/A"},1.4409221902017291E-2,"B-Size",{"$f":"$L$4+1","v":242.85878962536023},{"$f":"MAX([0]!Data_Plot)","v":498},2,"b",null,null,null,null,null,"b","Min Value",{"$f":"INDEX($K$4:$L$26,MATCH(1,(Data!$F$2=$M$4:$M$26)*(T5=$N$4:$N$26),0),MATCH(U5,$K$3:$L$3,0))","v":102.81618586118071}]
[{"$f":"PivotSheet!A6","v":6},{"$f":"PivotSheet!B6","v":1},"a",1,{"$error":"#N/A"},{"$error":"#N/A"},{"$error":"#N/A"},{"$error":"#N/A"},1.7291066282420747E-2,null,null,null,null,null,null,null,null,null,null,"b","Max Value",{"$f":"INDEX($K$4:$L$26,MATCH(1,(Data!$F$2=$M$4:$M$26)*(T6=$N$4:$N$26),0),MATCH(U6,$K$3:$L$3,0))","v":381.90139338953975}]
[{"$f":"PivotSheet!A7","v":10},{"$f":"PivotSheet!B7","v":2},"a",1,{"$error":"#N/A"},{"$error":"#N/A"},{"$error":"#N/A"},{"$error":"#N/A"},2.3054755043227664E-2,"3 Levels of Intensity",null,null,null,null,null,null,null,null,null,"c","Min Value",{"$f":"INDEX($K$4:$L$26,MATCH(1,(Data!$F$2=$M$4:$M$26)*(T7=$N$4:$N$26),0),MATCH(U7,$K$3:$L$3,0))","v":382.90139338953975}]
[{"$f":"PivotSheet!A8","v":11},{"$f":"PivotSheet!B8","v":1},"a",1,{"$error":"#N/A"},{"$error":"#N/A"},{"$error":"#N/A"},{"$error":"#N/A"},2.5936599423631121E-2,null,null,null,null,null,null,null,null,null,null,"c","Max Value",{"$f":"INDEX($K$4:$L$26,MATCH(1,(Data!$F$2=$M$4:$M$26)*(T8=$N$4:$N$26),0),MATCH(U8,$K$3:$L$3,0))","v":498}]
[{"$f":"PivotSheet!A9","v":12},{"$f":"PivotSheet!B9","v":1},"a",1,{"$error":"#N/A"},{"$error":"#N/A"},{"$error":"#N/A"},{"$error":"#N/A"},2.8818443804034578E-2,"A-Size",{"$f":"MIN([0]!Data_Plot)","v":2},{"$f":"MAX(K9,AVERAGE([0]!Data_Plot)-(_xlfn.STDEV.S([0]!Data_Plot)))","v":101.81618586118071},3,"a",null,null,null,null,null,"d","Min Value",{"$f":"INDEX($K$4:$L$26,MATCH(1,(Data!$F$2=$M$4:$M$26)*(T9=$N$4:$N$26),0),MATCH(U9,$K$3:$L$3,0))","v":{"$error":"#N/A"}}]
[{"$f":"PivotSheet!A10","v":14},{"$f":"PivotSheet!B10","v":1},"a",1,{"$error":"#N/A"},{"$error":"#N/A"},{"$error":"#N/A"},{"$error":"#N/A"},3.1700288184438034E-2,"B-Size",{"$f":"$L$9+1","v":102.81618586118071},{"$f":"MAX(K10,AVERAGE([0]!Data_Plot)+(_xlfn.STDEV.S([0]!Data_Plot)))","v":381.90139338953975},3,"b",null,null,null,null,null,"d","Max Value",{"$f":"INDEX($K$4:$L$26,MATCH(1,(Data!$F$2=$M$4:$M$26)*(T10=$N$4:$N$26),0),MATCH(U10,$K$3:$L$3,0))","v":{"$error":"#N/A"}}]
[{"$f":"PivotSheet!A11","v":15},{"$f":"PivotSheet!B11","v":1},"a",1,{"$error":"#N/A"},{"$error":"#N/A"},{"$error":"#N/A"},{"$error":"#N/A"},3.4582132564841495E-2,"C-Size",{"$f":"$L$10+1","v":382.90139338953975},{"$f":"MAX([0]!Data_Plot)","v":498},3,"c",null,null,null,null,null,"e","Min Value",{"$f":"INDEX($K$4:$L$26,MATCH(1,(Data!$F$2=$M$4:$M$26)*(T11=$N$4:$N$26),0),MATCH(U11,$K$3:$L$3,0))","v":{"$error":"#N/A"}}]
[{"$f":"PivotSheet!A12","v":17},{"$f":"PivotSheet!B12","v":1},"a",1,{"$error":"#N/A"},{"$error":"#N/A"},{"$error":"#N/A"},{"$error":"#N/A"},3.7463976945244955E-2,null,null,null,null,null,null,null,null,null,null,"e","Max Value",{"$f":"INDEX($K$4:$L$26,MATCH(1,(Data!$F$2=$M$4:$M$26)*(T12=$N$4:$N$26),0),MATCH(U12,$K$3:$L$3,0))","v":{"$error":"#N/A"}}]
[{"$f":"PivotSheet!A13","v":21},{"$f":"PivotSheet!B13","v":1},"a",1,{"$error":"#N/A"},{"$error":"#N/A"},{"$error":"#N/A"},{"$error":"#N/A"},4.0345821325648415E-2,"4 Levels of Intensity"]
[{"$f":"PivotSheet!A14","v":22},{"$f":"PivotSheet!B14","v":1},"a",1,{"$error":"#N/A"},{"$error":"#N/A"},{"$error":"#N/A"},{"$error":"#N/A"},4.3227665706051875E-2]
[{"$f":"PivotSheet!A15","v":25},{"$f":"PivotSheet!B15","v":1},"a",1,{"$error":"#N/A"},{"$error":"#N/A"},{"$error":"#N/A"},{"$error":"#N/A"},4.6109510086455335E-2,"A-Size",{"$f":"MIN([0]!Data_Plot)","v":2},{"$f":"MAX(K15,AVERAGE([0]!Data_Plot)-(_xlfn.STDEV.S([0]!Data_Plot)))","v":101.81618586118071},4,"a"]
[{"$f":"PivotSheet!A16","v":28},{"$f":"PivotSheet!B16","v":1},"a",1,{"$error":"#N/A"},{"$error":"#N/A"},{"$error":"#N/A"},{"$error":"#N/A"},4.8991354466858796E-2,"B-Size",{"$f":"L15+1","v":102.81618586118071},{"$f":"MAX(K16,AVERAGE([0]!Data_Plot))","v":241.85878962536023},4,"b"]
[{"$f":"PivotSheet!A17","v":29},{"$f":"PivotSheet!B17","v":3},"a",1,{"$error":"#N/A"},{"$error":"#N/A"},{"$error":"#N/A"},{"$error":"#N/A"},5.7636887608069169E-2,"C-Size",{"$f":"L16+1","v":242.85878962536023},{"$f":"MAX(K17,AVERAGE([0]!Data_Plot)+(_xlfn.STDEV.S([0]!Data_Plot)))","v":381.90139338953975},4,"c"]
[{"$f":"PivotSheet!A18","v":30},{"$f":"PivotSheet!B18","v":2},"a",1,{"$error":"#N/A"},{"$error":"#N/A"},{"$error":"#N/A"},{"$error":"#N/A"},6.3400576368876083E-2,"D-Size",{"$f":"L17+1","v":382.90139338953975},{"$f":"MAX([0]!Data_Plot)","v":498},4,"d"]
[{"$f":"PivotSheet!A19","v":34},{"$f":"PivotSheet!B19","v":1},"a",1,{"$error":"#N/A"},{"$error":"#N/A"},{"$error":"#N/A"},{"$error":"#N/A"},6.6282420749279536E-2]
[{"$f":"PivotSheet!A20","v":39},{"$f":"PivotSheet!B20","v":2},"a",1,{"$error":"#N/A"},{"$error":"#N/A"},{"$error":"#N/A"},{"$error":"#N/A"},7.2046109510086456E-2,"5 Levels of Intensity"]
[{"$f":"PivotSheet!A21","v":41},{"$f":"PivotSheet!B21","v":1},"a",1,{"$error":"#N/A"},{"$error":"#N/A"},{"$error":"#N/A"},{"$error":"#N/A"},7.492795389048991E-2]
[{"$f":"PivotSheet!A22","v":42},{"$f":"PivotSheet!B22","v":1},"a",1,{"$error":"#N/A"},{"$error":"#N/A"},{"$error":"#N/A"},{"$error":"#N/A"},7.7809798270893363E-2,"A-Size",{"$f":"MIN([0]!Data_Plot)","v":2},{"$f":"MAX(K22,AVERAGE([0]!Data_Plot)-(_xlfn.STDEV.S([0]!Data_Plot)))","v":101.81618586118071},5,"a"]
[{"$f":"PivotSheet!A23","v":45},{"$f":"PivotSheet!B23","v":2},"a",1,{"$error":"#N/A"},{"$error":"#N/A"},{"$error":"#N/A"},{"$error":"#N/A"},8.3573487031700283E-2,"B-Size",{"$f":"L22+1","v":102.81618586118071},{"$f":"MAX(K23,AVERAGE([0]!Data_Plot)-0.5*(_xlfn.STDEV.S([0]!Data_Plot)))","v":171.83748774327046},5,"b"]
[{"$f":"PivotSheet!A24","v":47},{"$f":"PivotSheet!B24","v":1},"a",1,{"$error":"#N/A"},{"$error":"#N/A"},{"$error":"#N/A"},{"$error":"#N/A"},8.6455331412103736E-2,"C-Size",{"$f":"L23+1","v":172.83748774327046},{"$f":"MAX(K24,AVERAGE([0]!Data_Plot)+0.5*(_xlfn.STDEV.S([0]!Data_Plot)))","v":311.88009150745},5,"c"]
[{"$f":"PivotSheet!A25","v":49},{"$f":"PivotSheet!B25","v":1},"a",1,{"$error":"#N/A"},{"$error":"#N/A"},{"$error":"#N/A"},{"$error":"#N/A"},8.933717579250719E-2,"D-Size",{"$f":"L24+1","v":312.88009150745},{"$f":"MAX(K25,AVERAGE([0]!Data_Plot)+(_xlfn.STDEV.S([0]!Data_Plot)))","v":381.90139338953975},5,"d"]
[{"$f":"PivotSheet!A26","v":50},{"$f":"PivotSheet!B26","v":1},"a",1,{"$error":"#N/A"},{"$error":"#N/A"},{"$error":"#N/A"},{"$error":"#N/A"},9.2219020172910643E-2,"E-size",{"$f":"L25+1","v":382.90139338953975},{"$f":"MAX([0]!Data_Plot)","v":498},5,"e"]
[{"$f":"PivotSheet!A27","v":51},{"$f":"PivotSheet!B27","v":1},"a",1,{"$error":"#N/A"},{"$error":"#N/A"},{"$error":"#N/A"},{"$error":"#N/A"},9.5100864553314096E-2]
[{"$f":"PivotSheet!A28","v":53},{"$f":"PivotSheet!B28","v":1},"a",1,{"$error":"#N/A"},{"$error":"#N/A"},{"$error":"#N/A"},{"$error":"#N/A"},9.7982708933717549E-2]
[{"$f":"PivotSheet!A29","v":54},{"$f":"PivotSheet!B29","v":1},"a",1,{"$error":"#N/A"},{"$error":"#N/A"},{"$error":"#N/A"},{"$error":"#N/A"},0.100864553314121]
[{"$f":"PivotSheet!A30","v":55},{"$f":"PivotSheet!B30","v":1},"a",1,{"$error":"#N/A"},{"$error":"#N/A"},{"$error":"#N/A"},{"$error":"#N/A"},0.10374639769452446]
[{"$f":"PivotSheet!A31","v":61},{"$f":"PivotSheet!B31","v":1},"a",1,{"$error":"#N/A"},{"$error":"#N/A"},{"$error":"#N/A"},{"$error":"#N/A"},0.10662824207492791]
[{"$f":"PivotSheet!A32","v":62},{"$f":"PivotSheet!B32","v":2},"a",1,{"$error":"#N/A"},{"$error":"#N/A"},{"$error":"#N/A"},{"$error":"#N/A"},0.11239193083573483]
[{"$f":"PivotSheet!A33","v":63},{"$f":"PivotSheet!B33","v":1},"a",1,{"$error":"#N/A"},{"$error":"#N/A"},{"$error":"#N/A"},{"$error":"#N/A"},0.11527377521613828]
[{"$f":"PivotSheet!A34","v":66},{"$f":"PivotSheet!B34","v":1},"a",1,{"$error":"#N/A"},{"$error":"#N/A"},{"$error":"#N/A"},{"$error":"#N/A"},0.11815561959654174]
[{"$f":"PivotSheet!A35","v":67},{"$f":"PivotSheet!B35","v":1},"a",1,{"$error":"#N/A"},{"$error":"#N/A"},{"$error":"#N/A"},{"$error":"#N/A"},0.12103746397694519]
[{"$f":"PivotSheet!A36","v":68},{"$f":"PivotSheet!B36","v":1},"a",1,{"$error":"#N/A"},{"$error":"#N/A"},{"$error":"#N/A"},{"$error":"#N/A"},0.12391930835734864]
[{"$f":"PivotSheet!A37","v":69},{"$f":"PivotSheet!B37","v":2},"a",1,{"$error":"#N/A"},{"$error":"#N/A"},{"$error":"#N/A"},{"$error":"#N/A"},0.12968299711815556]
[{"$f":"PivotSheet!A38","v":72},{"$f":"PivotSheet!B38","v":1},"a",1,{"$error":"#N/A"},{"$error":"#N/A"},{"$error":"#N/A"},{"$error":"#N/A"},0.13256484149855902]
[{"$f":"PivotSheet!A39","v":75},{"$f":"PivotSheet!B39","v":2},"a",1,{"$error":"#N/A"},{"$error":"#N/A"},{"$error":"#N/A"},{"$error":"#N/A"},0.13832853025936592]
[{"$f":"PivotSheet!A40","v":78},{"$f":"PivotSheet!B40","v":1},"a",1,{"$error":"#N/A"},{"$error":"#N/A"},{"$error":"#N/A"},{"$error":"#N/A"},0.14121037463976938]
[{"$f":"PivotSheet!A41","v":79},{"$f":"PivotSheet!B41","v":2},"a",1,{"$error":"#N/A"},{"$error":"#N/A"},{"$error":"#N/A"},{"$error":"#N/A"},0.14697406340057628]
[{"$f":"PivotSheet!A42","v":82},{"$f":"PivotSheet!B42","v":3},"a",1,{"$error":"#N/A"},{"$error":"#N/A"},{"$error":"#N/A"},{"$error":"#N/A"},0.15561959654178667]
[{"$f":"PivotSheet!A43","v":84},{"$f":"PivotSheet!B43","v":1},"a",1,{"$error":"#N/A"},{"$error":"#N/A"},{"$error":"#N/A"},{"$error":"#N/A"},0.15850144092219012]
[{"$f":"PivotSheet!A44","v":85},{"$f":"PivotSheet!B44","v":2},"a",1,{"$error":"#N/A"},{"$error":"#N/A"},{"$error":"#N/A"},{"$error":"#N/A"},0.16426512968299703]
[{"$f":"PivotSheet!A45","v":87},{"$f":"PivotSheet!B45","v":2},"a",1,{"$error":"#N/A"},{"$error":"#N/A"},{"$error":"#N/A"},{"$error":"#N/A"},0.17002881844380394]
[{"$f":"PivotSheet!A46","v":88},{"$f":"PivotSheet!B46","v":2},"a",1,{"$error":"#N/A"},{"$error":"#N/A"},{"$error":"#N/A"},{"$error":"#N/A"},0.17579250720461084]
[{"$f":"PivotSheet!A47","v":89},{"$f":"PivotSheet!B47","v":3},"a",1,{"$error":"#N/A"},{"$error":"#N/A"},{"$error":"#N/A"},{"$error":"#N/A"},0.18443804034582123]
[{"$f":"PivotSheet!A48","v":90},{"$f":"PivotSheet!B48","v":1},"a",1,{"$error":"#N/A"},{"$error":"#N/A"},{"$error":"#N/A"},{"$error":"#N/A"},0.18731988472622468]
[{"$f":"PivotSheet!A49","v":94},{"$f":"PivotSheet!B49","v":1},"a",1,{"$error":"#N/A"},{"$error":"#N/A"},{"$error":"#N/A"},{"$error":"#N/A"},0.19020172910662814]
[{"$f":"PivotSheet!A50","v":97},{"$f":"PivotSheet!B50","v":1},"a",1,{"$error":"#N/A"},{"$error":"#N/A"},{"$error":"#N/A"},{"$error":"#N/A"},0.19308357348703159]
[{"$f":"PivotSheet!A51","v":98},{"$f":"PivotSheet!B51","v":1},"a",1,{"$error":"#N/A"},{"$error":"#N/A"},{"$error":"#N/A"},{"$error":"#N/A"},0.19596541786743504]
[{"$f":"PivotSheet!A52","v":99},{"$f":"PivotSheet!B52","v":1},"a",1,{"$error":"#N/A"},{"$error":"#N/A"},{"$error":"#N/A"},{"$error":"#N/A"},0.1988472622478385]
[{"$f":"PivotSheet!A53","v":100},{"$f":"PivotSheet!B53","v":1},"a",1,{"$error":"#N/A"},{"$error":"#N/A"},{"$error":"#N/A"},{"$error":"#N/A"},0.20172910662824195]
[{"$f":"PivotSheet!A54","v":102},{"$f":"PivotSheet!B54","v":2},"b",{"$error":"#N/A"},1,{"$error":"#N/A"},{"$error":"#N/A"},{"$error":"#N/A"},0.20749279538904886]
[{"$f":"PivotSheet!A55","v":104},{"$f":"PivotSheet!B55","v":2},"b",{"$error":"#N/A"},1,{"$error":"#N/A"},{"$error":"#N/A"},{"$error":"#N/A"},0.21325648414985576]
[{"$f":"PivotSheet!A56","v":106},{"$f":"PivotSheet!B56","v":3},"b",{"$error":"#N/A"},1,{"$error":"#N/A"},{"$error":"#N/A"},{"$error":"#N/A"},0.22190201729106615]
[{"$f":"PivotSheet!A57","v":108},{"$f":"PivotSheet!B57","v":1},"b",{"$error":"#N/A"},1,{"$error":"#N/A"},{"$error":"#N/A"},{"$error":"#N/A"},0.2247838616714696]
[{"$f":"PivotSheet!A58","v":109},{"$f":"PivotSheet!B58","v":1},"b",{"$error":"#N/A"},1,{"$error":"#N/A"},{"$error":"#N/A"},{"$error":"#N/A"},0.22766570605187306]
[{"$f":"PivotSheet!A59","v":110},{"$f":"PivotSheet!B59","v":1},"b",{"$error":"#N/A"},1,{"$error":"#N/A"},{"$error":"#N/A"},{"$error":"#N/A"},0.23054755043227651]
[{"$f":"PivotSheet!A60","v":111},{"$f":"PivotSheet!B60","v":1},"b",{"$error":"#N/A"},1,{"$error":"#N/A"},{"$error":"#N/A"},{"$error":"#N/A"},0.23342939481267996]
[{"$f":"PivotSheet!A61","v":114},{"$f":"PivotSheet!B61","v":1},"b",{"$error":"#N/A"},1,{"$error":"#N/A"},{"$error":"#N/A"},{"$error":"#N/A"},0.23631123919308342]
[{"$f":"PivotSheet!A62","v":118},{"$f":"PivotSheet!B62","v":1},"b",{"$error":"#N/A"},1,{"$error":"#N/A"},{"$error":"#N/A"},{"$error":"#N/A"},0.23919308357348687]
[{"$f":"PivotSheet!A63","v":121},{"$f":"PivotSheet!B63","v":1},"b",{"$error":"#N/A"},1,{"$error":"#N/A"},{"$error":"#N/A"},{"$error":"#N/A"},0.24207492795389032]
[{"$f":"PivotSheet!A64","v":122},{"$f":"PivotSheet!B64","v":2},"b",{"$error":"#N/A"},1,{"$error":"#N/A"},{"$error":"#N/A"},{"$error":"#N/A"},0.24783861671469723]
[{"$f":"PivotSheet!A65","v":123},{"$f":"PivotSheet!B65","v":3},"b",{"$error":"#N/A"},1,{"$error":"#N/A"},{"$error":"#N/A"},{"$error":"#N/A"},0.25648414985590762]
[{"$f":"PivotSheet!A66","v":125},{"$f":"PivotSheet!B66","v":2},{"$f":"IF(A66<=$V$4,\"a\",IF(A66<=$V$6,\"b\",IF(A66<=$V$8,\"c\",IF(A66<=$V$10,\"d\",IF(A66<=$V$12,\"e\",\"ERROR\")))))","v":"b"},{"$error":"#N/A"},1,{"$error":"#N/A"},{"$error":"#N/A"},{"$error":"#N/A"},0.26224783861671452]
[{"$f":"PivotSheet!A67","v":127},{"$f":"PivotSheet!B67","v":1},"b",{"$f":"IF(C67=\"a\",1,NA())","v":{"$error":"#N/A"}},{"$f":"IF(C67=\"b\",1,NA())","v":1},{"$f":"IF(C67=\"c\",1,NA())","v":{"$error":"#N/A"}},{"$f":"IF(C67=\"d\",1,NA())","v":{"$error":"#N/A"}},{"$f":"IF(C67=\"e\",1,NA())","v":{"$error":"#N/A"}},0.26512968299711798]
[{"$f":"PivotSheet!A68","v":128},{"$f":"PivotSheet!B68","v":1},"b",{"$error":"#N/A"},1,{"$error":"#N/A"},{"$error":"#N/A"},{"$error":"#N/A"},{"$f":"B68/SUM($B$2:$B$10000)+I67","v":0.26801152737752143}]
[{"$f":"PivotSheet!A69","v":129},{"$f":"PivotSheet!B69","v":1},"b",{"$error":"#N/A"},1,{"$error":"#N/A"},{"$error":"#N/A"},{"$error":"#N/A"},0.27089337175792488]
[{"$f":"PivotSheet!A70","v":133},{"$f":"PivotSheet!B70","v":1},"b",{"$error":"#N/A"},1,{"$error":"#N/A"},{"$error":"#N/A"},{"$error":"#N/A"},0.27377521613832834]
[{"$f":"PivotSheet!A71","v":135},{"$f":"PivotSheet!B71","v":1},"b",{"$error":"#N/A"},1,{"$error":"#N/A"},{"$error":"#N/A"},{"$error":"#N/A"},0.27665706051873179]
[{"$f":"PivotSheet!A72","v":137},{"$f":"PivotSheet!B72","v":3},"b",{"$error":"#N/A"},1,{"$error":"#N/A"},{"$error":"#N/A"},{"$error":"#N/A"},0.28530259365994215]
[{"$f":"PivotSheet!A73","v":139},{"$f":"PivotSheet!B73","v":1},"b",{"$error":"#N/A"},1,{"$error":"#N/A"},{"$error":"#N/A"},{"$error":"#N/A"},0.2881844380403456]
[{"$f":"PivotSheet!A74","v":140},{"$f":"PivotSheet!B74","v":1},"b",{"$error":"#N/A"},1,{"$error":"#N/A"},{"$error":"#N/A"},{"$error":"#N/A"},0.29106628242074906]
[{"$f":"PivotSheet!A75","v":141},{"$f":"PivotSheet!B75","v":2},"b",{"$error":"#N/A"},1,{"$error":"#N/A"},{"$error":"#N/A"},{"$error":"#N/A"},0.29682997118155596]
[{"$f":"PivotSheet!A76","v":144},{"$f":"PivotSheet!B76","v":1},"b",{"$error":"#N/A"},1,{"$error":"#N/A"},{"$error":"#N/A"},{"$error":"#N/A"},0.29971181556195942]
[{"$f":"PivotSheet!A77","v":145},{"$f":"PivotSheet!B77","v":2},"b",{"$error":"#N/A"},1,{"$error":"#N/A"},{"$error":"#N/A"},{"$error":"#N/A"},0.30547550432276632]
[{"$f":"PivotSheet!A78","v":147},{"$f":"PivotSheet!B78","v":1},"b",{"$error":"#N/A"},1,{"$error":"#N/A"},{"$error":"#N/A"},{"$error":"#N/A"},0.30835734870316978]
[{"$f":"PivotSheet!A79","v":150},{"$f":"PivotSheet!B79","v":1},"b",{"$error":"#N/A"},1,{"$error":"#N/A"},{"$error":"#N/A"},{"$error":"#N/A"},0.31123919308357323]
[{"$f":"PivotSheet!A80","v":154},{"$f":"PivotSheet!B80","v":1},"b",{"$error":"#N/A"},1,{"$error":"#N/A"},{"$error":"#N/A"},{"$error":"#N/A"},0.31412103746397668]
[{"$f":"PivotSheet!A81","v":155},{"$f":"PivotSheet!B81","v":2},"b",{"$error":"#N/A"},1,{"$error":"#N/A"},{"$error":"#N/A"},{"$error":"#N/A"},0.31988472622478359]
[{"$f":"PivotSheet!A82","v":156},{"$f":"PivotSheet!B82","v":3},"b",{"$error":"#N/A"},1,{"$error":"#N/A"},{"$error":"#N/A"},{"$error":"#N/A"},0.32853025936599395]
[{"$f":"PivotSheet!A83","v":158},{"$f":"PivotSheet!B83","v":1},"b",{"$error":"#N/A"},1,{"$error":"#N/A"},{"$error":"#N/A"},{"$error":"#N/A"},0.3314121037463974]
[{"$f":"PivotSheet!A84","v":159},{"$f":"PivotSheet!B84","v":1},"b",{"$error":"#N/A"},1,{"$error":"#N/A"},{"$error":"#N/A"},{"$error":"#N/A"},0.33429394812680086]
[{"$f":"PivotSheet!A85","v":161},{"$f":"PivotSheet!B85","v":2},"b",{"$error":"#N/A"},1,{"$error":"#N/A"},{"$error":"#N/A"},{"$error":"#N/A"},0.34005763688760776]
[{"$f":"PivotSheet!A86","v":165},{"$f":"PivotSheet!B86","v":1},"b",{"$error":"#N/A"},1,{"$error":"#N/A"},{"$error":"#N/A"},{"$error":"#N/A"},0.34293948126801121]
[{"$f":"PivotSheet!A87","v":166},{"$f":"PivotSheet!B87","v":2},"b",{"$error":"#N/A"},1,{"$error":"#N/A"},{"$error":"#N/A"},{"$error":"#N/A"},0.34870317002881812]
[{"$f":"PivotSheet!A88","v":167},{"$f":"PivotSheet!B88","v":1},"b",{"$error":"#N/A"},1,{"$error":"#N/A"},{"$error":"#N/A"},{"$error":"#N/A"},0.35158501440922157]
[{"$f":"PivotSheet!A89","v":168},{"$f":"PivotSheet!B89","v":1},"b",{"$error":"#N/A"},1,{"$error":"#N/A"},{"$error":"#N/A"},{"$error":"#N/A"},0.35446685878962503]
[{"$f":"PivotSheet!A90","v":169},{"$f":"PivotSheet!B90","v":1},"b",{"$error":"#N/A"},1,{"$error":"#N/A"},{"$error":"#N/A"},{"$error":"#N/A"},0.35734870317002848]
[{"$f":"PivotSheet!A91","v":170},{"$f":"PivotSheet!B91","v":1},"b",{"$error":"#N/A"},1,{"$error":"#N/A"},{"$error":"#N/A"},{"$error":"#N/A"},0.36023054755043193]
[{"$f":"PivotSheet!A92","v":171},{"$f":"PivotSheet!B92","v":3},"b",{"$error":"#N/A"},1,{"$error":"#N/A"},{"$error":"#N/A"},{"$error":"#N/A"},0.36887608069164229]
[{"$f":"PivotSheet!A93","v":172},{"$f":"PivotSheet!B93","v":2},"b",{"$error":"#N/A"},1,{"$error":"#N/A"},{"$error":"#N/A"},{"$error":"#N/A"},0.3746397694524492]
[{"$f":"PivotSheet!A94","v":174},{"$f":"PivotSheet!B94","v":1},"b",{"$error":"#N/A"},1,{"$error":"#N/A"},{"$error":"#N/A"},{"$error":"#N/A"},0.37752161383285265]
[{"$f":"PivotSheet!A95","v":177},{"$f":"PivotSheet!B95","v":1},"b",{"$error":"#N/A"},1,{"$error":"#N/A"},{"$error":"#N/A"},{"$error":"#N/A"},0.38040345821325611]
[{"$f":"PivotSheet!A96","v":178},{"$f":"PivotSheet!B96","v":2},"b",{"$error":"#N/A"},1,{"$error":"#N/A"},{"$error":"#N/A"},{"$error":"#N/A"},0.38616714697406301]
[{"$f":"PivotSheet!A97","v":179},{"$f":"PivotSheet!B97","v":2},"b",{"$error":"#N/A"},1,{"$error":"#N/A"},{"$error":"#N/A"},{"$error":"#N/A"},0.39193083573486992]
[{"$f":"PivotSheet!A98","v":181},{"$f":"PivotSheet!B98","v":3},"b",{"$error":"#N/A"},1,{"$error":"#N/A"},{"$error":"#N/A"},{"$error":"#N/A"},0.40057636887608028]
[{"$f":"PivotSheet!A99","v":182},{"$f":"PivotSheet!B99","v":1},"b",{"$error":"#N/A"},1,{"$error":"#N/A"},{"$error":"#N/A"},{"$error":"#N/A"},0.40345821325648373]
[{"$f":"PivotSheet!A100","v":186},{"$f":"PivotSheet!B100","v":2},"b",{"$error":"#N/A"},1,{"$error":"#N/A"},{"$error":"#N/A"},{"$error":"#N/A"},0.40922190201729064]
[{"$f":"PivotSheet!A101","v":187},{"$f":"PivotSheet!B101","v":2},"b",{"$error":"#N/A"},1,{"$error":"#N/A"},{"$error":"#N/A"},{"$error":"#N/A"},0.41498559077809755]
[{"$f":"PivotSheet!A102","v":189},{"$f":"PivotSheet!B102","v":1},"b",{"$error":"#N/A"},1,{"$error":"#N/A"},{"$error":"#N/A"},{"$error":"#N/A"},0.417867435158501]
[{"$f":"PivotSheet!A103","v":190},{"$f":"PivotSheet!B103","v":2},"b",{"$error":"#N/A"},1,{"$error":"#N/A"},{"$error":"#N/A"},{"$error":"#N/A"},0.42363112391930791]
[{"$f":"PivotSheet!A104","v":191},{"$f":"PivotSheet!B104","v":2},"b",{"$error":"#N/A"},1,{"$error":"#N/A"},{"$error":"#N/A"},{"$error":"#N/A"},0.42939481268011481]
[{"$f":"PivotSheet!A105","v":196},{"$f":"PivotSheet!B105","v":1},"b",{"$error":"#N/A"},1,{"$error":"#N/A"},{"$error":"#N/A"},{"$error":"#N/A"},0.43227665706051827]
[{"$f":"PivotSheet!A106","v":197},{"$f":"PivotSheet!B106","v":1},"b",{"$error":"#N/A"},1,{"$error":"#N/A"},{"$error":"#N/A"},{"$error":"#N/A"},0.43515850144092172]
[{"$f":"PivotSheet!A107","v":203},{"$f":"PivotSheet!B107","v":1},"b",{"$error":"#N/A"},1,{"$error":"#N/A"},{"$error":"#N/A"},{"$error":"#N/A"},0.43804034582132517]
[{"$f":"PivotSheet!A108","v":204},{"$f":"PivotSheet!B108","v":1},"b",{"$error":"#N/A"},1,{"$error":"#N/A"},{"$error":"#N/A"},{"$error":"#N/A"},0.44092219020172863]
[{"$f":"PivotSheet!A109","v":206},{"$f":"PivotSheet!B109","v":1},"b",{"$error":"#N/A"},1,{"$error":"#N/A"},{"$error":"#N/A"},{"$error":"#N/A"},0.44380403458213208]
[{"$f":"PivotSheet!A110","v":208},{"$f":"PivotSheet!B110","v":1},"b",{"$error":"#N/A"},1,{"$error":"#N/A"},{"$error":"#N/A"},{"$error":"#N/A"},0.44668587896253553]
[{"$f":"PivotSheet!A111","v":213},{"$f":"PivotSheet!B111","v":3},"b",{"$error":"#N/A"},1,{"$error":"#N/A"},{"$error":"#N/A"},{"$error":"#N/A"},0.45533141210374589]
[{"$f":"PivotSheet!A112","v":214},{"$f":"PivotSheet!B112","v":1},"b",{"$error":"#N/A"},1,{"$error":"#N/A"},{"$error":"#N/A"},{"$error":"#N/A"},0.45821325648414934]
[{"$f":"PivotSheet!A113","v":217},{"$f":"PivotSheet!B113","v":1},"b",{"$error":"#N/A"},1,{"$error":"#N/A"},{"$error":"#N/A"},{"$error":"#N/A"},0.4610951008645528]
[{"$f":"PivotSheet!A114","v":218},{"$f":"PivotSheet!B114","v":2},"b",{"$error":"#N/A"},1,{"$error":"#N/A"},{"$error":"#N/A"},{"$error":"#N/A"},0.4668587896253597]
[{"$f":"PivotSheet!A115","v":220},{"$f":"PivotSheet!B115","v":1},"b",{"$error":"#N/A"},1,{"$error":"#N/A"},{"$error":"#N/A"},{"$error":"#N/A"},0.46974063400576316]
[{"$f":"PivotSheet!A116","v":222},{"$f":"PivotSheet!B116","v":1},"b",{"$error":"#N/A"},1,{"$error":"#N/A"},{"$error":"#N/A"},{"$error":"#N/A"},0.47262247838616661]
[{"$f":"PivotSheet!A117","v":226},{"$f":"PivotSheet!B117","v":1},"b",{"$error":"#N/A"},1,{"$error":"#N/A"},{"$error":"#N/A"},{"$error":"#N/A"},0.47550432276657006]
[{"$f":"PivotSheet!A118","v":227},{"$f":"PivotSheet!B118","v":1},"b",{"$error":"#N/A"},1,{"$error":"#N/A"},{"$error":"#N/A"},{"$error":"#N/A"},0.47838616714697352]
[{"$f":"PivotSheet!A119","v":228},{"$f":"PivotSheet!B119","v":1},"b",{"$error":"#N/A"},1,{"$error":"#N/A"},{"$error":"#N/A"},{"$error":"#N/A"},0.48126801152737697]
[{"$f":"PivotSheet!A120","v":229},{"$f":"PivotSheet!B120","v":2},"b",{"$error":"#N/A"},1,{"$error":"#N/A"},{"$error":"#N/A"},{"$error":"#N/A"},0.48703170028818388]
[{"$f":"PivotSheet!A121","v":235},{"$f":"PivotSheet!B121","v":1},"b",{"$error":"#N/A"},1,{"$error":"#N/A"},{"$error":"#N/A"},{"$error":"#N/A"},0.48991354466858733]
[{"$f":"PivotSheet!A122","v":236},{"$f":"PivotSheet!B122","v":1},"b",{"$error":"#N/A"},1,{"$error":"#N/A"},{"$error":"#N/A"},{"$error":"#N/A"},0.49279538904899078]
[{"$f":"PivotSheet!A123","v":238},{"$f":"PivotSheet!B123","v":1},"b",{"$error":"#N/A"},1,{"$error":"#N/A"},{"$error":"#N/A"},{"$error":"#N/A"},0.49567723342939424]
[{"$f":"PivotSheet!A124","v":239},{"$f":"PivotSheet!B124","v":2},"b",{"$error":"#N/A"},1,{"$error":"#N/A"},{"$error":"#N/A"},{"$error":"#N/A"},0.5014409221902012]
[{"$f":"PivotSheet!A125","v":241},{"$f":"PivotSheet!B125","v":2},"b",{"$error":"#N/A"},1,{"$error":"#N/A"},{"$error":"#N/A"},{"$error":"#N/A"},0.50720461095100811]
[{"$f":"PivotSheet!A126","v":244},{"$f":"PivotSheet!B126","v":1},"b",{"$error":"#N/A"},1,{"$error":"#N/A"},{"$error":"#N/A"},{"$error":"#N/A"},0.51008645533141161]
[{"$f":"PivotSheet!A127","v":248},{"$f":"PivotSheet!B127","v":1},"b",{"$error":"#N/A"},1,{"$error":"#N/A"},{"$error":"#N/A"},{"$error":"#N/A"},0.51296829971181512]
[{"$f":"PivotSheet!A128","v":249},{"$f":"PivotSheet!B128","v":3},"b",{"$error":"#N/A"},1,{"$error":"#N/A"},{"$error":"#N/A"},{"$error":"#N/A"},0.52161383285302554]
[{"$f":"PivotSheet!A129","v":252},{"$f":"PivotSheet!B129","v":2},"b",{"$error":"#N/A"},1,{"$error":"#N/A"},{"$error":"#N/A"},{"$error":"#N/A"},0.52737752161383245]
[{"$f":"PivotSheet!A130","v":256},{"$f":"PivotSheet!B130","v":1},{"$f":"IF(A130<=$V$4,\"a\",IF(A130<=$V$6,\"b\",IF(A130<=$V$8,\"c\",IF(A130<=$V$10,\"d\",IF(A130<=$V$12,\"e\",\"ERROR\")))))","v":"b"},{"$error":"#N/A"},1,{"$error":"#N/A"},{"$error":"#N/A"},{"$error":"#N/A"},0.53025936599423595]
[{"$f":"PivotSheet!A131","v":257},{"$f":"PivotSheet!B131","v":1},"b",{"$f":"IF(C131=\"a\",1,NA())","v":{"$error":"#N/A"}},{"$f":"IF(C131=\"b\",1,NA())","v":1},{"$f":"IF(C131=\"c\",1,NA())","v":{"$error":"#N/A"}},{"$f":"IF(C131=\"d\",1,NA())","v":{"$error":"#N/A"}},{"$f":"IF(C131=\"e\",1,NA())","v":{"$error":"#N/A"}},0.53314121037463946]
[{"$f":"PivotSheet!A132","v":258},{"$f":"PivotSheet!B132","v":1},"b",{"$error":"#N/A"},1,{"$error":"#N/A"},{"$error":"#N/A"},{"$error":"#N/A"},{"$f":"B132/SUM($B$2:$B$10000)+I131","v":0.53602305475504297}]
[{"$f":"PivotSheet!A133","v":260},{"$f":"PivotSheet!B133","v":1},"b",{"$error":"#N/A"},1,{"$error":"#N/A"},{"$error":"#N/A"},{"$error":"#N/A"},0.53890489913544648]
[{"$f":"PivotSheet!A134","v":264},{"$f":"PivotSheet!B134","v":1},"b",{"$error":"#N/A"},1,{"$error":"#N/A"},{"$error":"#N/A"},{"$error":"#N/A"},0.54178674351584999]
[{"$f":"PivotSheet!A135","v":265},{"$f":"PivotSheet!B135","v":1},"b",{"$error":"#N/A"},1,{"$error":"#N/A"},{"$error":"#N/A"},{"$error":"#N/A"},0.5446685878962535]
[{"$f":"PivotSheet!A136","v":266},{"$f":"PivotSheet!B136","v":1},"b",{"$error":"#N/A"},1,{"$error":"#N/A"},{"$error":"#N/A"},{"$error":"#N/A"},0.54755043227665701]
[{"$f":"PivotSheet!A137","v":267},{"$f":"PivotSheet!B137","v":2},"b",{"$error":"#N/A"},1,{"$error":"#N/A"},{"$error":"#N/A"},{"$error":"#N/A"},0.55331412103746391]
[{"$f":"PivotSheet!A138","v":269},{"$f":"PivotSheet!B138","v":2},"b",{"$error":"#N/A"},1,{"$error":"#N/A"},{"$error":"#N/A"},{"$error":"#N/A"},0.55907780979827082]
[{"$f":"PivotSheet!A139","v":270},{"$f":"PivotSheet!B139","v":1},"b",{"$error":"#N/A"},1,{"$error":"#N/A"},{"$error":"#N/A"},{"$error":"#N/A"},0.56195965417867433]
[{"$f":"PivotSheet!A140","v":273},{"$f":"PivotSheet!B140","v":1},"b",{"$error":"#N/A"},1,{"$error":"#N/A"},{"$error":"#N/A"},{"$error":"#N/A"},0.56484149855907784]
[{"$f":"PivotSheet!A141","v":275},{"$f":"PivotSheet!B141","v":1},"b",{"$error":"#N/A"},1,{"$error":"#N/A"},{"$error":"#N/A"},{"$error":"#N/A"},0.56772334293948135]
[{"$f":"PivotSheet!A142","v":277},{"$f":"PivotSheet!B142","v":1},"b",{"$error":"#N/A"},1,{"$error":"#N/A"},{"$error":"#N/A"},{"$error":"#N/A"},0.57060518731988485]
[{"$f":"PivotSheet!A143","v":278},{"$f":"PivotSheet!B143","v":1},"b",{"$error":"#N/A"},1,{"$error":"#N/A"},{"$error":"#N/A"},{"$error":"#N/A"},0.57348703170028836]
[{"$f":"PivotSheet!A144","v":280},{"$f":"PivotSheet!B144","v":1},"b",{"$error":"#N/A"},1,{"$error":"#N/A"},{"$error":"#N/A"},{"$error":"#N/A"},0.57636887608069187]
[{"$f":"PivotSheet!A145","v":282},{"$f":"PivotSheet!B145","v":1},"b",{"$error":"#N/A"},1,{"$error":"#N/A"},{"$error":"#N/A"},{"$error":"#N/A"},0.57925072046109538]
[{"$f":"PivotSheet!A146","v":286},{"$f":"PivotSheet!B146","v":1},"b",{"$error":"#N/A"},1,{"$error":"#N/A"},{"$error":"#N/A"},{"$error":"#N/A"},0.58213256484149889]
[{"$f":"PivotSheet!A147","v":289},{"$f":"PivotSheet!B147","v":2},"b",{"$error":"#N/A"},1,{"$error":"#N/A"},{"$error":"#N/A"},{"$error":"#N/A"},0.5878962536023058]
[{"$f":"PivotSheet!A148","v":291},{"$f":"PivotSheet!B148","v":1},"b",{"$error":"#N/A"},1,{"$error":"#N/A"},{"$error":"#N/A"},{"$error":"#N/A"},0.5907780979827093]
[{"$f":"PivotSheet!A149","v":292},{"$f":"PivotSheet!B149","v":3},"b",{"$error":"#N/A"},1,{"$error":"#N/A"},{"$error":"#N/A"},{"$error":"#N/A"},0.59942363112391972]
[{"$f":"PivotSheet!A150","v":293},{"$f":"PivotSheet!B150","v":1},"b",{"$error":"#N/A"},1,{"$error":"#N/A"},{"$error":"#N/A"},{"$error":"#N/A"},0.60230547550432323]
[{"$f":"PivotSheet!A151","v":294},{"$f":"PivotSheet!B151","v":1},"b",{"$error":"#N/A"},1,{"$error":"#N/A"},{"$error":"#N/A"},{"$error":"#N/A"},0.60518731988472674]
[{"$f":"PivotSheet!A152","v":295},{"$f":"PivotSheet!B152","v":4},"b",{"$error":"#N/A"},1,{"$error":"#N/A"},{"$error":"#N/A"},{"$error":"#N/A"},0.61671469740634055]
[{"$f":"PivotSheet!A153","v":296},{"$f":"PivotSheet!B153","v":1},"b",{"$error":"#N/A"},1,{"$error":"#N/A"},{"$error":"#N/A"},{"$error":"#N/A"},0.61959654178674406]
[{"$f":"PivotSheet!A154","v":297},{"$f":"PivotSheet!B154","v":2},"b",{"$error":"#N/A"},1,{"$error":"#N/A"},{"$error":"#N/A"},{"$error":"#N/A"},0.62536023054755097]
[{"$f":"PivotSheet!A155","v":301},{"$f":"PivotSheet!B155","v":1},"b",{"$error":"#N/A"},1,{"$error":"#N/A"},{"$error":"#N/A"},{"$error":"#N/A"},0.62824207492795447]
[{"$f":"PivotSheet!A156","v":302},{"$f":"PivotSheet!B156","v":1},"b",{"$error":"#N/A"},1,{"$error":"#N/A"},{"$error":"#N/A"},{"$error":"#N/A"},0.63112391930835798]
[{"$f":"PivotSheet!A157","v":303},{"$f":"PivotSheet!B157","v":1},"b",{"$error":"#N/A"},1,{"$error":"#N/A"},{"$error":"#N/A"},{"$error":"#N/A"},0.63400576368876149]
[{"$f":"PivotSheet!A158","v":305},{"$f":"PivotSheet!B158","v":1},"b",{"$error":"#N/A"},1,{"$error":"#N/A"},{"$error":"#N/A"},{"$error":"#N/A"},0.636887608069165]
[{"$f":"PivotSheet!A159","v":306},{"$f":"PivotSheet!B159","v":1},"b",{"$error":"#N/A"},1,{"$error":"#N/A"},{"$error":"#N/A"},{"$error":"#N/A"},0.63976945244956851]
[{"$f":"PivotSheet!A160","v":308},{"$f":"PivotSheet!B160","v":1},"b",{"$error":"#N/A"},1,{"$error":"#N/A"},{"$error":"#N/A"},{"$error":"#N/A"},0.64265129682997202]
[{"$f":"PivotSheet!A161","v":309},{"$f":"PivotSheet!B161","v":1},"b",{"$error":"#N/A"},1,{"$error":"#N/A"},{"$error":"#N/A"},{"$error":"#N/A"},0.64553314121037553]
[{"$f":"PivotSheet!A162","v":310},{"$f":"PivotSheet!B162","v":1},"b",{"$error":"#N/A"},1,{"$error":"#N/A"},{"$error":"#N/A"},{"$error":"#N/A"},0.64841498559077904]
[{"$f":"PivotSheet!A163","v":313},{"$f":"PivotSheet!B163","v":1},"b",{"$error":"#N/A"},1,{"$error":"#N/A"},{"$error":"#N/A"},{"$error":"#N/A"},0.65129682997118254]
[{"$f":"PivotSheet!A164","v":314},{"$f":"PivotSheet!B164","v":1},"b",{"$error":"#N/A"},1,{"$error":"#N/A"},{"$error":"#N/A"},{"$error":"#N/A"},0.65417867435158605]
[{"$f":"PivotSheet!A165","v":315},{"$f":"PivotSheet!B165","v":1},"b",{"$error":"#N/A"},1,{"$error":"#N/A"},{"$error":"#N/A"},{"$error":"#N/A"},0.65706051873198956]
[{"$f":"PivotSheet!A166","v":319},{"$f":"PivotSheet!B166","v":1},"b",{"$error":"#N/A"},1,{"$error":"#N/A"},{"$error":"#N/A"},{"$error":"#N/A"},0.65994236311239307]
[{"$f":"PivotSheet!A167","v":321},{"$f":"PivotSheet!B167","v":1},"b",{"$error":"#N/A"},1,{"$error":"#N/A"},{"$error":"#N/A"},{"$error":"#N/A"},0.66282420749279658]
[{"$f":"PivotSheet!A168","v":324},{"$f":"PivotSheet!B168","v":1},"b",{"$error":"#N/A"},1,{"$error":"#N/A"},{"$error":"#N/A"},{"$error":"#N/A"},0.66570605187320009]
[{"$f":"PivotSheet!A169","v":326},{"$f":"PivotSheet!B169","v":2},"b",{"$error":"#N/A"},1,{"$error":"#N/A"},{"$error":"#N/A"},{"$error":"#N/A"},0.671469740634007]
[{"$f":"PivotSheet!A170","v":327},{"$f":"PivotSheet!B170","v":1},"b",{"$error":"#N/A"},1,{"$error":"#N/A"},{"$error":"#N/A"},{"$error":"#N/A"},0.6743515850144105]
[{"$f":"PivotSheet!A171","v":328},{"$f":"PivotSheet!B171","v":2},"b",{"$error":"#N/A"},1,{"$error":"#N/A"},{"$error":"#N/A"},{"$error":"#N/A"},0.68011527377521741]
[{"$f":"PivotSheet!A172","v":329},{"$f":"PivotSheet!B172","v":2},"b",{"$error":"#N/A"},1,{"$error":"#N/A"},{"$error":"#N/A"},{"$error":"#N/A"},0.68587896253602432]
[{"$f":"PivotSheet!A173","v":330},{"$f":"PivotSheet!B173","v":1},"b",{"$error":"#N/A"},1,{"$error":"#N/A"},{"$error":"#N/A"},{"$error":"#N/A"},0.68876080691642783]
[{"$f":"PivotSheet!A174","v":332},{"$f":"PivotSheet!B174","v":3},"b",{"$error":"#N/A"},1,{"$error":"#N/A"},{"$error":"#N/A"},{"$error":"#N/A"},0.69740634005763824]
[{"$f":"PivotSheet!A175","v":334},{"$f":"PivotSheet!B175","v":1},"b",{"$error":"#N/A"},1,{"$error":"#N/A"},{"$error":"#N/A"},{"$error":"#N/A"},0.70028818443804175]
[{"$f":"PivotSheet!A176","v":335},{"$f":"PivotSheet!B176","v":1},"b",{"$error":"#N/A"},1,{"$error":"#N/A"},{"$error":"#N/A"},{"$error":"#N/A"},0.70317002881844526]
[{"$f":"PivotSheet!A177","v":337},{"$f":"PivotSheet!B177","v":2},"b",{"$error":"#N/A"},1,{"$error":"#N/A"},{"$error":"#N/A"},{"$error":"#N/A"},0.70893371757925217]
[{"$f":"PivotSheet!A178","v":338},{"$f":"PivotSheet!B178","v":1},"b",{"$error":"#N/A"},1,{"$error":"#N/A"},{"$error":"#N/A"},{"$error":"#N/A"},0.71181556195965567]
[{"$f":"PivotSheet!A179","v":339},{"$f":"PivotSheet!B179","v":2},"b",{"$error":"#N/A"},1,{"$error":"#N/A"},{"$error":"#N/A"},{"$error":"#N/A"},0.71757925072046258]
[{"$f":"PivotSheet!A180","v":343},{"$f":"PivotSheet!B180","v":1},"b",{"$error":"#N/A"},1,{"$error":"#N/A"},{"$error":"#N/A"},{"$error":"#N/A"},0.72046109510086609]
[{"$f":"PivotSheet!A181","v":345},{"$f":"PivotSheet!B181","v":2},"b",{"$error":"#N/A"},1,{"$error":"#N/A"},{"$error":"#N/A"},{"$error":"#N/A"},0.726224783861673]
[{"$f":"PivotSheet!A182","v":346},{"$f":"PivotSheet!B182","v":2},"b",{"$error":"#N/A"},1,{"$error":"#N/A"},{"$error":"#N/A"},{"$error":"#N/A"},0.7319884726224799]
[{"$f":"PivotSheet!A183","v":347},{"$f":"PivotSheet!B183","v":1},"b",{"$error":"#N/A"},1,{"$error":"#N/A"},{"$error":"#N/A"},{"$error":"#N/A"},0.73487031700288341]
[{"$f":"PivotSheet!A184","v":349},{"$f":"PivotSheet!B184","v":1},"b",{"$error":"#N/A"},1,{"$error":"#N/A"},{"$error":"#N/A"},{"$error":"#N/A"},0.73775216138328692]
[{"$f":"PivotSheet!A185","v":350},{"$f":"PivotSheet!B185","v":1},"b",{"$error":"#N/A"},1,{"$error":"#N/A"},{"$error":"#N/A"},{"$error":"#N/A"},0.74063400576369043]
[{"$f":"PivotSheet!A186","v":351},{"$f":"PivotSheet!B186","v":1},"b",{"$error":"#N/A"},1,{"$error":"#N/A"},{"$error":"#N/A"},{"$error":"#N/A"},0.74351585014409394]
[{"$f":"PivotSheet!A187","v":353},{"$f":"PivotSheet!B187","v":1},"b",{"$error":"#N/A"},1,{"$error":"#N/A"},{"$error":"#N/A"},{"$error":"#N/A"},0.74639769452449745]
[{"$f":"PivotSheet!A188","v":354},{"$f":"PivotSheet!B188","v":1},"b",{"$error":"#N/A"},1,{"$error":"#N/A"},{"$error":"#N/A"},{"$error":"#N/A"},0.74927953890490095]
[{"$f":"PivotSheet!A189","v":356},{"$f":"PivotSheet!B189","v":2},"b",{"$error":"#N/A"},1,{"$error":"#N/A"},{"$error":"#N/A"},{"$error":"#N/A"},0.75504322766570786]
[{"$f":"PivotSheet!A190","v":359},{"$f":"PivotSheet!B190","v":1},"b",{"$error":"#N/A"},1,{"$error":"#N/A"},{"$error":"#N/A"},{"$error":"#N/A"},0.75792507204611137]
[{"$f":"PivotSheet!A191","v":361},{"$f":"PivotSheet!B191","v":1},"b",{"$error":"#N/A"},1,{"$error":"#N/A"},{"$error":"#N/A"},{"$error":"#N/A"},0.76080691642651488]
[{"$f":"PivotSheet!A192","v":362},{"$f":"PivotSheet!B192","v":3},"b",{"$error":"#N/A"},1,{"$error":"#N/A"},{"$error":"#N/A"},{"$error":"#N/A"},0.76945244956772529]
[{"$f":"PivotSheet!A193","v":363},{"$f":"PivotSheet!B193","v":1},"b",{"$error":"#N/A"},1,{"$error":"#N/A"},{"$error":"#N/A"},{"$error":"#N/A"},0.7723342939481288]
[{"$f":"PivotSheet!A194","v":365},{"$f":"PivotSheet!B194","v":1},{"$f":"IF(A194<=$V$4,\"a\",IF(A194<=$V$6,\"b\",IF(A194<=$V$8,\"c\",IF(A194<=$V$10,\"d\",IF(A194<=$V$12,\"e\",\"ERROR\")))))","v":"b"},{"$error":"#N/A"},1,{"$error":"#N/A"},{"$error":"#N/A"},{"$error":"#N/A"},0.77521613832853231]
[{"$f":"PivotSheet!A195","v":366},{"$f":"PivotSheet!B195","v":1},"b",{"$f":"IF(C195=\"a\",1,NA())","v":{"$error":"#N/A"}},{"$f":"IF(C195=\"b\",1,NA())","v":1},{"$f":"IF(C195=\"c\",1,NA())","v":{"$error":"#N/A"}},{"$f":"IF(C195=\"d\",1,NA())","v":{"$error":"#N/A"}},{"$f":"IF(C195=\"e\",1,NA())","v":{"$error":"#N/A"}},0.77809798270893582]
[{"$f":"PivotSheet!A196","v":368},{"$f":"PivotSheet!B196","v":1},"b",{"$error":"#N/A"},1,{"$error":"#N/A"},{"$error":"#N/A"},{"$error":"#N/A"},{"$f":"B196/SUM($B$2:$B$10000)+I195","v":0.78097982708933933}]
[{"$f":"PivotSheet!A197","v":369},{"$f":"PivotSheet!B197","v":2},"b",{"$error":"#N/A"},1,{"$error":"#N/A"},{"$error":"#N/A"},{"$error":"#N/A"},0.78674351585014624]
[{"$f":"PivotSheet!A198","v":373},{"$f":"PivotSheet!B198","v":1},"b",{"$error":"#N/A"},1,{"$error":"#N/A"},{"$error":"#N/A"},{"$error":"#N/A"},0.78962536023054974]
[{"$f":"PivotSheet!A199","v":375},{"$f":"PivotSheet!B199","v":1},"b",{"$error":"#N/A"},1,{"$error":"#N/A"},{"$error":"#N/A"},{"$error":"#N/A"},0.79250720461095325]
[{"$f":"PivotSheet!A200","v":376},{"$f":"PivotSheet!B200","v":1},"b",{"$error":"#N/A"},1,{"$error":"#N/A"},{"$error":"#N/A"},{"$error":"#N/A"},0.79538904899135676]
[{"$f":"PivotSheet!A201","v":378},{"$f":"PivotSheet!B201","v":1},"b",{"$error":"#N/A"},1,{"$error":"#N/A"},{"$error":"#N/A"},{"$error":"#N/A"},0.79827089337176027]
[{"$f":"PivotSheet!A202","v":380},{"$f":"PivotSheet!B202","v":1},"b",{"$error":"#N/A"},1,{"$error":"#N/A"},{"$error":"#N/A"},{"$error":"#N/A"},0.80115273775216378]
[{"$f":"PivotSheet!A203","v":381},{"$f":"PivotSheet!B203","v":1},"b",{"$error":"#N/A"},1,{"$error":"#N/A"},{"$error":"#N/A"},{"$error":"#N/A"},0.80403458213256729]
[{"$f":"PivotSheet!A204","v":382},{"$f":"PivotSheet!B204","v":1},"c",{"$error":"#N/A"},{"$error":"#N/A"},1,{"$error":"#N/A"},{"$error":"#N/A"},0.8069164265129708]
[{"$f":"PivotSheet!A205","v":383},{"$f":"PivotSheet!B205","v":1},"c",{"$error":"#N/A"},{"$error":"#N/A"},1,{"$error":"#N/A"},{"$error":"#N/A"},0.80979827089337431]
[{"$f":"PivotSheet!A206","v":385},{"$f":"PivotSheet!B206","v":1},"c",{"$error":"#N/A"},{"$error":"#N/A"},1,{"$error":"#N/A"},{"$error":"#N/A"},0.81268011527377781]
[{"$f":"PivotSheet!A207","v":388},{"$f":"PivotSheet!B207","v":1},"c",{"$error":"#N/A"},{"$error":"#N/A"},1,{"$error":"#N/A"},{"$error":"#N/A"},0.81556195965418132]
[{"$f":"PivotSheet!A208","v":389},{"$f":"PivotSheet!B208","v":1},"c",{"$error":"#N/A"},{"$error":"#N/A"},1,{"$error":"#N/A"},{"$error":"#N/A"},0.81844380403458483]
[{"$f":"PivotSheet!A209","v":390},{"$f":"PivotSheet!B209","v":2},"c",{"$error":"#N/A"},{"$error":"#N/A"},1,{"$error":"#N/A"},{"$error":"#N/A"},0.82420749279539174]
[{"$f":"PivotSheet!A210","v":391},{"$f":"PivotSheet!B210","v":1},"c",{"$error":"#N/A"},{"$error":"#N/A"},1,{"$error":"#N/A"},{"$error":"#N/A"},0.82708933717579525]
[{"$f":"PivotSheet!A211","v":392},{"$f":"PivotSheet!B211","v":1},"c",{"$error":"#N/A"},{"$error":"#N/A"},1,{"$error":"#N/A"},{"$error":"#N/A"},0.82997118155619876]
[{"$f":"PivotSheet!A212","v":393},{"$f":"PivotSheet!B212","v":1},"c",{"$error":"#N/A"},{"$error":"#N/A"},1,{"$error":"#N/A"},{"$error":"#N/A"},0.83285302593660226]
[{"$f":"PivotSheet!A213","v":394},{"$f":"PivotSheet!B213","v":1},"c",{"$error":"#N/A"},{"$error":"#N/A"},1,{"$error":"#N/A"},{"$error":"#N/A"},0.83573487031700577]
[{"$f":"PivotSheet!A214","v":395},{"$f":"PivotSheet!B214","v":1},"c",{"$error":"#N/A"},{"$error":"#N/A"},1,{"$error":"#N/A"},{"$error":"#N/A"},0.83861671469740928]
[{"$f":"PivotSheet!A215","v":398},{"$f":"PivotSheet!B215","v":1},"c",{"$error":"#N/A"},{"$error":"#N/A"},1,{"$error":"#N/A"},{"$error":"#N/A"},0.84149855907781279]
[{"$f":"PivotSheet!A216","v":399},{"$f":"PivotSheet!B216","v":2},"c",{"$error":"#N/A"},{"$error":"#N/A"},1,{"$error":"#N/A"},{"$error":"#N/A"},0.8472622478386197]
[{"$f":"PivotSheet!A217","v":403},{"$f":"PivotSheet!B217","v":1},"c",{"$error":"#N/A"},{"$error":"#N/A"},1,{"$error":"#N/A"},{"$error":"#N/A"},0.85014409221902321]
[{"$f":"PivotSheet!A218","v":405},{"$f":"PivotSheet!B218","v":1},"c",{"$error":"#N/A"},{"$error":"#N/A"},1,{"$error":"#N/A"},{"$error":"#N/A"},0.85302593659942672]
[{"$f":"PivotSheet!A219","v":406},{"$f":"PivotSheet!B219","v":1},"c",{"$error":"#N/A"},{"$error":"#N/A"},1,{"$error":"#N/A"},{"$error":"#N/A"},0.85590778097983022]
[{"$f":"PivotSheet!A220","v":408},{"$f":"PivotSheet!B220","v":1},"c",{"$error":"#N/A"},{"$error":"#N/A"},1,{"$error":"#N/A"},{"$error":"#N/A"},0.85878962536023373]
[{"$f":"PivotSheet!A221","v":411},{"$f":"PivotSheet!B221","v":3},"c",{"$error":"#N/A"},{"$error":"#N/A"},1,{"$error":"#N/A"},{"$error":"#N/A"},0.86743515850144415]
[{"$f":"PivotSheet!A222","v":416},{"$f":"PivotSheet!B222","v":1},"c",{"$error":"#N/A"},{"$error":"#N/A"},1,{"$error":"#N/A"},{"$error":"#N/A"},0.87031700288184766]
[{"$f":"PivotSheet!A223","v":417},{"$f":"PivotSheet!B223","v":2},"c",{"$error":"#N/A"},{"$error":"#N/A"},1,{"$error":"#N/A"},{"$error":"#N/A"},0.87608069164265456]
[{"$f":"PivotSheet!A224","v":418},{"$f":"PivotSheet!B224","v":1},"c",{"$error":"#N/A"},{"$error":"#N/A"},1,{"$error":"#N/A"},{"$error":"#N/A"},0.87896253602305807]
[{"$f":"PivotSheet!A225","v":419},{"$f":"PivotSheet!B225","v":1},"c",{"$error":"#N/A"},{"$error":"#N/A"},1,{"$error":"#N/A"},{"$error":"#N/A"},0.88184438040346158]
[{"$f":"PivotSheet!A226","v":421},{"$f":"PivotSheet!B226","v":1},"c",{"$error":"#N/A"},{"$error":"#N/A"},1,{"$error":"#N/A"},{"$error":"#N/A"},0.88472622478386509]
[{"$f":"PivotSheet!A227","v":423},{"$f":"PivotSheet!B227","v":1},"c",{"$error":"#N/A"},{"$error":"#N/A"},1,{"$error":"#N/A"},{"$error":"#N/A"},0.8876080691642686]
[{"$f":"PivotSheet!A228","v":428},{"$f":"PivotSheet!B228","v":1},"c",{"$error":"#N/A"},{"$error":"#N/A"},1,{"$error":"#N/A"},{"$error":"#N/A"},0.89048991354467211]
[{"$f":"PivotSheet!A229","v":435},{"$f":"PivotSheet!B229","v":2},"c",{"$error":"#N/A"},{"$error":"#N/A"},1,{"$error":"#N/A"},{"$error":"#N/A"},0.89625360230547901]
[{"$f":"PivotSheet!A230","v":439},{"$f":"PivotSheet!B230","v":1},"c",{"$error":"#N/A"},{"$error":"#N/A"},1,{"$error":"#N/A"},{"$error":"#N/A"},0.89913544668588252]
[{"$f":"PivotSheet!A231","v":441},{"$f":"PivotSheet!B231","v":1},"c",{"$error":"#N/A"},{"$error":"#N/A"},1,{"$error":"#N/A"},{"$error":"#N/A"},0.90201729106628603]
[{"$f":"PivotSheet!A232","v":447},{"$f":"PivotSheet!B232","v":1},"c",{"$error":"#N/A"},{"$error":"#N/A"},1,{"$error":"#N/A"},{"$error":"#N/A"},0.90489913544668954]
[{"$f":"PivotSheet!A233","v":449},{"$f":"PivotSheet!B233","v":1},"c",{"$error":"#N/A"},{"$error":"#N/A"},1,{"$error":"#N/A"},{"$error":"#N/A"},0.90778097982709305]
[{"$f":"PivotSheet!A234","v":453},{"$f":"PivotSheet!B234","v":3},"c",{"$error":"#N/A"},{"$error":"#N/A"},1,{"$error":"#N/A"},{"$error":"#N/A"},0.91642651296830346]
[{"$f":"PivotSheet!A235","v":455},{"$f":"PivotSheet!B235","v":1},"c",{"$error":"#N/A"},{"$error":"#N/A"},1,{"$error":"#N/A"},{"$error":"#N/A"},0.91930835734870697]
[{"$f":"PivotSheet!A236","v":459},{"$f":"PivotSheet!B236","v":2},"c",{"$error":"#N/A"},{"$error":"#N/A"},1,{"$error":"#N/A"},{"$error":"#N/A"},0.92507204610951388]
[{"$f":"PivotSheet!A237","v":460},{"$f":"PivotSheet!B237","v":1},"c",{"$error":"#N/A"},{"$error":"#N/A"},1,{"$error":"#N/A"},{"$error":"#N/A"},0.92795389048991739]
[{"$f":"PivotSheet!A238","v":461},{"$f":"PivotSheet!B238","v":1},"c",{"$error":"#N/A"},{"$error":"#N/A"},1,{"$error":"#N/A"},{"$error":"#N/A"},0.9308357348703209]
[{"$f":"PivotSheet!A239","v":466},{"$f":"PivotSheet!B239","v":1},"c",{"$error":"#N/A"},{"$error":"#N/A"},1,{"$error":"#N/A"},{"$error":"#N/A"},0.93371757925072441]
[{"$f":"PivotSheet!A240","v":467},{"$f":"PivotSheet!B240","v":1},"c",{"$error":"#N/A"},{"$error":"#N/A"},1,{"$error":"#N/A"},{"$error":"#N/A"},0.93659942363112791]
[{"$f":"PivotSheet!A241","v":469},{"$f":"PivotSheet!B241","v":2},"c",{"$error":"#N/A"},{"$error":"#N/A"},1,{"$error":"#N/A"},{"$error":"#N/A"},0.94236311239193482]
[{"$f":"PivotSheet!A242","v":475},{"$f":"PivotSheet!B242","v":1},"c",{"$error":"#N/A"},{"$error":"#N/A"},1,{"$error":"#N/A"},{"$error":"#N/A"},0.94524495677233833]
[{"$f":"PivotSheet!A243","v":476},{"$f":"PivotSheet!B243","v":3},"c",{"$error":"#N/A"},{"$error":"#N/A"},1,{"$error":"#N/A"},{"$error":"#N/A"},0.95389048991354874]
[{"$f":"PivotSheet!A244","v":480},{"$f":"PivotSheet!B244","v":1},"c",{"$error":"#N/A"},{"$error":"#N/A"},1,{"$error":"#N/A"},{"$error":"#N/A"},0.95677233429395225]
[{"$f":"PivotSheet!A245","v":483},{"$f":"PivotSheet!B245","v":1},"c",{"$error":"#N/A"},{"$error":"#N/A"},1,{"$error":"#N/A"},{"$error":"#N/A"},0.95965417867435576]
[{"$f":"PivotSheet!A246","v":484},{"$f":"PivotSheet!B246","v":1},"c",{"$error":"#N/A"},{"$error":"#N/A"},1,{"$error":"#N/A"},{"$error":"#N/A"},0.96253602305475927]
[{"$f":"PivotSheet!A247","v":485},{"$f":"PivotSheet!B247","v":1},"c",{"$error":"#N/A"},{"$error":"#N/A"},1,{"$error":"#N/A"},{"$error":"#N/A"},0.96541786743516278]
[{"$f":"PivotSheet!A248","v":487},{"$f":"PivotSheet!B248","v":1},"c",{"$error":"#N/A"},{"$error":"#N/A"},1,{"$error":"#N/A"},{"$error":"#N/A"},0.96829971181556629]
[{"$f":"PivotSheet!A249","v":488},{"$f":"PivotSheet!B249","v":3},"c",{"$error":"#N/A"},{"$error":"#N/A"},1,{"$error":"#N/A"},{"$error":"#N/A"},0.9769452449567767]
[{"$f":"PivotSheet!A250","v":489},{"$f":"PivotSheet!B250","v":2},"c",{"$error":"#N/A"},{"$error":"#N/A"},1,{"$error":"#N/A"},{"$error":"#N/A"},0.98270893371758361]
[{"$f":"PivotSheet!A251","v":490},{"$f":"PivotSheet!B251","v":1},"c",{"$error":"#N/A"},{"$error":"#N/A"},1,{"$error":"#N/A"},{"$error":"#N/A"},0.98559077809798712]
[{"$f":"PivotSheet!A252","v":494},{"$f":"PivotSheet!B252","v":1},"c",{"$error":"#N/A"},{"$error":"#N/A"},1,{"$error":"#N/A"},{"$error":"#N/A"},0.98847262247839063]
[{"$f":"PivotSheet!A253","v":496},{"$f":"PivotSheet!B253","v":1},"c",{"$error":"#N/A"},{"$error":"#N/A"},1,{"$error":"#N/A"},{"$error":"#N/A"},0.99135446685879414]
[{"$f":"PivotSheet!A254","v":497},{"$f":"PivotSheet!B254","v":1},"c",{"$error":"#N/A"},{"$error":"#N/A"},1,{"$error":"#N/A"},{"$error":"#N/A"},0.99423631123919765]
[{"$f":"PivotSheet!A255","v":498},{"$f":"PivotSheet!B255","v":2},"c",{"$error":"#N/A"},{"$error":"#N/A"},1,{"$error":"#N/A"},{"$error":"#N/A"},1.0000000000000047]
[{"$f":"PivotSheet!A256","v":"(blank)"},{"$f":"PivotSheet!B256","v":0},{"$error":"#N/A"},{"$error":"#N/A"},{"$error":"#N/A"},{"$error":"#N/A"},{"$error":"#N/A"},{"$error":"#N/A"},1.0000000000000047]
[{"$f":"PivotSheet!A257","v":0},{"$f":"PivotSheet!B257","v":0},"a",1,{"$error":"#N/A"},{"$error":"#N/A"},{"$error":"#N/A"},{"$error":"#N/A"},1.0000000000000047]
[{"$f":"PivotSheet!A258","v":0},{"$f":"PivotSheet!B258","v":0},{"$f":"IF(A258<=$V$4,\"a\",IF(A258<=$V$6,\"b\",IF(A258<=$V$8,\"c\",IF(A258<=$V$10,\"d\",IF(A258<=$V$12,\"e\",\"ERROR\")))))","v":"a"},1,{"$error":"#N/A"},{"$error":"#N/A"},{"$error":"#N/A"},{"$error":"#N/A"},1.0000000000000047]
[{"$f":"PivotSheet!A259","v":0},{"$f":"PivotSheet!B259","v":0},"a",{"$f":"IF(C259=\"a\",1,NA())","v":1},{"$f":"IF(C259=\"b\",1,NA())","v":{"$error":"#N/A"}},{"$f":"IF(C259=\"c\",1,NA())","v":{"$error":"#N/A"}},{"$f":"IF(C259=\"d\",1,NA())","v":{"$error":"#N/A"}},{"$f":"IF(C259=\"e\",1,NA())","v":{"$error":"#N/A"}},1.0000000000000047]
[{"$f":"PivotSheet!A260","v":0},{"$f":"PivotSheet!B260","v":0},"a",1,{"$error":"#N/A"},{"$error":"#N/A"},{"$error":"#N/A"},{"$error":"#N/A"},{"$f":"B260/SUM($B$2:$B$10000)+I259","v":1.0000000000000047}]
[{"$f":"PivotSheet!A261","v":0},{"$f":"PivotSheet!B261","v":0},"a",1,{"$error":"#N/A"},{"$error":"#N/A"},{"$error":"#N/A"},{"$error":"#N/A"},1.0000000000000047]
[{"$f":"PivotSheet!A262","v":0},{"$f":"PivotSheet!B262","v":0},"a",1,{"$error":"#N/A"},{"$error":"#N/A"},{"$error":"#N/A"},{"$error":"#N/A"},1.0000000000000047]
[{"$f":"PivotSheet!A263","v":0},{"$f":"PivotSheet!B263","v":0},"a",1,{"$error":"#N/A"},{"$error":"#N/A"},{"$error":"#N/A"},{"$error":"#N/A"},1.0000000000000047]
[{"$f":"PivotSheet!A264","v":0},{"$f":"PivotSheet!B264","v":0},"a",1,{"$error":"#N/A"},{"$error":"#N/A"},{"$error":"#N/A"},{"$error":"#N/A"},1.0000000000000047]
[{"$f":"PivotSheet!A265","v":0},{"$f":"PivotSheet!B265","v":0},"a",1,{"$error":"#N/A"},{"$error":"#N/A"},{"$error":"#N/A"},{"$error":"#N/A"},1.0000000000000047]
[{"$f":"PivotSheet!A266","v":0},{"$f":"PivotSheet!B266","v":0},"a",1,{"$error":"#N/A"},{"$error":"#N/A"},{"$error":"#N/A"},{"$error":"#N/A"},1.0000000000000047]
[{"$f":"PivotSheet!A267","v":0},{"$f":"PivotSheet!B267","v":0},"a",1,{"$error":"#N/A"},{"$error":"#N/A"},{"$error":"#N/A"},{"$error":"#N/A"},1.0000000000000047]
[{"$f":"PivotSheet!A268","v":0},{"$f":"PivotSheet!B268","v":0},"a",1,{"$error":"#N/A"},{"$error":"#N/A"},{"$error":"#N/A"},{"$error":"#N/A"},1.0000000000000047]
[{"$f":"PivotSheet!A269","v":0},{"$f":"PivotSheet!B269","v":0},"a",1,{"$error":"#N/A"},{"$error":"#N/A"},{"$error":"#N/A"},{"$error":"#N/A"},1.0000000000000047]
[{"$f":"PivotSheet!A270","v":0},{"$f":"PivotSheet!B270","v":0},"a",1,{"$error":"#N/A"},{"$error":"#N/A"},{"$error":"#N/A"},{"$error":"#N/A"},1.0000000000000047]
[{"$f":"PivotSheet!A271","v":0},{"$f":"PivotSheet!B271","v":0},"a",1,{"$error":"#N/A"},{"$error":"#N/A"},{"$error":"#N/A"},{"$error":"#N/A"},1.0000000000000047]
[{"$f":"PivotSheet!A272","v":0},{"$f":"PivotSheet!B272","v":0},"a",1,{"$error":"#N/A"},{"$error":"#N/A"},{"$error":"#N/A"},{"$error":"#N/A"},1.0000000000000047]
[{"$f":"PivotSheet!A273","v":0},{"$f":"PivotSheet!B273","v":0},"a",1,{"$error":"#N/A"},{"$error":"#N/A"},{"$error":"#N/A"},{"$error":"#N/A"},1.0000000000000047]
[{"$f":"PivotSheet!A274","v":0},{"$f":"PivotSheet!B274","v":0},"a",1,{"$error":"#N/A"},{"$error":"#N/A"},{"$error":"#N/A"},{"$error":"#N/A"},1.0000000000000047]
[{"$f":"PivotSheet!A275","v":0},{"$f":"PivotSheet!B275","v":0},"a",1,{"$error":"#N/A"},{"$error":"#N/A"},{"$error":"#N/A"},{"$error":"#N/A"},1.0000000000000047]
[{"$f":"PivotSheet!A276","v":0},{"$f":"PivotSheet!B276","v":0},"a",1,{"$error":"#N/A"},{"$error":"#N/A"},{"$error":"#N/A"},{"$error":"#N/A"},1.0000000000000047]
[{"$f":"PivotSheet!A277","v":0},{"$f":"PivotSheet!B277","v":0},"a",1,{"$error":"#N/A"},{"$error":"#N/A"},{"$error":"#N/A"},{"$error":"#N/A"},1.0000000000000047]
[{"$f":"PivotSheet!A278","v":0},{"$f":"PivotSheet!B278","v":0},"a",1,{"$error":"#N/A"},{"$error":"#N/A"},{"$error":"#N/A"},{"$error":"#N/A"},1.0000000000000047]
[{"$f":"PivotSheet!A279","v":0},{"$f":"PivotSheet!B279","v":0},"a",1,{"$error":"#N/A"},{"$error":"#N/A"},{"$error":"#N/A"},{"$error":"#N/A"},1.0000000000000047]
[{"$f":"PivotSheet!A280","v":0},{"$f":"PivotSheet!B280","v":0},"a",1,{"$error":"#N/A"},{"$error":"#N/A"},{"$error":"#N/A"},{"$error":"#N/A"},1.0000000000000047]
[{"$f":"PivotSheet!A281","v":0},{"$f":"PivotSheet!B281","v":0},"a",1,{"$error":"#N/A"},{"$error":"#N/A"},{"$error":"#N/A"},{"$error":"#N/A"},1.0000000000000047]
[{"$f":"PivotSheet!A282","v":0},{"$f":"PivotSheet!B282","v":0},"a",1,{"$error":"#N/A"},{"$error":"#N/A"},{"$error":"#N/A"},{"$error":"#N/A"},1.0000000000000047]
[{"$f":"PivotSheet!A283","v":0},{"$f":"PivotSheet!B283","v":0},"a",1,{"$error":"#N/A"},{"$error":"#N/A"},{"$error":"#N/A"},{"$error":"#N/A"},1.0000000000000047]
[{"$f":"PivotSheet!A284","v":0},{"$f":"PivotSheet!B284","v":0},"a",1,{"$error":"#N/A"},{"$error":"#N/A"},{"$error":"#N/A"},{"$error":"#N/A"},1.0000000000000047]
[{"$f":"PivotSheet!A285","v":0},{"$f":"PivotSheet!B285","v":0},"a",1,{"$error":"#N/A"},{"$error":"#N/A"},{"$error":"#N/A"},{"$error":"#N/A"},1.0000000000000047]
[{"$f":"PivotSheet!A286","v":0},{"$f":"PivotSheet!B286","v":0},"a",1,{"$error":"#N/A"},{"$error":"#N/A"},{"$error":"#N/A"},{"$error":"#N/A"},1.0000000000000047]
[{"$f":"PivotSheet!A287","v":0},{"$f":"PivotSheet!B287","v":0},"a",1,{"$error":"#N/A"},{"$error":"#N/A"},{"$error":"#N/A"},{"$error":"#N/A"},1.0000000000000047]
[{"$f":"PivotSheet!A288","v":0},{"$f":"PivotSheet!B288","v":0},"a",1,{"$error":"#N/A"},{"$error":"#N/A"},{"$error":"#N/A"},{"$error":"#N/A"},1.0000000000000047]
[{"$f":"PivotSheet!A289","v":0},{"$f":"PivotSheet!B289","v":0},"a",1,{"$error":"#N/A"},{"$error":"#N/A"},{"$error":"#N/A"},{"$error":"#N/A"},1.0000000000000047]
[{"$f":"PivotSheet!A290","v":0},{"$f":"PivotSheet!B290","v":0},"a",1,{"$error":"#N/A"},{"$error":"#N/A"},{"$error":"#N/A"},{"$error":"#N/A"},1.0000000000000047]
[{"$f":"PivotSheet!A291","v":0},{"$f":"PivotSheet!B291","v":0},"a",1,{"$error":"#N/A"},{"$error":"#N/A"},{"$error":"#N/A"},{"$error":"#N/A"},1.0000000000000047]
[{"$f":"PivotSheet!A292","v":0},{"$f":"PivotSheet!B292","v":0},"a",1,{"$error":"#N/A"},{"$error":"#N/A"},{"$error":"#N/A"},{"$error":"#N/A"},1.0000000000000047]
[{"$f":"PivotSheet!A293","v":0},{"$f":"PivotSheet!B293","v":0},"a",1,{"$error":"#N/A"},{"$error":"#N/A"},{"$error":"#N/A"},{"$error":"#N/A"},1.0000000000000047]
[{"$f":"PivotSheet!A294","v":0},{"$f":"PivotSheet!B294","v":0},"a",1,{"$error":"#N/A"},{"$error":"#N/A"},{"$error":"#N/A"},{"$error":"#N/A"},1.0000000000000047]
[{"$f":"PivotSheet!A295","v":0},{"$f":"PivotSheet!B295","v":0},"a",1,{"$error":"#N/A"},{"$error":"#N/A"},{"$error":"#N/A"},{"$error":"#N/A"},1.0000000000000047]
[{"$f":"PivotSheet!A296","v":0},{"$f":"PivotSheet!B296","v":0},"a",1,{"$error":"#N/A"},{"$error":"#N/A"},{"$error":"#N/A"},{"$error":"#N/A"},1.0000000000000047]
[{"$f":"PivotSheet!A297","v":0},{"$f":"PivotSheet!B297","v":0},"a",1,{"$error":"#N/A"},{"$error":"#N/A"},{"$error":"#N/A"},{"$error":"#N/A"},1.0000000000000047]
[{"$f":"PivotSheet!A298","v":0},{"$f":"PivotSheet!B298","v":0},"a",1,{"$error":"#N/A"},{"$error":"#N/A"},{"$error":"#N/A"},{"$error":"#N/A"},1.0000000000000047]
[{"$f":"PivotSheet!A299","v":0},{"$f":"PivotSheet!B299","v":0},"a",1,{"$error":"#N/A"},{"$error":"#N/A"},{"$error":"#N/A"},{"$error":"#N/A"},1.0000000000000047]
[{"$f":"PivotSheet!A300","v":0},{"$f":"PivotSheet!B300","v":0},"a",1,{"$error":"#N/A"},{"$error":"#N/A"},{"$error":"#N/A"},{"$error":"#N/A"},1.0000000000000047]
[{"$f":"PivotSheet!A301","v":0},{"$f":"PivotSheet!B301","v":0},"a",1,{"$error":"#N/A"},{"$error":"#N/A"},{"$error":"#N/A"},{"$error":"#N/A"},1.0000000000000047]
[{"$f":"PivotSheet!A302","v":0},{"$f":"PivotSheet!B302","v":0},"a",1,{"$error":"#N/A"},{"$error":"#N/A"},{"$error":"#N/A"},{"$error":"#N/A"},1.0000000000000047]
[{"$f":"PivotSheet!A303","v":0},{"$f":"PivotSheet!B303","v":0},"a",1,{"$error":"#N/A"},{"$error":"#N/A"},{"$error":"#N/A"},{"$error":"#N/A"},1.0000000000000047]
[{"$f":"PivotSheet!A304","v":0},{"$f":"PivotSheet!B304","v":0},"a",1,{"$error":"#N/A"},{"$error":"#N/A"},{"$error":"#N/A"},{"$error":"#N/A"},1.0000000000000047]
[{"$f":"PivotSheet!A305","v":0},{"$f":"PivotSheet!B305","v":0},"a",1,{"$error":"#N/A"},{"$error":"#N/A"},{"$error":"#N/A"},{"$error":"#N/A"},1.0000000000000047]
[{"$f":"PivotSheet!A306","v":0},{"$f":"PivotSheet!B306","v":0},"a",1,{"$error":"#N/A"},{"$error":"#N/A"},{"$error":"#N/A"},{"$error":"#N/A"},1.0000000000000047]
[{"$f":"PivotSheet!A307","v":0},{"$f":"PivotSheet!B307","v":0},"a",1,{"$error":"#N/A"},{"$error":"#N/A"},{"$error":"#N/A"},{"$error":"#N/A"},1.0000000000000047]
[{"$f":"PivotSheet!A308","v":0},{"$f":"PivotSheet!B308","v":0},"a",1,{"$error":"#N/A"},{"$error":"#N/A"},{"$error":"#N/A"},{"$error":"#N/A"},1.0000000000000047]
[{"$f":"PivotSheet!A309","v":0},{"$f":"PivotSheet!B309","v":0},"a",1,{"$error":"#N/A"},{"$error":"#N/A"},{"$error":"#N/A"},{"$error":"#N/A"},1.0000000000000047]
[{"$f":"PivotSheet!A310","v":0},{"$f":"PivotSheet!B310","v":0},"a",1,{"$error":"#N/A"},{"$error":"#N/A"},{"$error":"#N/A"},{"$error":"#N/A"},1.0000000000000047]
[{"$f":"PivotSheet!A311","v":0},{"$f":"PivotSheet!B311","v":0},"a",1,{"$error":"#N/A"},{"$error":"#N/A"},{"$error":"#N/A"},{"$error":"#N/A"},1.0000000000000047]
[{"$f":"PivotSheet!A312","v":0},{"$f":"PivotSheet!B312","v":0},"a",1,{"$error":"#N/A"},{"$error":"#N/A"},{"$error":"#N/A"},{"$error":"#N/A"},1.0000000000000047]
[{"$f":"PivotSheet!A313","v":0},{"$f":"PivotSheet!B313","v":0},"a",1,{"$error":"#N/A"},{"$error":"#N/A"},{"$error":"#N/A"},{"$error":"#N/A"},1.0000000000000047]
[{"$f":"PivotSheet!A314","v":0},{"$f":"PivotSheet!B314","v":0},"a",1,{"$error":"#N/A"},{"$error":"#N/A"},{"$error":"#N/A"},{"$error":"#N/A"},1.0000000000000047]
[{"$f":"PivotSheet!A315","v":0},{"$f":"PivotSheet!B315","v":0},"a",1,{"$error":"#N/A"},{"$error":"#N/A"},{"$error":"#N/A"},{"$error":"#N/A"},1.0000000000000047]
[{"$f":"PivotSheet!A316","v":0},{"$f":"PivotSheet!B316","v":0},"a",1,{"$error":"#N/A"},{"$error":"#N/A"},{"$error":"#N/A"},{"$error":"#N/A"},1.0000000000000047]
[{"$f":"PivotSheet!A317","v":0},{"$f":"PivotSheet!B317","v":0},"a",1,{"$error":"#N/A"},{"$error":"#N/A"},{"$error":"#N/A"},{"$error":"#N/A"},1.0000000000000047]
[{"$f":"PivotSheet!A318","v":0},{"$f":"PivotSheet!B318","v":0},"a",1,{"$error":"#N/A"},{"$error":"#N/A"},{"$error":"#N/A"},{"$error":"#N/A"},1.0000000000000047]
[{"$f":"PivotSheet!A319","v":0},{"$f":"PivotSheet!B319","v":0},"a",1,{"$error":"#N/A"},{"$error":"#N/A"},{"$error":"#N/A"},{"$error":"#N/A"},1.0000000000000047]
[{"$f":"PivotSheet!A320","v":0},{"$f":"PivotSheet!B320","v":0},"a",1,{"$error":"#N/A"},{"$error":"#N/A"},{"$error":"#N/A"},{"$error":"#N/A"},1.0000000000000047]
[{"$f":"PivotSheet!A321","v":0},{"$f":"PivotSheet!B321","v":0},"a",1,{"$error":"#N/A"},{"$error":"#N/A"},{"$error":"#N/A"},{"$error":"#N/A"},1.0000000000000047]
[{"$f":"PivotSheet!A322","v":0},{"$f":"PivotSheet!B322","v":0},{"$f":"IF(A322<=$V$4,\"a\",IF(A322<=$V$6,\"b\",IF(A322<=$V$8,\"c\",IF(A322<=$V$10,\"d\",IF(A322<=$V$12,\"e\",\"ERROR\")))))","v":"a"},1,{"$error":"#N/A"},{"$error":"#N/A"},{"$error":"#N/A"},{"$error":"#N/A"},1.0000000000000047]
[{"$f":"PivotSheet!A323","v":0},{"$f":"PivotSheet!B323","v":0},"a",{"$f":"IF(C323=\"a\",1,NA())","v":1},{"$f":"IF(C323=\"b\",1,NA())","v":{"$error":"#N/A"}},{"$f":"IF(C323=\"c\",1,NA())","v":{"$error":"#N/A"}},{"$f":"IF(C323=\"d\",1,NA())","v":{"$error":"#N/A"}},{"$f":"IF(C323=\"e\",1,NA())","v":{"$error":"#N/A"}},1.0000000000000047]
[{"$f":"PivotSheet!A324","v":0},{"$f":"PivotSheet!B324","v":0},"a",1,{"$error":"#N/A"},{"$error":"#N/A"},{"$error":"#N/A"},{"$error":"#N/A"},{"$f":"B324/SUM($B$2:$B$10000)+I323","v":1.0000000000000047}]
[{"$f":"PivotSheet!A325","v":0},{"$f":"PivotSheet!B325","v":0},"a",1,{"$error":"#N/A"},{"$error":"#N/A"},{"$error":"#N/A"},{"$error":"#N/A"},1.0000000000000047]
[{"$f":"PivotSheet!A326","v":0},{"$f":"PivotSheet!B326","v":0},"a",1,{"$error":"#N/A"},{"$error":"#N/A"},{"$error":"#N/A"},{"$error":"#N/A"},1.0000000000000047]
[{"$f":"PivotSheet!A327","v":0},{"$f":"PivotSheet!B327","v":0},"a",1,{"$error":"#N/A"},{"$error":"#N/A"},{"$error":"#N/A"},{"$error":"#N/A"},1.0000000000000047]
[{"$f":"PivotSheet!A328","v":0},{"$f":"PivotSheet!B328","v":0},"a",1,{"$error":"#N/A"},{"$error":"#N/A"},{"$error":"#N/A"},{"$error":"#N/A"},1.0000000000000047]
[{"$f":"PivotSheet!A329","v":0},{"$f":"PivotSheet!B329","v":0},"a",1,{"$error":"#N/A"},{"$error":"#N/A"},{"$error":"#N/A"},{"$error":"#N/A"},1.0000000000000047]
[{"$f":"PivotSheet!A330","v":0},{"$f":"PivotSheet!B330","v":0},"a",1,{"$error":"#N/A"},{"$error":"#N/A"},{"$error":"#N/A"},{"$error":"#N/A"},1.0000000000000047]
[{"$f":"PivotSheet!A331","v":0},{"$f":"PivotSheet!B331","v":0},"a",1,{"$error":"#N/A"},{"$error":"#N/A"},{"$error":"#N/A"},{"$error":"#N/A"},1.0000000000000047]
[{"$f":"PivotSheet!A332","v":0},{"$f":"PivotSheet!B332","v":0},"a",1,{"$error":"#N/A"},{"$error":"#N/A"},{"$error":"#N/A"},{"$error":"#N/A"},1.0000000000000047]
[{"$f":"PivotSheet!A333","v":0},{"$f":"PivotSheet!B333","v":0},"a",1,{"$error":"#N/A"},{"$error":"#N/A"},{"$error":"#N/A"},{"$error":"#N/A"},1.0000000000000047]
[{"$f":"PivotSheet!A334","v":0},{"$f":"PivotSheet!B334","v":0},"a",1,{"$error":"#N/A"},{"$error":"#N/A"},{"$error":"#N/A"},{"$error":"#N/A"},1.0000000000000047]
[{"$f":"PivotSheet!A335","v":0},{"$f":"PivotSheet!B335","v":0},"a",1,{"$error":"#N/A"},{"$error":"#N/A"},{"$error":"#N/A"},{"$error":"#N/A"},1.0000000000000047]
[{"$f":"PivotSheet!A336","v":0},{"$f":"PivotSheet!B336","v":0},"a",1,{"$error":"#N/A"},{"$error":"#N/A"},{"$error":"#N/A"},{"$error":"#N/A"},1.0000000000000047]
[{"$f":"PivotSheet!A337","v":0},{"$f":"PivotSheet!B337","v":0},"a",1,{"$error":"#N/A"},{"$error":"#N/A"},{"$error":"#N/A"},{"$error":"#N/A"},1.0000000000000047]
[{"$f":"PivotSheet!A338","v":0},{"$f":"PivotSheet!B338","v":0},"a",1,{"$error":"#N/A"},{"$error":"#N/A"},{"$error":"#N/A"},{"$error":"#N/A"},1.0000000000000047]
[{"$f":"PivotSheet!A339","v":0},{"$f":"PivotSheet!B339","v":0},"a",1,{"$error":"#N/A"},{"$error":"#N/A"},{"$error":"#N/A"},{"$error":"#N/A"},1.0000000000000047]
[{"$f":"PivotSheet!A340","v":0},{"$f":"PivotSheet!B340","v":0},"a",1,{"$error":"#N/A"},{"$error":"#N/A"},{"$error":"#N/A"},{"$error":"#N/A"},1.0000000000000047]
[{"$f":"PivotSheet!A341","v":0},{"$f":"PivotSheet!B341","v":0},"a",1,{"$error":"#N/A"},{"$error":"#N/A"},{"$error":"#N/A"},{"$error":"#N/A"},1.0000000000000047]
[{"$f":"PivotSheet!A342","v":0},{"$f":"PivotSheet!B342","v":0},"a",1,{"$error":"#N/A"},{"$error":"#N/A"},{"$error":"#N/A"},{"$error":"#N/A"},1.0000000000000047]
[{"$f":"PivotSheet!A343","v":0},{"$f":"PivotSheet!B343","v":0},"a",1,{"$error":"#N/A"},{"$error":"#N/A"},{"$error":"#N/A"},{"$error":"#N/A"},1.0000000000000047]
[{"$f":"PivotSheet!A344","v":0},{"$f":"PivotSheet!B344","v":0},"a",1,{"$error":"#N/A"},{"$error":"#N/A"},{"$error":"#N/A"},{"$error":"#N/A"},1.0000000000000047]
[{"$f":"PivotSheet!A345","v":0},{"$f":"PivotSheet!B345","v":0},"a",1,{"$error":"#N/A"},{"$error":"#N/A"},{"$error":"#N/A"},{"$error":"#N/A"},1.0000000000000047]
[{"$f":"PivotSheet!A346","v":0},{"$f":"PivotSheet!B346","v":0},"a",1,{"$error":"#N/A"},{"$error":"#N/A"},{"$error":"#N/A"},{"$error":"#N/A"},1.0000000000000047]
[{"$f":"PivotSheet!A347","v":0},{"$f":"PivotSheet!B347","v":0},"a",1,{"$error":"#N/A"},{"$error":"#N/A"},{"$error":"#N/A"},{"$error":"#N/A"},1.0000000000000047]
[{"$f":"PivotSheet!A348","v":0},{"$f":"PivotSheet!B348","v":0},"a",1,{"$error":"#N/A"},{"$error":"#N/A"},{"$error":"#N/A"},{"$error":"#N/A"},1.0000000000000047]
[{"$f":"PivotSheet!A349","v":0},{"$f":"PivotSheet!B349","v":0},"a",1,{"$error":"#N/A"},{"$error":"#N/A"},{"$error":"#N/A"},{"$error":"#N/A"},1.0000000000000047]
[{"$f":"PivotSheet!A350","v":0},{"$f":"PivotSheet!B350","v":0},"a",1,{"$error":"#N/A"},{"$error":"#N/A"},{"$error":"#N/A"},{"$error":"#N/A"},1.0000000000000047]
[{"$f":"PivotSheet!A351","v":0},{"$f":"PivotSheet!B351","v":0},"a",1,{"$error":"#N/A"},{"$error":"#N/A"},{"$error":"#N/A"},{"$error":"#N/A"},1.0000000000000047]
[{"$f":"PivotSheet!A352","v":0},{"$f":"PivotSheet!B352","v":0},"a",1,{"$error":"#N/A"},{"$error":"#N/A"},{"$error":"#N/A"},{"$error":"#N/A"},1.0000000000000047]
[{"$f":"PivotSheet!A353","v":0},{"$f":"PivotSheet!B353","v":0},"a",1,{"$error":"#N/A"},{"$error":"#N/A"},{"$error":"#N/A"},{"$error":"#N/A"},1.0000000000000047]
[{"$f":"PivotSheet!A354","v":0},{"$f":"PivotSheet!B354","v":0},"a",1,{"$error":"#N/A"},{"$error":"#N/A"},{"$error":"#N/A"},{"$error":"#N/A"},1.0000000000000047]
[{"$f":"PivotSheet!A355","v":0},{"$f":"PivotSheet!B355","v":0},"a",1,{"$error":"#N/A"},{"$error":"#N/A"},{"$error":"#N/A"},{"$error":"#N/A"},1.0000000000000047]
[{"$f":"PivotSheet!A356","v":0},{"$f":"PivotSheet!B356","v":0},"a",1,{"$error":"#N/A"},{"$error":"#N/A"},{"$error":"#N/A"},{"$error":"#N/A"},1.0000000000000047]
[{"$f":"PivotSheet!A357","v":0},{"$f":"PivotSheet!B357","v":0},"a",1,{"$error":"#N/A"},{"$error":"#N/A"},{"$error":"#N/A"},{"$error":"#N/A"},1.0000000000000047]
[{"$f":"PivotSheet!A358","v":0},{"$f":"PivotSheet!B358","v":0},"a",1,{"$error":"#N/A"},{"$error":"#N/A"},{"$error":"#N/A"},{"$error":"#N/A"},1.0000000000000047]
[{"$f":"PivotSheet!A359","v":0},{"$f":"PivotSheet!B359","v":0},"a",1,{"$error":"#N/A"},{"$error":"#N/A"},{"$error":"#N/A"},{"$error":"#N/A"},1.0000000000000047]
[{"$f":"PivotSheet!A360","v":0},{"$f":"PivotSheet!B360","v":0},"a",1,{"$error":"#N/A"},{"$error":"#N/A"},{"$error":"#N/A"},{"$error":"#N/A"},1.0000000000000047]
[{"$f":"PivotSheet!A361","v":0},{"$f":"PivotSheet!B361","v":0},"a",1,{"$error":"#N/A"},{"$error":"#N/A"},{"$error":"#N/A"},{"$error":"#N/A"},1.0000000000000047]
[{"$f":"PivotSheet!A362","v":0},{"$f":"PivotSheet!B362","v":0},"a",1,{"$error":"#N/A"},{"$error":"#N/A"},{"$error":"#N/A"},{"$error":"#N/A"},1.0000000000000047]
[{"$f":"PivotSheet!A363","v":0},{"$f":"PivotSheet!B363","v":0},"a",1,{"$error":"#N/A"},{"$error":"#N/A"},{"$error":"#N/A"},{"$error":"#N/A"},1.0000000000000047]
[{"$f":"PivotSheet!A364","v":0},{"$f":"PivotSheet!B364","v":0},"a",1,{"$error":"#N/A"},{"$error":"#N/A"},{"$error":"#N/A"},{"$error":"#N/A"},1.0000000000000047]
[{"$f":"PivotSheet!A365","v":0},{"$f":"PivotSheet!B365","v":0},"a",1,{"$error":"#N/A"},{"$error":"#N/A"},{"$error":"#N/A"},{"$error":"#N/A"},1.0000000000000047]

{"sheet":"Quantiles","index":6,"n_rows":364,"n_cols":22,"rows_kept":364,"cut":false,"hidden":true,"merged":[]}
["Data","Frequency","Group","Group 1","Group 2","Group 3","Group 4","Group 5","Cum. Freq"]
[{"$f":"PivotSheet!A2","v":2},{"$f":"PivotSheet!B2","v":1},{"$f":"IF(A2<=$V$4,\"a\",IF(A2<=$V$6,\"b\",IF(A2<=$V$8,\"c\",IF(A2<=$V$10,\"d\",IF(A2<=$V$12,\"e\",\"ERROR\")))))","v":"a"},{"$f":"IF($C2=\"a\",1,NA())","v":1},{"$f":"IF($C2=\"b\",1,NA())","v":{"$error":"#N/A"}},{"$f":"IF($C2=\"c\",1,NA())","v":{"$error":"#N/A"}},{"$f":"IF($C2=\"d\",1,NA())","v":{"$error":"#N/A"}},{"$f":"IF($C2=\"e\",1,NA())","v":{"$error":"#N/A"}},{"$f":"B2/SUM($B$2:$B$10000)","v":2.881844380403458E-3},"2 levels of Intensity",null,null,null,null,null,null,null,null,null,"Group",null,"Quantiles"]
[{"$f":"PivotSheet!A3","v":3},{"$f":"PivotSheet!B3","v":2},{"$f":"IF(A3<=$V$4,\"a\",IF(A3<=$V$6,\"b\",IF(A3<=$V$8,\"c\",IF(A3<=$V$10,\"d\",IF(A3<=$V$12,\"e\",\"ERROR\")))))","v":"a"},{"$f":"IF(C3=\"a\",1,NA())","v":1},{"$f":"IF($C3=\"b\",1,NA())","v":{"$error":"#N/A"}},{"$f":"IF($C3=\"c\",1,NA())","v":{"$error":"#N/A"}},{"$f":"IF($C3=\"d\",1,NA())","v":{"$error":"#N/A"}},{"$f":"IF($C3=\"e\",1,NA())","v":{"$error":"#N/A"}},{"$f":"B3/SUM($B$2:$B$10000)+I2","v":8.6455331412103736E-3},null,"Min Value","Max Value",null,null,null,null,null,null,null,"a","Min Value",{"$f":"INDEX(Quantiles!$K$4:$L$26,MATCH(1,(Data!$F$2=Quantiles!$M$4:$M$26)*(T3=Quantiles!$N$4:$N$26),0),MATCH(U3,Quantiles!$K$3:$L$3,0))","v":2}]
[{"$f":"PivotSheet!A4","v":4},{"$f":"PivotSheet!B4","v":1},"a",1,{"$error":"#N/A"},{"$error":"#N/A"},{"$error":"#N/A"},{"$error":"#N/A"},{"$f":"B4/SUM($B$2:$B$10000)+I3","v":1.1527377521613832E-2},"A-Size",{"$f":"MIN([0]!Data_Plot)","v":2},{"$f":"MEDIAN([0]!Data_Plot)","v":239},2,"a",null,null,null,null,null,"a","Max Value",{"$f":"INDEX(Quantiles!$K$4:$L$26,MATCH(1,(Data!$F$2=Quantiles!$M$4:$M$26)*(T4=Quantiles!$N$4:$N$26),0),MATCH(U4,Quantiles!$K$3:$L$3,0))","v":158.18}]
[{"$f":"PivotSheet!A5","v":5},{"$f":"PivotSheet!B5","v":1},"a",1,{"$error":"#N/A"},{"$error":"#N/A"},{"$error":"#N/A"},{"$error":"#N/A"},1.4409221902017291E-2,"B-Size",{"$f":"$L$4+1","v":240},{"$f":"MAX([0]!Data_Plot)","v":498},2,"b",null,null,null,null,null,"b","Min Value",{"$f":"INDEX(Quantiles!$K$4:$L$26,MATCH(1,(Data!$F$2=Quantiles!$M$4:$M$26)*(T5=Quantiles!$N$4:$N$26),0),MATCH(U5,Quantiles!$K$3:$L$3,0))","v":159.18}]
[{"$f":"PivotSheet!A6","v":6},{"$f":"PivotSheet!B6","v":1},"a",1,{"$error":"#N/A"},{"$error":"#N/A"},{"$error":"#N/A"},{"$error":"#N/A"},1.7291066282420747E-2,null,null,null,null,null,null,null,null,null,null,"b","Max Value",{"$f":"INDEX(Quantiles!$K$4:$L$26,MATCH(1,(Data!$F$2=Quantiles!$M$4:$M$26)*(T6=Quantiles!$N$4:$N$26),0),MATCH(U6,Quantiles!$K$3:$L$3,0))","v":319.72000000000003}]
[{"$f":"PivotSheet!A7","v":10},{"$f":"PivotSheet!B7","v":2},"a",1,{"$error":"#N/A"},{"$error":"#N/A"},{"$error":"#N/A"},{"$error":"#N/A"},2.3054755043227664E-2,"3 Levels of Intensity",null,null,null,null,null,null,null,null,null,"c","Min Value",{"$f":"INDEX(Quantiles!$K$4:$L$26,MATCH(1,(Data!$F$2=Quantiles!$M$4:$M$26)*(T7=Quantiles!$N$4:$N$26),0),MATCH(U7,Quantiles!$K$3:$L$3,0))","v":320.72000000000003}]
[{"$f":"PivotSheet!A8","v":11},{"$f":"PivotSheet!B8","v":1},"a",1,{"$error":"#N/A"},{"$error":"#N/A"},{"$error":"#N/A"},{"$error":"#N/A"},2.5936599423631121E-2,null,null,null,null,null,null,null,null,null,null,"c","Max Value",{"$f":"INDEX(Quantiles!$K$4:$L$26,MATCH(1,(Data!$F$2=Quantiles!$M$4:$M$26)*(T8=Quantiles!$N$4:$N$26),0),MATCH(U8,Quantiles!$K$3:$L$3,0))","v":498}]
[{"$f":"PivotSheet!A9","v":12},{"$f":"PivotSheet!B9","v":1},"a",1,{"$error":"#N/A"},{"$error":"#N/A"},{"$error":"#N/A"},{"$error":"#N/A"},2.8818443804034578E-2,"A-Size",{"$f":"MIN([0]!Data_Plot)","v":2},{"$f":"PERCENTILE([0]!Data_Plot,0.33)","v":158.18},3,"a",null,null,null,null,null,"d","Min Value",{"$f":"INDEX(Quantiles!$K$4:$L$26,MATCH(1,(Data!$F$2=Quantiles!$M$4:$M$26)*(T9=Quantiles!$N$4:$N$26),0),MATCH(U9,Quantiles!$K$3:$L$3,0))","v":{"$error":"#N/A"}}]
[{"$f":"PivotSheet!A10","v":14},{"$f":"PivotSheet!B10","v":1},"a",1,{"$error":"#N/A"},{"$error":"#N/A"},{"$error":"#N/A"},{"$error":"#N/A"},3.1700288184438034E-2,"B-Size",{"$f":"$L$9+1","v":159.18},{"$f":"PERCENTILE([0]!Data_Plot,0.66)","v":319.72000000000003},3,"b",null,null,null,null,null,"d","Max Value",{"$f":"INDEX(Quantiles!$K$4:$L$26,MATCH(1,(Data!$F$2=Quantiles!$M$4:$M$26)*(T10=Quantiles!$N$4:$N$26),0),MATCH(U10,Quantiles!$K$3:$L$3,0))","v":{"$error":"#N/A"}}]
[{"$f":"PivotSheet!A11","v":15},{"$f":"PivotSheet!B11","v":1},"a",1,{"$error":"#N/A"},{"$error":"#N/A"},{"$error":"#N/A"},{"$error":"#N/A"},3.4582132564841495E-2,"C-Size",{"$f":"$L$10+1","v":320.72000000000003},{"$f":"MAX([0]!Data_Plot)","v":498},3,"c",null,null,null,null,null,"e","Min Value",{"$f":"INDEX(Quantiles!$K$4:$L$26,MATCH(1,(Data!$F$2=Quantiles!$M$4:$M$26)*(T11=Quantiles!$N$4:$N$26),0),MATCH(U11,Quantiles!$K$3:$L$3,0))","v":{"$error":"#N/A"}}]
[{"$f":"PivotSheet!A12","v":17},{"$f":"PivotSheet!B12","v":1},"a",1,{"$error":"#N/A"},{"$error":"#N/A"},{"$error":"#N/A"},{"$error":"#N/A"},3.7463976945244955E-2,null,null,null,null,null,null,null,null,null,null,"e","Max Value",{"$f":"INDEX(Quantiles!$K$4:$L$26,MATCH(1,(Data!$F$2=Quantiles!$M$4:$M$26)*(T12=Quantiles!$N$4:$N$26),0),MATCH(U12,Quantiles!$K$3:$L$3,0))","v":{"$error":"#N/A"}}]
[{"$f":"PivotSheet!A13","v":21},{"$f":"PivotSheet!B13","v":1},"a",1,{"$error":"#N/A"},{"$error":"#N/A"},{"$error":"#N/A"},{"$error":"#N/A"},4.0345821325648415E-2,"4 Levels of Intensity"]
[{"$f":"PivotSheet!A14","v":22},{"$f":"PivotSheet!B14","v":1},"a",1,{"$error":"#N/A"},{"$error":"#N/A"},{"$error":"#N/A"},{"$error":"#N/A"},4.3227665706051875E-2]
[{"$f":"PivotSheet!A15","v":25},{"$f":"PivotSheet!B15","v":1},"a",1,{"$error":"#N/A"},{"$error":"#N/A"},{"$error":"#N/A"},{"$error":"#N/A"},4.6109510086455335E-2,"A-Size",{"$f":"MIN([0]!Data_Plot)","v":2},{"$f":"PERCENTILE([0]!Data_Plot,0.25)","v":123},4,"a"]
[{"$f":"PivotSheet!A16","v":28},{"$f":"PivotSheet!B16","v":1},"a",1,{"$error":"#N/A"},{"$error":"#N/A"},{"$error":"#N/A"},{"$error":"#N/A"},4.8991354466858796E-2,"B-Size",{"$f":"L15+1","v":124},{"$f":"MEDIAN([0]!Data_Plot)","v":239},4,"b"]
[{"$f":"PivotSheet!A17","v":29},{"$f":"PivotSheet!B17","v":3},"a",1,{"$error":"#N/A"},{"$error":"#N/A"},{"$error":"#N/A"},{"$error":"#N/A"},5.7636887608069169E-2,"C-Size",{"$f":"L16+1","v":240},{"$f":"PERCENTILE([0]!Data_Plot,0.75)","v":355},4,"c"]
[{"$f":"PivotSheet!A18","v":30},{"$f":"PivotSheet!B18","v":2},"a",1,{"$error":"#N/A"},{"$error":"#N/A"},{"$error":"#N/A"},{"$error":"#N/A"},6.3400576368876083E-2,"D-Size",{"$f":"L17+1","v":356},{"$f":"MAX([0]!Data_Plot)","v":498},4,"d"]
[{"$f":"PivotSheet!A19","v":34},{"$f":"PivotSheet!B19","v":1},"a",1,{"$error":"#N/A"},{"$error":"#N/A"},{"$error":"#N/A"},{"$error":"#N/A"},6.6282420749279536E-2]
[{"$f":"PivotSheet!A20","v":39},{"$f":"PivotSheet!B20","v":2},"a",1,{"$error":"#N/A"},{"$error":"#N/A"},{"$error":"#N/A"},{"$error":"#N/A"},7.2046109510086456E-2,"5 Levels of Intensity"]
[{"$f":"PivotSheet!A21","v":41},{"$f":"PivotSheet!B21","v":1},"a",1,{"$error":"#N/A"},{"$error":"#N/A"},{"$error":"#N/A"},{"$error":"#N/A"},7.492795389048991E-2]
[{"$f":"PivotSheet!A22","v":42},{"$f":"PivotSheet!B22","v":1},"a",1,{"$error":"#N/A"},{"$error":"#N/A"},{"$error":"#N/A"},{"$error":"#N/A"},7.7809798270893363E-2,"A-Size",{"$f":"MIN([0]!Data_Plot)","v":2},{"$f":"PERCENTILE([0]!Data_Plot,0.2)","v":100.4},5,"a"]
[{"$f":"PivotSheet!A23","v":45},{"$f":"PivotSheet!B23","v":2},"a",1,{"$error":"#N/A"},{"$error":"#N/A"},{"$error":"#N/A"},{"$error":"#N/A"},8.3573487031700283E-2,"B-Size",{"$f":"L22+1","v":101.4},{"$f":"PERCENTILE([0]!Data_Plot,0.4)","v":181.4},5,"b"]
[{"$f":"PivotSheet!A24","v":47},{"$f":"PivotSheet!B24","v":1},"a",1,{"$error":"#N/A"},{"$error":"#N/A"},{"$error":"#N/A"},{"$error":"#N/A"},8.6455331412103736E-2,"C-Size",{"$f":"L23+1","v":182.4},{"$f":"PERCENTILE([0]!Data_Plot,0.6)","v":292.60000000000002},5,"c"]
[{"$f":"PivotSheet!A25","v":49},{"$f":"PivotSheet!B25","v":1},"a",1,{"$error":"#N/A"},{"$error":"#N/A"},{"$error":"#N/A"},{"$error":"#N/A"},8.933717579250719E-2,"D-Size",{"$f":"L24+1","v":293.60000000000002},{"$f":"PERCENTILE([0]!Data_Plot,0.8)","v":379.6},5,"d"]
[{"$f":"PivotSheet!A26","v":50},{"$f":"PivotSheet!B26","v":1},"a",1,{"$error":"#N/A"},{"$error":"#N/A"},{"$error":"#N/A"},{"$error":"#N/A"},9.2219020172910643E-2,"E-size",{"$f":"L25+1","v":380.6},{"$f":"MAX([0]!Data_Plot)","v":498},5,"e"]
[{"$f":"PivotSheet!A27","v":51},{"$f":"PivotSheet!B27","v":1},"a",1,{"$error":"#N/A"},{"$error":"#N/A"},{"$error":"#N/A"},{"$error":"#N/A"},9.5100864553314096E-2]
[{"$f":"PivotSheet!A28","v":53},{"$f":"PivotSheet!B28","v":1},"a",1,{"$error":"#N/A"},{"$error":"#N/A"},{"$error":"#N/A"},{"$error":"#N/A"},9.7982708933717549E-2]
[{"$f":"PivotSheet!A29","v":54},{"$f":"PivotSheet!B29","v":1},"a",1,{"$error":"#N/A"},{"$error":"#N/A"},{"$error":"#N/A"},{"$error":"#N/A"},0.100864553314121]
[{"$f":"PivotSheet!A30","v":55},{"$f":"PivotSheet!B30","v":1},"a",1,{"$error":"#N/A"},{"$error":"#N/A"},{"$error":"#N/A"},{"$error":"#N/A"},0.10374639769452446]
[{"$f":"PivotSheet!A31","v":61},{"$f":"PivotSheet!B31","v":1},"a",1,{"$error":"#N/A"},{"$error":"#N/A"},{"$error":"#N/A"},{"$error":"#N/A"},0.10662824207492791]
[{"$f":"PivotSheet!A32","v":62},{"$f":"PivotSheet!B32","v":2},"a",1,{"$error":"#N/A"},{"$error":"#N/A"},{"$error":"#N/A"},{"$error":"#N/A"},0.11239193083573483]
[{"$f":"PivotSheet!A33","v":63},{"$f":"PivotSheet!B33","v":1},"a",1,{"$error":"#N/A"},{"$error":"#N/A"},{"$error":"#N/A"},{"$error":"#N/A"},0.11527377521613828]
[{"$f":"PivotSheet!A34","v":66},{"$f":"PivotSheet!B34","v":1},"a",1,{"$error":"#N/A"},{"$error":"#N/A"},{"$error":"#N/A"},{"$error":"#N/A"},0.11815561959654174]
[{"$f":"PivotSheet!A35","v":67},{"$f":"PivotSheet!B35","v":1},"a",1,{"$error":"#N/A"},{"$error":"#N/A"},{"$error":"#N/A"},{"$error":"#N/A"},0.12103746397694519]
[{"$f":"PivotSheet!A36","v":68},{"$f":"PivotSheet!B36","v":1},"a",1,{"$error":"#N/A"},{"$error":"#N/A"},{"$error":"#N/A"},{"$error":"#N/A"},0.12391930835734864]
[{"$f":"PivotSheet!A37","v":69},{"$f":"PivotSheet!B37","v":2},"a",1,{"$error":"#N/A"},{"$error":"#N/A"},{"$error":"#N/A"},{"$error":"#N/A"},0.12968299711815556]
[{"$f":"PivotSheet!A38","v":72},{"$f":"PivotSheet!B38","v":1},"a",1,{"$error":"#N/A"},{"$error":"#N/A"},{"$error":"#N/A"},{"$error":"#N/A"},0.13256484149855902]
[{"$f":"PivotSheet!A39","v":75},{"$f":"PivotSheet!B39","v":2},"a",1,{"$error":"#N/A"},{"$error":"#N/A"},{"$error":"#N/A"},{"$error":"#N/A"},0.13832853025936592]
[{"$f":"PivotSheet!A40","v":78},{"$f":"PivotSheet!B40","v":1},"a",1,{"$error":"#N/A"},{"$error":"#N/A"},{"$error":"#N/A"},{"$error":"#N/A"},0.14121037463976938]
[{"$f":"PivotSheet!A41","v":79},{"$f":"PivotSheet!B41","v":2},"a",1,{"$error":"#N/A"},{"$error":"#N/A"},{"$error":"#N/A"},{"$error":"#N/A"},0.14697406340057628]
[{"$f":"PivotSheet!A42","v":82},{"$f":"PivotSheet!B42","v":3},"a",1,{"$error":"#N/A"},{"$error":"#N/A"},{"$error":"#N/A"},{"$error":"#N/A"},0.15561959654178667]
[{"$f":"PivotSheet!A43","v":84},{"$f":"PivotSheet!B43","v":1},"a",1,{"$error":"#N/A"},{"$error":"#N/A"},{"$error":"#N/A"},{"$error":"#N/A"},0.15850144092219012]
[{"$f":"PivotSheet!A44","v":85},{"$f":"PivotSheet!B44","v":2},"a",1,{"$error":"#N/A"},{"$error":"#N/A"},{"$error":"#N/A"},{"$error":"#N/A"},0.16426512968299703]
[{"$f":"PivotSheet!A45","v":87},{"$f":"PivotSheet!B45","v":2},"a",1,{"$error":"#N/A"},{"$error":"#N/A"},{"$error":"#N/A"},{"$error":"#N/A"},0.17002881844380394]
[{"$f":"PivotSheet!A46","v":88},{"$f":"PivotSheet!B46","v":2},"a",1,{"$error":"#N/A"},{"$error":"#N/A"},{"$error":"#N/A"},{"$error":"#N/A"},0.17579250720461084]
[{"$f":"PivotSheet!A47","v":89},{"$f":"PivotSheet!B47","v":3},"a",1,{"$error":"#N/A"},{"$error":"#N/A"},{"$error":"#N/A"},{"$error":"#N/A"},0.18443804034582123]
[{"$f":"PivotSheet!A48","v":90},{"$f":"PivotSheet!B48","v":1},"a",1,{"$error":"#N/A"},{"$error":"#N/A"},{"$error":"#N/A"},{"$error":"#N/A"},0.18731988472622468]
[{"$f":"PivotSheet!A49","v":94},{"$f":"PivotSheet!B49","v":1},"a",1,{"$error":"#N/A"},{"$error":"#N/A"},{"$error":"#N/A"},{"$error":"#N/A"},0.19020172910662814]
[{"$f":"PivotSheet!A50","v":97},{"$f":"PivotSheet!B50","v":1},"a",1,{"$error":"#N/A"},{"$error":"#N/A"},{"$error":"#N/A"},{"$error":"#N/A"},0.19308357348703159]
[{"$f":"PivotSheet!A51","v":98},{"$f":"PivotSheet!B51","v":1},"a",1,{"$error":"#N/A"},{"$error":"#N/A"},{"$error":"#N/A"},{"$error":"#N/A"},0.19596541786743504]
[{"$f":"PivotSheet!A52","v":99},{"$f":"PivotSheet!B52","v":1},"a",1,{"$error":"#N/A"},{"$error":"#N/A"},{"$error":"#N/A"},{"$error":"#N/A"},0.1988472622478385]
[{"$f":"PivotSheet!A53","v":100},{"$f":"PivotSheet!B53","v":1},"a",1,{"$error":"#N/A"},{"$error":"#N/A"},{"$error":"#N/A"},{"$error":"#N/A"},0.20172910662824195]
[{"$f":"PivotSheet!A54","v":102},{"$f":"PivotSheet!B54","v":2},"a",1,{"$error":"#N/A"},{"$error":"#N/A"},{"$error":"#N/A"},{"$error":"#N/A"},0.20749279538904886]
[{"$f":"PivotSheet!A55","v":104},{"$f":"PivotSheet!B55","v":2},"a",1,{"$error":"#N/A"},{"$error":"#N/A"},{"$error":"#N/A"},{"$error":"#N/A"},0.21325648414985576]
[{"$f":"PivotSheet!A56","v":106},{"$f":"PivotSheet!B56","v":3},"a",1,{"$error":"#N/A"},{"$error":"#N/A"},{"$error":"#N/A"},{"$error":"#N/A"},0.22190201729106615]
[{"$f":"PivotSheet!A57","v":108},{"$f":"PivotSheet!B57","v":1},"a",1,{"$error":"#N/A"},{"$error":"#N/A"},{"$error":"#N/A"},{"$error":"#N/A"},0.2247838616714696]
[{"$f":"PivotSheet!A58","v":109},{"$f":"PivotSheet!B58","v":1},"a",1,{"$error":"#N/A"},{"$error":"#N/A"},{"$error":"#N/A"},{"$error":"#N/A"},0.22766570605187306]
[{"$f":"PivotSheet!A59","v":110},{"$f":"PivotSheet!B59","v":1},"a",1,{"$error":"#N/A"},{"$error":"#N/A"},{"$error":"#N/A"},{"$error":"#N/A"},0.23054755043227651]
[{"$f":"PivotSheet!A60","v":111},{"$f":"PivotSheet!B60","v":1},"a",1,{"$error":"#N/A"},{"$error":"#N/A"},{"$error":"#N/A"},{"$error":"#N/A"},0.23342939481267996]
[{"$f":"PivotSheet!A61","v":114},{"$f":"PivotSheet!B61","v":1},"a",1,{"$error":"#N/A"},{"$error":"#N/A"},{"$error":"#N/A"},{"$error":"#N/A"},0.23631123919308342]
[{"$f":"PivotSheet!A62","v":118},{"$f":"PivotSheet!B62","v":1},"a",1,{"$error":"#N/A"},{"$error":"#N/A"},{"$error":"#N/A"},{"$error":"#N/A"},0.23919308357348687]
[{"$f":"PivotSheet!A63","v":121},{"$f":"PivotSheet!B63","v":1},"a",1,{"$error":"#N/A"},{"$error":"#N/A"},{"$error":"#N/A"},{"$error":"#N/A"},0.24207492795389032]
[{"$f":"PivotSheet!A64","v":122},{"$f":"PivotSheet!B64","v":2},"a",1,{"$error":"#N/A"},{"$error":"#N/A"},{"$error":"#N/A"},{"$error":"#N/A"},0.24783861671469723]
[{"$f":"PivotSheet!A65","v":123},{"$f":"PivotSheet!B65","v":3},"a",1,{"$error":"#N/A"},{"$error":"#N/A"},{"$error":"#N/A"},{"$error":"#N/A"},0.25648414985590762]
[{"$f":"PivotSheet!A66","v":125},{"$f":"PivotSheet!B66","v":2},"a",1,{"$error":"#N/A"},{"$error":"#N/A"},{"$error":"#N/A"},{"$error":"#N/A"},0.26224783861671452]
[{"$f":"PivotSheet!A67","v":127},{"$f":"PivotSheet!B67","v":1},{"$f":"IF(A67<=$V$4,\"a\",IF(A67<=$V$6,\"b\",IF(A67<=$V$8,\"c\",IF(A67<=$V$10,\"d\",IF(A67<=$V$12,\"e\",\"ERROR\")))))","v":"a"},{"$f":"IF(C67=\"a\",1,NA())","v":1},{"$f":"IF($C67=\"b\",1,NA())","v":{"$error":"#N/A"}},{"$f":"IF($C67=\"c\",1,NA())","v":{"$error":"#N/A"}},{"$f":"IF($C67=\"d\",1,NA())","v":{"$error":"#N/A"}},{"$f":"IF($C67=\"e\",1,NA())","v":{"$error":"#N/A"}},0.26512968299711798]
[{"$f":"PivotSheet!A68","v":128},{"$f":"PivotSheet!B68","v":1},"a",1,{"$error":"#N/A"},{"$error":"#N/A"},{"$error":"#N/A"},{"$error":"#N/A"},{"$f":"B68/SUM($B$2:$B$10000)+I67","v":0.26801152737752143}]
[{"$f":"PivotSheet!A69","v":129},{"$f":"PivotSheet!B69","v":1},"a",1,{"$error":"#N/A"},{"$error":"#N/A"},{"$error":"#N/A"},{"$error":"#N/A"},0.27089337175792488]
[{"$f":"PivotSheet!A70","v":133},{"$f":"PivotSheet!B70","v":1},"a",1,{"$error":"#N/A"},{"$error":"#N/A"},{"$error":"#N/A"},{"$error":"#N/A"},0.27377521613832834]
[{"$f":"PivotSheet!A71","v":135},{"$f":"PivotSheet!B71","v":1},"a",1,{"$error":"#N/A"},{"$error":"#N/A"},{"$error":"#N/A"},{"$error":"#N/A"},0.27665706051873179]
[{"$f":"PivotSheet!A72","v":137},{"$f":"PivotSheet!B72","v":3},"a",1,{"$error":"#N/A"},{"$error":"#N/A"},{"$error":"#N/A"},{"$error":"#N/A"},0.28530259365994215]
[{"$f":"PivotSheet!A73","v":139},{"$f":"PivotSheet!B73","v":1},"a",1,{"$error":"#N/A"},{"$error":"#N/A"},{"$error":"#N/A"},{"$error":"#N/A"},0.2881844380403456]
[{"$f":"PivotSheet!A74","v":140},{"$f":"PivotSheet!B74","v":1},"a",1,{"$error":"#N/A"},{"$error":"#N/A"},{"$error":"#N/A"},{"$error":"#N/A"},0.29106628242074906]
[{"$f":"PivotSheet!A75","v":141},{"$f":"PivotSheet!B75","v":2},"a",1,{"$error":"#N/A"},{"$error":"#N/A"},{"$error":"#N/A"},{"$error":"#N/A"},0.29682997118155596]
[{"$f":"PivotSheet!A76","v":144},{"$f":"PivotSheet!B76","v":1},"a",1,{"$error":"#N/A"},{"$error":"#N/A"},{"$error":"#N/A"},{"$error":"#N/A"},0.29971181556195942]
[{"$f":"PivotSheet!A77","v":145},{"$f":"PivotSheet!B77","v":2},"a",1,{"$error":"#N/A"},{"$error":"#N/A"},{"$error":"#N/A"},{"$error":"#N/A"},0.30547550432276632]
[{"$f":"PivotSheet!A78","v":147},{"$f":"PivotSheet!B78","v":1},"a",1,{"$error":"#N/A"},{"$error":"#N/A"},{"$error":"#N/A"},{"$error":"#N/A"},0.30835734870316978]
[{"$f":"PivotSheet!A79","v":150},{"$f":"PivotSheet!B79","v":1},"a",1,{"$error":"#N/A"},{"$error":"#N/A"},{"$error":"#N/A"},{"$error":"#N/A"},0.31123919308357323]
[{"$f":"PivotSheet!A80","v":154},{"$f":"PivotSheet!B80","v":1},"a",1,{"$error":"#N/A"},{"$error":"#N/A"},{"$error":"#N/A"},{"$error":"#N/A"},0.31412103746397668]
[{"$f":"PivotSheet!A81","v":155},{"$f":"PivotSheet!B81","v":2},"a",1,{"$error":"#N/A"},{"$error":"#N/A"},{"$error":"#N/A"},{"$error":"#N/A"},0.31988472622478359]
[{"$f":"PivotSheet!A82","v":156},{"$f":"PivotSheet!B82","v":3},"a",1,{"$error":"#N/A"},{"$error":"#N/A"},{"$error":"#N/A"},{"$error":"#N/A"},0.32853025936599395]
[{"$f":"PivotSheet!A83","v":158},{"$f":"PivotSheet!B83","v":1},"a",1,{"$error":"#N/A"},{"$error":"#N/A"},{"$error":"#N/A"},{"$error":"#N/A"},0.3314121037463974]
[{"$f":"PivotSheet!A84","v":159},{"$f":"PivotSheet!B84","v":1},"b",{"$error":"#N/A"},1,{"$error":"#N/A"},{"$error":"#N/A"},{"$error":"#N/A"},0.33429394812680086]
[{"$f":"PivotSheet!A85","v":161},{"$f":"PivotSheet!B85","v":2},"b",{"$error":"#N/A"},1,{"$error":"#N/A"},{"$error":"#N/A"},{"$error":"#N/A"},0.34005763688760776]
[{"$f":"PivotSheet!A86","v":165},{"$f":"PivotSheet!B86","v":1},"b",{"$error":"#N/A"},1,{"$error":"#N/A"},{"$error":"#N/A"},{"$error":"#N/A"},0.34293948126801121]
[{"$f":"PivotSheet!A87","v":166},{"$f":"PivotSheet!B87","v":2},"b",{"$error":"#N/A"},1,{"$error":"#N/A"},{"$error":"#N/A"},{"$error":"#N/A"},0.34870317002881812]
[{"$f":"PivotSheet!A88","v":167},{"$f":"PivotSheet!B88","v":1},"b",{"$error":"#N/A"},1,{"$error":"#N/A"},{"$error":"#N/A"},{"$error":"#N/A"},0.35158501440922157]
[{"$f":"PivotSheet!A89","v":168},{"$f":"PivotSheet!B89","v":1},"b",{"$error":"#N/A"},1,{"$error":"#N/A"},{"$error":"#N/A"},{"$error":"#N/A"},0.35446685878962503]
[{"$f":"PivotSheet!A90","v":169},{"$f":"PivotSheet!B90","v":1},"b",{"$error":"#N/A"},1,{"$error":"#N/A"},{"$error":"#N/A"},{"$error":"#N/A"},0.35734870317002848]
[{"$f":"PivotSheet!A91","v":170},{"$f":"PivotSheet!B91","v":1},"b",{"$error":"#N/A"},1,{"$error":"#N/A"},{"$error":"#N/A"},{"$error":"#N/A"},0.36023054755043193]
[{"$f":"PivotSheet!A92","v":171},{"$f":"PivotSheet!B92","v":3},"b",{"$error":"#N/A"},1,{"$error":"#N/A"},{"$error":"#N/A"},{"$error":"#N/A"},0.36887608069164229]
[{"$f":"PivotSheet!A93","v":172},{"$f":"PivotSheet!B93","v":2},"b",{"$error":"#N/A"},1,{"$error":"#N/A"},{"$error":"#N/A"},{"$error":"#N/A"},0.3746397694524492]
[{"$f":"PivotSheet!A94","v":174},{"$f":"PivotSheet!B94","v":1},"b",{"$error":"#N/A"},1,{"$error":"#N/A"},{"$error":"#N/A"},{"$error":"#N/A"},0.37752161383285265]
[{"$f":"PivotSheet!A95","v":177},{"$f":"PivotSheet!B95","v":1},"b",{"$error":"#N/A"},1,{"$error":"#N/A"},{"$error":"#N/A"},{"$error":"#N/A"},0.38040345821325611]
[{"$f":"PivotSheet!A96","v":178},{"$f":"PivotSheet!B96","v":2},"b",{"$error":"#N/A"},1,{"$error":"#N/A"},{"$error":"#N/A"},{"$error":"#N/A"},0.38616714697406301]
[{"$f":"PivotSheet!A97","v":179},{"$f":"PivotSheet!B97","v":2},"b",{"$error":"#N/A"},1,{"$error":"#N/A"},{"$error":"#N/A"},{"$error":"#N/A"},0.39193083573486992]
[{"$f":"PivotSheet!A98","v":181},{"$f":"PivotSheet!B98","v":3},"b",{"$error":"#N/A"},1,{"$error":"#N/A"},{"$error":"#N/A"},{"$error":"#N/A"},0.40057636887608028]
[{"$f":"PivotSheet!A99","v":182},{"$f":"PivotSheet!B99","v":1},"b",{"$error":"#N/A"},1,{"$error":"#N/A"},{"$error":"#N/A"},{"$error":"#N/A"},0.40345821325648373]
[{"$f":"PivotSheet!A100","v":186},{"$f":"PivotSheet!B100","v":2},"b",{"$error":"#N/A"},1,{"$error":"#N/A"},{"$error":"#N/A"},{"$error":"#N/A"},0.40922190201729064]
[{"$f":"PivotSheet!A101","v":187},{"$f":"PivotSheet!B101","v":2},"b",{"$error":"#N/A"},1,{"$error":"#N/A"},{"$error":"#N/A"},{"$error":"#N/A"},0.41498559077809755]
[{"$f":"PivotSheet!A102","v":189},{"$f":"PivotSheet!B102","v":1},"b",{"$error":"#N/A"},1,{"$error":"#N/A"},{"$error":"#N/A"},{"$error":"#N/A"},0.417867435158501]
[{"$f":"PivotSheet!A103","v":190},{"$f":"PivotSheet!B103","v":2},"b",{"$error":"#N/A"},1,{"$error":"#N/A"},{"$error":"#N/A"},{"$error":"#N/A"},0.42363112391930791]
[{"$f":"PivotSheet!A104","v":191},{"$f":"PivotSheet!B104","v":2},"b",{"$error":"#N/A"},1,{"$error":"#N/A"},{"$error":"#N/A"},{"$error":"#N/A"},0.42939481268011481]
[{"$f":"PivotSheet!A105","v":196},{"$f":"PivotSheet!B105","v":1},"b",{"$error":"#N/A"},1,{"$error":"#N/A"},{"$error":"#N/A"},{"$error":"#N/A"},0.43227665706051827]
[{"$f":"PivotSheet!A106","v":197},{"$f":"PivotSheet!B106","v":1},"b",{"$error":"#N/A"},1,{"$error":"#N/A"},{"$error":"#N/A"},{"$error":"#N/A"},0.43515850144092172]
[{"$f":"PivotSheet!A107","v":203},{"$f":"PivotSheet!B107","v":1},"b",{"$error":"#N/A"},1,{"$error":"#N/A"},{"$error":"#N/A"},{"$error":"#N/A"},0.43804034582132517]
[{"$f":"PivotSheet!A108","v":204},{"$f":"PivotSheet!B108","v":1},"b",{"$error":"#N/A"},1,{"$error":"#N/A"},{"$error":"#N/A"},{"$error":"#N/A"},0.44092219020172863]
[{"$f":"PivotSheet!A109","v":206},{"$f":"PivotSheet!B109","v":1},"b",{"$error":"#N/A"},1,{"$error":"#N/A"},{"$error":"#N/A"},{"$error":"#N/A"},0.44380403458213208]
[{"$f":"PivotSheet!A110","v":208},{"$f":"PivotSheet!B110","v":1},"b",{"$error":"#N/A"},1,{"$error":"#N/A"},{"$error":"#N/A"},{"$error":"#N/A"},0.44668587896253553]
[{"$f":"PivotSheet!A111","v":213},{"$f":"PivotSheet!B111","v":3},"b",{"$error":"#N/A"},1,{"$error":"#N/A"},{"$error":"#N/A"},{"$error":"#N/A"},0.45533141210374589]
[{"$f":"PivotSheet!A112","v":214},{"$f":"PivotSheet!B112","v":1},"b",{"$error":"#N/A"},1,{"$error":"#N/A"},{"$error":"#N/A"},{"$error":"#N/A"},0.45821325648414934]
[{"$f":"PivotSheet!A113","v":217},{"$f":"PivotSheet!B113","v":1},"b",{"$error":"#N/A"},1,{"$error":"#N/A"},{"$error":"#N/A"},{"$error":"#N/A"},0.4610951008645528]
[{"$f":"PivotSheet!A114","v":218},{"$f":"PivotSheet!B114","v":2},"b",{"$error":"#N/A"},1,{"$error":"#N/A"},{"$error":"#N/A"},{"$error":"#N/A"},0.4668587896253597]
[{"$f":"PivotSheet!A115","v":220},{"$f":"PivotSheet!B115","v":1},"b",{"$error":"#N/A"},1,{"$error":"#N/A"},{"$error":"#N/A"},{"$error":"#N/A"},0.46974063400576316]
[{"$f":"PivotSheet!A116","v":222},{"$f":"PivotSheet!B116","v":1},"b",{"$error":"#N/A"},1,{"$error":"#N/A"},{"$error":"#N/A"},{"$error":"#N/A"},0.47262247838616661]
[{"$f":"PivotSheet!A117","v":226},{"$f":"PivotSheet!B117","v":1},"b",{"$error":"#N/A"},1,{"$error":"#N/A"},{"$error":"#N/A"},{"$error":"#N/A"},0.47550432276657006]
[{"$f":"PivotSheet!A118","v":227},{"$f":"PivotSheet!B118","v":1},"b",{"$error":"#N/A"},1,{"$error":"#N/A"},{"$error":"#N/A"},{"$error":"#N/A"},0.47838616714697352]
[{"$f":"PivotSheet!A119","v":228},{"$f":"PivotSheet!B119","v":1},"b",{"$error":"#N/A"},1,{"$error":"#N/A"},{"$error":"#N/A"},{"$error":"#N/A"},0.48126801152737697]
[{"$f":"PivotSheet!A120","v":229},{"$f":"PivotSheet!B120","v":2},"b",{"$error":"#N/A"},1,{"$error":"#N/A"},{"$error":"#N/A"},{"$error":"#N/A"},0.48703170028818388]
[{"$f":"PivotSheet!A121","v":235},{"$f":"PivotSheet!B121","v":1},"b",{"$error":"#N/A"},1,{"$error":"#N/A"},{"$error":"#N/A"},{"$error":"#N/A"},0.48991354466858733]
[{"$f":"PivotSheet!A122","v":236},{"$f":"PivotSheet!B122","v":1},"b",{"$error":"#N/A"},1,{"$error":"#N/A"},{"$error":"#N/A"},{"$error":"#N/A"},0.49279538904899078]
[{"$f":"PivotSheet!A123","v":238},{"$f":"PivotSheet!B123","v":1},"b",{"$error":"#N/A"},1,{"$error":"#N/A"},{"$error":"#N/A"},{"$error":"#N/A"},0.49567723342939424]
[{"$f":"PivotSheet!A124","v":239},{"$f":"PivotSheet!B124","v":2},"b",{"$error":"#N/A"},1,{"$error":"#N/A"},{"$error":"#N/A"},{"$error":"#N/A"},0.5014409221902012]
[{"$f":"PivotSheet!A125","v":241},{"$f":"PivotSheet!B125","v":2},"b",{"$error":"#N/A"},1,{"$error":"#N/A"},{"$error":"#N/A"},{"$error":"#N/A"},0.50720461095100811]
[{"$f":"PivotSheet!A126","v":244},{"$f":"PivotSheet!B126","v":1},"b",{"$error":"#N/A"},1,{"$error":"#N/A"},{"$error":"#N/A"},{"$error":"#N/A"},0.51008645533141161]
[{"$f":"PivotSheet!A127","v":248},{"$f":"PivotSheet!B127","v":1},"b",{"$error":"#N/A"},1,{"$error":"#N/A"},{"$error":"#N/A"},{"$error":"#N/A"},0.51296829971181512]
[{"$f":"PivotSheet!A128","v":249},{"$f":"PivotSheet!B128","v":3},"b",{"$error":"#N/A"},1,{"$error":"#N/A"},{"$error":"#N/A"},{"$error":"#N/A"},0.52161383285302554]
[{"$f":"PivotSheet!A129","v":252},{"$f":"PivotSheet!B129","v":2},"b",{"$error":"#N/A"},1,{"$error":"#N/A"},{"$error":"#N/A"},{"$error":"#N/A"},0.52737752161383245]
[{"$f":"PivotSheet!A130","v":256},{"$f":"PivotSheet!B130","v":1},"b",{"$error":"#N/A"},1,{"$error":"#N/A"},{"$error":"#N/A"},{"$error":"#N/A"},0.53025936599423595]
[{"$f":"PivotSheet!A131","v":257},{"$f":"PivotSheet!B131","v":1},{"$f":"IF(A131<=$V$4,\"a\",IF(A131<=$V$6,\"b\",IF(A131<=$V$8,\"c\",IF(A131<=$V$10,\"d\",IF(A131<=$V$12,\"e\",\"ERROR\")))))","v":"b"},{"$f":"IF(C131=\"a\",1,NA())","v":{"$error":"#N/A"}},{"$f":"IF($C131=\"b\",1,NA())","v":1},{"$f":"IF($C131=\"c\",1,NA())","v":{"$error":"#N/A"}},{"$f":"IF($C131=\"d\",1,NA())","v":{"$error":"#N/A"}},{"$f":"IF($C131=\"e\",1,NA())","v":{"$error":"#N/A"}},0.53314121037463946]
[{"$f":"PivotSheet!A132","v":258},{"$f":"PivotSheet!B132","v":1},"b",{"$error":"#N/A"},1,{"$error":"#N/A"},{"$error":"#N/A"},{"$error":"#N/A"},{"$f":"B132/SUM($B$2:$B$10000)+I131","v":0.53602305475504297}]
[{"$f":"PivotSheet!A133","v":260},{"$f":"PivotSheet!B133","v":1},"b",{"$error":"#N/A"},1,{"$error":"#N/A"},{"$error":"#N/A"},{"$error":"#N/A"},0.53890489913544648]
[{"$f":"PivotSheet!A134","v":264},{"$f":"PivotSheet!B134","v":1},"b",{"$error":"#N/A"},1,{"$error":"#N/A"},{"$error":"#N/A"},{"$error":"#N/A"},0.54178674351584999]
[{"$f":"PivotSheet!A135","v":265},{"$f":"PivotSheet!B135","v":1},"b",{"$error":"#N/A"},1,{"$error":"#N/A"},{"$error":"#N/A"},{"$error":"#N/A"},0.5446685878962535]
[{"$f":"PivotSheet!A136","v":266},{"$f":"PivotSheet!B136","v":1},"b",{"$error":"#N/A"},1,{"$error":"#N/A"},{"$error":"#N/A"},{"$error":"#N/A"},0.54755043227665701]
[{"$f":"PivotSheet!A137","v":267},{"$f":"PivotSheet!B137","v":2},"b",{"$error":"#N/A"},1,{"$error":"#N/A"},{"$error":"#N/A"},{"$error":"#N/A"},0.55331412103746391]
[{"$f":"PivotSheet!A138","v":269},{"$f":"PivotSheet!B138","v":2},"b",{"$error":"#N/A"},1,{"$error":"#N/A"},{"$error":"#N/A"},{"$error":"#N/A"},0.55907780979827082]
[{"$f":"PivotSheet!A139","v":270},{"$f":"PivotSheet!B139","v":1},"b",{"$error":"#N/A"},1,{"$error":"#N/A"},{"$error":"#N/A"},{"$error":"#N/A"},0.56195965417867433]
[{"$f":"PivotSheet!A140","v":273},{"$f":"PivotSheet!B140","v":1},"b",{"$error":"#N/A"},1,{"$error":"#N/A"},{"$error":"#N/A"},{"$error":"#N/A"},0.56484149855907784]
[{"$f":"PivotSheet!A141","v":275},{"$f":"PivotSheet!B141","v":1},"b",{"$error":"#N/A"},1,{"$error":"#N/A"},{"$error":"#N/A"},{"$error":"#N/A"},0.56772334293948135]
[{"$f":"PivotSheet!A142","v":277},{"$f":"PivotSheet!B142","v":1},"b",{"$error":"#N/A"},1,{"$error":"#N/A"},{"$error":"#N/A"},{"$error":"#N/A"},0.57060518731988485]
[{"$f":"PivotSheet!A143","v":278},{"$f":"PivotSheet!B143","v":1},"b",{"$error":"#N/A"},1,{"$error":"#N/A"},{"$error":"#N/A"},{"$error":"#N/A"},0.57348703170028836]
[{"$f":"PivotSheet!A144","v":280},{"$f":"PivotSheet!B144","v":1},"b",{"$error":"#N/A"},1,{"$error":"#N/A"},{"$error":"#N/A"},{"$error":"#N/A"},0.57636887608069187]
[{"$f":"PivotSheet!A145","v":282},{"$f":"PivotSheet!B145","v":1},"b",{"$error":"#N/A"},1,{"$error":"#N/A"},{"$error":"#N/A"},{"$error":"#N/A"},0.57925072046109538]
[{"$f":"PivotSheet!A146","v":286},{"$f":"PivotSheet!B146","v":1},"b",{"$error":"#N/A"},1,{"$error":"#N/A"},{"$error":"#N/A"},{"$error":"#N/A"},0.58213256484149889]
[{"$f":"PivotSheet!A147","v":289},{"$f":"PivotSheet!B147","v":2},"b",{"$error":"#N/A"},1,{"$error":"#N/A"},{"$error":"#N/A"},{"$error":"#N/A"},0.5878962536023058]
[{"$f":"PivotSheet!A148","v":291},{"$f":"PivotSheet!B148","v":1},"b",{"$error":"#N/A"},1,{"$error":"#N/A"},{"$error":"#N/A"},{"$error":"#N/A"},0.5907780979827093]
[{"$f":"PivotSheet!A149","v":292},{"$f":"PivotSheet!B149","v":3},"b",{"$error":"#N/A"},1,{"$error":"#N/A"},{"$error":"#N/A"},{"$error":"#N/A"},0.59942363112391972]
[{"$f":"PivotSheet!A150","v":293},{"$f":"PivotSheet!B150","v":1},"b",{"$error":"#N/A"},1,{"$error":"#N/A"},{"$error":"#N/A"},{"$error":"#N/A"},0.60230547550432323]
[{"$f":"PivotSheet!A151","v":294},{"$f":"PivotSheet!B151","v":1},"b",{"$error":"#N/A"},1,{"$error":"#N/A"},{"$error":"#N/A"},{"$error":"#N/A"},0.60518731988472674]
[{"$f":"PivotSheet!A152","v":295},{"$f":"PivotSheet!B152","v":4},"b",{"$error":"#N/A"},1,{"$error":"#N/A"},{"$error":"#N/A"},{"$error":"#N/A"},0.61671469740634055]
[{"$f":"PivotSheet!A153","v":296},{"$f":"PivotSheet!B153","v":1},"b",{"$error":"#N/A"},1,{"$error":"#N/A"},{"$error":"#N/A"},{"$error":"#N/A"},0.61959654178674406]
[{"$f":"PivotSheet!A154","v":297},{"$f":"PivotSheet!B154","v":2},"b",{"$error":"#N/A"},1,{"$error":"#N/A"},{"$error":"#N/A"},{"$error":"#N/A"},0.62536023054755097]
[{"$f":"PivotSheet!A155","v":301},{"$f":"PivotSheet!B155","v":1},"b",{"$error":"#N/A"},1,{"$error":"#N/A"},{"$error":"#N/A"},{"$error":"#N/A"},0.62824207492795447]
[{"$f":"PivotSheet!A156","v":302},{"$f":"PivotSheet!B156","v":1},"b",{"$error":"#N/A"},1,{"$error":"#N/A"},{"$error":"#N/A"},{"$error":"#N/A"},0.63112391930835798]
[{"$f":"PivotSheet!A157","v":303},{"$f":"PivotSheet!B157","v":1},"b",{"$error":"#N/A"},1,{"$error":"#N/A"},{"$error":"#N/A"},{"$error":"#N/A"},0.63400576368876149]
[{"$f":"PivotSheet!A158","v":305},{"$f":"PivotSheet!B158","v":1},"b",{"$error":"#N/A"},1,{"$error":"#N/A"},{"$error":"#N/A"},{"$error":"#N/A"},0.636887608069165]
[{"$f":"PivotSheet!A159","v":306},{"$f":"PivotSheet!B159","v":1},"b",{"$error":"#N/A"},1,{"$error":"#N/A"},{"$error":"#N/A"},{"$error":"#N/A"},0.63976945244956851]
[{"$f":"PivotSheet!A160","v":308},{"$f":"PivotSheet!B160","v":1},"b",{"$error":"#N/A"},1,{"$error":"#N/A"},{"$error":"#N/A"},{"$error":"#N/A"},0.64265129682997202]
[{"$f":"PivotSheet!A161","v":309},{"$f":"PivotSheet!B161","v":1},"b",{"$error":"#N/A"},1,{"$error":"#N/A"},{"$error":"#N/A"},{"$error":"#N/A"},0.64553314121037553]
[{"$f":"PivotSheet!A162","v":310},{"$f":"PivotSheet!B162","v":1},"b",{"$error":"#N/A"},1,{"$error":"#N/A"},{"$error":"#N/A"},{"$error":"#N/A"},0.64841498559077904]
[{"$f":"PivotSheet!A163","v":313},{"$f":"PivotSheet!B163","v":1},"b",{"$error":"#N/A"},1,{"$error":"#N/A"},{"$error":"#N/A"},{"$error":"#N/A"},0.65129682997118254]
[{"$f":"PivotSheet!A164","v":314},{"$f":"PivotSheet!B164","v":1},"b",{"$error":"#N/A"},1,{"$error":"#N/A"},{"$error":"#N/A"},{"$error":"#N/A"},0.65417867435158605]
[{"$f":"PivotSheet!A165","v":315},{"$f":"PivotSheet!B165","v":1},"b",{"$error":"#N/A"},1,{"$error":"#N/A"},{"$error":"#N/A"},{"$error":"#N/A"},0.65706051873198956]
[{"$f":"PivotSheet!A166","v":319},{"$f":"PivotSheet!B166","v":1},"b",{"$error":"#N/A"},1,{"$error":"#N/A"},{"$error":"#N/A"},{"$error":"#N/A"},0.65994236311239307]
[{"$f":"PivotSheet!A167","v":321},{"$f":"PivotSheet!B167","v":1},"c",{"$error":"#N/A"},{"$error":"#N/A"},1,{"$error":"#N/A"},{"$error":"#N/A"},0.66282420749279658]
[{"$f":"PivotSheet!A168","v":324},{"$f":"PivotSheet!B168","v":1},"c",{"$error":"#N/A"},{"$error":"#N/A"},1,{"$error":"#N/A"},{"$error":"#N/A"},0.66570605187320009]
[{"$f":"PivotSheet!A169","v":326},{"$f":"PivotSheet!B169","v":2},"c",{"$error":"#N/A"},{"$error":"#N/A"},1,{"$error":"#N/A"},{"$error":"#N/A"},0.671469740634007]
[{"$f":"PivotSheet!A170","v":327},{"$f":"PivotSheet!B170","v":1},"c",{"$error":"#N/A"},{"$error":"#N/A"},1,{"$error":"#N/A"},{"$error":"#N/A"},0.6743515850144105]
[{"$f":"PivotSheet!A171","v":328},{"$f":"PivotSheet!B171","v":2},"c",{"$error":"#N/A"},{"$error":"#N/A"},1,{"$error":"#N/A"},{"$error":"#N/A"},0.68011527377521741]
[{"$f":"PivotSheet!A172","v":329},{"$f":"PivotSheet!B172","v":2},"c",{"$error":"#N/A"},{"$error":"#N/A"},1,{"$error":"#N/A"},{"$error":"#N/A"},0.68587896253602432]
[{"$f":"PivotSheet!A173","v":330},{"$f":"PivotSheet!B173","v":1},"c",{"$error":"#N/A"},{"$error":"#N/A"},1,{"$error":"#N/A"},{"$error":"#N/A"},0.68876080691642783]
[{"$f":"PivotSheet!A174","v":332},{"$f":"PivotSheet!B174","v":3},"c",{"$error":"#N/A"},{"$error":"#N/A"},1,{"$error":"#N/A"},{"$error":"#N/A"},0.69740634005763824]
[{"$f":"PivotSheet!A175","v":334},{"$f":"PivotSheet!B175","v":1},"c",{"$error":"#N/A"},{"$error":"#N/A"},1,{"$error":"#N/A"},{"$error":"#N/A"},0.70028818443804175]
[{"$f":"PivotSheet!A176","v":335},{"$f":"PivotSheet!B176","v":1},"c",{"$error":"#N/A"},{"$error":"#N/A"},1,{"$error":"#N/A"},{"$error":"#N/A"},0.70317002881844526]
[{"$f":"PivotSheet!A177","v":337},{"$f":"PivotSheet!B177","v":2},"c",{"$error":"#N/A"},{"$error":"#N/A"},1,{"$error":"#N/A"},{"$error":"#N/A"},0.70893371757925217]
[{"$f":"PivotSheet!A178","v":338},{"$f":"PivotSheet!B178","v":1},"c",{"$error":"#N/A"},{"$error":"#N/A"},1,{"$error":"#N/A"},{"$error":"#N/A"},0.71181556195965567]
[{"$f":"PivotSheet!A179","v":339},{"$f":"PivotSheet!B179","v":2},"c",{"$error":"#N/A"},{"$error":"#N/A"},1,{"$error":"#N/A"},{"$error":"#N/A"},0.71757925072046258]
[{"$f":"PivotSheet!A180","v":343},{"$f":"PivotSheet!B180","v":1},"c",{"$error":"#N/A"},{"$error":"#N/A"},1,{"$error":"#N/A"},{"$error":"#N/A"},0.72046109510086609]
[{"$f":"PivotSheet!A181","v":345},{"$f":"PivotSheet!B181","v":2},"c",{"$error":"#N/A"},{"$error":"#N/A"},1,{"$error":"#N/A"},{"$error":"#N/A"},0.726224783861673]
[{"$f":"PivotSheet!A182","v":346},{"$f":"PivotSheet!B182","v":2},"c",{"$error":"#N/A"},{"$error":"#N/A"},1,{"$error":"#N/A"},{"$error":"#N/A"},0.7319884726224799]
[{"$f":"PivotSheet!A183","v":347},{"$f":"PivotSheet!B183","v":1},"c",{"$error":"#N/A"},{"$error":"#N/A"},1,{"$error":"#N/A"},{"$error":"#N/A"},0.73487031700288341]
[{"$f":"PivotSheet!A184","v":349},{"$f":"PivotSheet!B184","v":1},"c",{"$error":"#N/A"},{"$error":"#N/A"},1,{"$error":"#N/A"},{"$error":"#N/A"},0.73775216138328692]
[{"$f":"PivotSheet!A185","v":350},{"$f":"PivotSheet!B185","v":1},"c",{"$error":"#N/A"},{"$error":"#N/A"},1,{"$error":"#N/A"},{"$error":"#N/A"},0.74063400576369043]
[{"$f":"PivotSheet!A186","v":351},{"$f":"PivotSheet!B186","v":1},"c",{"$error":"#N/A"},{"$error":"#N/A"},1,{"$error":"#N/A"},{"$error":"#N/A"},0.74351585014409394]
[{"$f":"PivotSheet!A187","v":353},{"$f":"PivotSheet!B187","v":1},"c",{"$error":"#N/A"},{"$error":"#N/A"},1,{"$error":"#N/A"},{"$error":"#N/A"},0.74639769452449745]
[{"$f":"PivotSheet!A188","v":354},{"$f":"PivotSheet!B188","v":1},"c",{"$error":"#N/A"},{"$error":"#N/A"},1,{"$error":"#N/A"},{"$error":"#N/A"},0.74927953890490095]
[{"$f":"PivotSheet!A189","v":356},{"$f":"PivotSheet!B189","v":2},"c",{"$error":"#N/A"},{"$error":"#N/A"},1,{"$error":"#N/A"},{"$error":"#N/A"},0.75504322766570786]
[{"$f":"PivotSheet!A190","v":359},{"$f":"PivotSheet!B190","v":1},"c",{"$error":"#N/A"},{"$error":"#N/A"},1,{"$error":"#N/A"},{"$error":"#N/A"},0.75792507204611137]
[{"$f":"PivotSheet!A191","v":361},{"$f":"PivotSheet!B191","v":1},"c",{"$error":"#N/A"},{"$error":"#N/A"},1,{"$error":"#N/A"},{"$error":"#N/A"},0.76080691642651488]
[{"$f":"PivotSheet!A192","v":362},{"$f":"PivotSheet!B192","v":3},"c",{"$error":"#N/A"},{"$error":"#N/A"},1,{"$error":"#N/A"},{"$error":"#N/A"},0.76945244956772529]
[{"$f":"PivotSheet!A193","v":363},{"$f":"PivotSheet!B193","v":1},"c",{"$error":"#N/A"},{"$error":"#N/A"},1,{"$error":"#N/A"},{"$error":"#N/A"},0.7723342939481288]
[{"$f":"PivotSheet!A194","v":365},{"$f":"PivotSheet!B194","v":1},"c",{"$error":"#N/A"},{"$error":"#N/A"},1,{"$error":"#N/A"},{"$error":"#N/A"},0.77521613832853231]
[{"$f":"PivotSheet!A195","v":366},{"$f":"PivotSheet!B195","v":1},{"$f":"IF(A195<=$V$4,\"a\",IF(A195<=$V$6,\"b\",IF(A195<=$V$8,\"c\",IF(A195<=$V$10,\"d\",IF(A195<=$V$12,\"e\",\"ERROR\")))))","v":"c"},{"$f":"IF(C195=\"a\",1,NA())","v":{"$error":"#N/A"}},{"$f":"IF($C195=\"b\",1,NA())","v":{"$error":"#N/A"}},{"$f":"IF($C195=\"c\",1,NA())","v":1},{"$f":"IF($C195=\"d\",1,NA())","v":{"$error":"#N/A"}},{"$f":"IF($C195=\"e\",1,NA())","v":{"$error":"#N/A"}},0.77809798270893582]
[{"$f":"PivotSheet!A196","v":368},{"$f":"PivotSheet!B196","v":1},"c",{"$error":"#N/A"},{"$error":"#N/A"},1,{"$error":"#N/A"},{"$error":"#N/A"},{"$f":"B196/SUM($B$2:$B$10000)+I195","v":0.78097982708933933}]
[{"$f":"PivotSheet!A197","v":369},{"$f":"PivotSheet!B197","v":2},"c",{"$error":"#N/A"},{"$error":"#N/A"},1,{"$error":"#N/A"},{"$error":"#N/A"},0.78674351585014624]
[{"$f":"PivotSheet!A198","v":373},{"$f":"PivotSheet!B198","v":1},"c",{"$error":"#N/A"},{"$error":"#N/A"},1,{"$error":"#N/A"},{"$error":"#N/A"},0.78962536023054974]
[{"$f":"PivotSheet!A199","v":375},{"$f":"PivotSheet!B199","v":1},"c",{"$error":"#N/A"},{"$error":"#N/A"},1,{"$error":"#N/A"},{"$error":"#N/A"},0.79250720461095325]
[{"$f":"PivotSheet!A200","v":376},{"$f":"PivotSheet!B200","v":1},"c",{"$error":"#N/A"},{"$error":"#N/A"},1,{"$error":"#N/A"},{"$error":"#N/A"},0.79538904899135676]
[{"$f":"PivotSheet!A201","v":378},{"$f":"PivotSheet!B201","v":1},"c",{"$error":"#N/A"},{"$error":"#N/A"},1,{"$error":"#N/A"},{"$error":"#N/A"},0.79827089337176027]
[{"$f":"PivotSheet!A202","v":380},{"$f":"PivotSheet!B202","v":1},"c",{"$error":"#N/A"},{"$error":"#N/A"},1,{"$error":"#N/A"},{"$error":"#N/A"},0.80115273775216378]
[{"$f":"PivotSheet!A203","v":381},{"$f":"PivotSheet!B203","v":1},"c",{"$error":"#N/A"},{"$error":"#N/A"},1,{"$error":"#N/A"},{"$error":"#N/A"},0.80403458213256729]
[{"$f":"PivotSheet!A204","v":382},{"$f":"PivotSheet!B204","v":1},"c",{"$error":"#N/A"},{"$error":"#N/A"},1,{"$error":"#N/A"},{"$error":"#N/A"},0.8069164265129708]
[{"$f":"PivotSheet!A205","v":383},{"$f":"PivotSheet!B205","v":1},"c",{"$error":"#N/A"},{"$error":"#N/A"},1,{"$error":"#N/A"},{"$error":"#N/A"},0.80979827089337431]
[{"$f":"PivotSheet!A206","v":385},{"$f":"PivotSheet!B206","v":1},"c",{"$error":"#N/A"},{"$error":"#N/A"},1,{"$error":"#N/A"},{"$error":"#N/A"},0.81268011527377781]
[{"$f":"PivotSheet!A207","v":388},{"$f":"PivotSheet!B207","v":1},"c",{"$error":"#N/A"},{"$error":"#N/A"},1,{"$error":"#N/A"},{"$error":"#N/A"},0.81556195965418132]
[{"$f":"PivotSheet!A208","v":389},{"$f":"PivotSheet!B208","v":1},"c",{"$error":"#N/A"},{"$error":"#N/A"},1,{"$error":"#N/A"},{"$error":"#N/A"},0.81844380403458483]
[{"$f":"PivotSheet!A209","v":390},{"$f":"PivotSheet!B209","v":2},"c",{"$error":"#N/A"},{"$error":"#N/A"},1,{"$error":"#N/A"},{"$error":"#N/A"},0.82420749279539174]
[{"$f":"PivotSheet!A210","v":391},{"$f":"PivotSheet!B210","v":1},"c",{"$error":"#N/A"},{"$error":"#N/A"},1,{"$error":"#N/A"},{"$error":"#N/A"},0.82708933717579525]
[{"$f":"PivotSheet!A211","v":392},{"$f":"PivotSheet!B211","v":1},"c",{"$error":"#N/A"},{"$error":"#N/A"},1,{"$error":"#N/A"},{"$error":"#N/A"},0.82997118155619876]
[{"$f":"PivotSheet!A212","v":393},{"$f":"PivotSheet!B212","v":1},"c",{"$error":"#N/A"},{"$error":"#N/A"},1,{"$error":"#N/A"},{"$error":"#N/A"},0.83285302593660226]
[{"$f":"PivotSheet!A213","v":394},{"$f":"PivotSheet!B213","v":1},"c",{"$error":"#N/A"},{"$error":"#N/A"},1,{"$error":"#N/A"},{"$error":"#N/A"},0.83573487031700577]
[{"$f":"PivotSheet!A214","v":395},{"$f":"PivotSheet!B214","v":1},"c",{"$error":"#N/A"},{"$error":"#N/A"},1,{"$error":"#N/A"},{"$error":"#N/A"},0.83861671469740928]
[{"$f":"PivotSheet!A215","v":398},{"$f":"PivotSheet!B215","v":1},"c",{"$error":"#N/A"},{"$error":"#N/A"},1,{"$error":"#N/A"},{"$error":"#N/A"},0.84149855907781279]
[{"$f":"PivotSheet!A216","v":399},{"$f":"PivotSheet!B216","v":2},"c",{"$error":"#N/A"},{"$error":"#N/A"},1,{"$error":"#N/A"},{"$error":"#N/A"},0.8472622478386197]
[{"$f":"PivotSheet!A217","v":403},{"$f":"PivotSheet!B217","v":1},"c",{"$error":"#N/A"},{"$error":"#N/A"},1,{"$error":"#N/A"},{"$error":"#N/A"},0.85014409221902321]
[{"$f":"PivotSheet!A218","v":405},{"$f":"PivotSheet!B218","v":1},"c",{"$error":"#N/A"},{"$error":"#N/A"},1,{"$error":"#N/A"},{"$error":"#N/A"},0.85302593659942672]
[{"$f":"PivotSheet!A219","v":406},{"$f":"PivotSheet!B219","v":1},"c",{"$error":"#N/A"},{"$error":"#N/A"},1,{"$error":"#N/A"},{"$error":"#N/A"},0.85590778097983022]
[{"$f":"PivotSheet!A220","v":408},{"$f":"PivotSheet!B220","v":1},"c",{"$error":"#N/A"},{"$error":"#N/A"},1,{"$error":"#N/A"},{"$error":"#N/A"},0.85878962536023373]
[{"$f":"PivotSheet!A221","v":411},{"$f":"PivotSheet!B221","v":3},"c",{"$error":"#N/A"},{"$error":"#N/A"},1,{"$error":"#N/A"},{"$error":"#N/A"},0.86743515850144415]
[{"$f":"PivotSheet!A222","v":416},{"$f":"PivotSheet!B222","v":1},"c",{"$error":"#N/A"},{"$error":"#N/A"},1,{"$error":"#N/A"},{"$error":"#N/A"},0.87031700288184766]
[{"$f":"PivotSheet!A223","v":417},{"$f":"PivotSheet!B223","v":2},"c",{"$error":"#N/A"},{"$error":"#N/A"},1,{"$error":"#N/A"},{"$error":"#N/A"},0.87608069164265456]
[{"$f":"PivotSheet!A224","v":418},{"$f":"PivotSheet!B224","v":1},"c",{"$error":"#N/A"},{"$error":"#N/A"},1,{"$error":"#N/A"},{"$error":"#N/A"},0.87896253602305807]
[{"$f":"PivotSheet!A225","v":419},{"$f":"PivotSheet!B225","v":1},"c",{"$error":"#N/A"},{"$error":"#N/A"},1,{"$error":"#N/A"},{"$error":"#N/A"},0.88184438040346158]
[{"$f":"PivotSheet!A226","v":421},{"$f":"PivotSheet!B226","v":1},"c",{"$error":"#N/A"},{"$error":"#N/A"},1,{"$error":"#N/A"},{"$error":"#N/A"},0.88472622478386509]
[{"$f":"PivotSheet!A227","v":423},{"$f":"PivotSheet!B227","v":1},"c",{"$error":"#N/A"},{"$error":"#N/A"},1,{"$error":"#N/A"},{"$error":"#N/A"},0.8876080691642686]
[{"$f":"PivotSheet!A228","v":428},{"$f":"PivotSheet!B228","v":1},"c",{"$error":"#N/A"},{"$error":"#N/A"},1,{"$error":"#N/A"},{"$error":"#N/A"},0.89048991354467211]
[{"$f":"PivotSheet!A229","v":435},{"$f":"PivotSheet!B229","v":2},"c",{"$error":"#N/A"},{"$error":"#N/A"},1,{"$error":"#N/A"},{"$error":"#N/A"},0.89625360230547901]
[{"$f":"PivotSheet!A230","v":439},{"$f":"PivotSheet!B230","v":1},"c",{"$error":"#N/A"},{"$error":"#N/A"},1,{"$error":"#N/A"},{"$error":"#N/A"},0.89913544668588252]
[{"$f":"PivotSheet!A231","v":441},{"$f":"PivotSheet!B231","v":1},"c",{"$error":"#N/A"},{"$error":"#N/A"},1,{"$error":"#N/A"},{"$error":"#N/A"},0.90201729106628603]
[{"$f":"PivotSheet!A232","v":447},{"$f":"PivotSheet!B232","v":1},"c",{"$error":"#N/A"},{"$error":"#N/A"},1,{"$error":"#N/A"},{"$error":"#N/A"},0.90489913544668954]
[{"$f":"PivotSheet!A233","v":449},{"$f":"PivotSheet!B233","v":1},"c",{"$error":"#N/A"},{"$error":"#N/A"},1,{"$error":"#N/A"},{"$error":"#N/A"},0.90778097982709305]
[{"$f":"PivotSheet!A234","v":453},{"$f":"PivotSheet!B234","v":3},"c",{"$error":"#N/A"},{"$error":"#N/A"},1,{"$error":"#N/A"},{"$error":"#N/A"},0.91642651296830346]
[{"$f":"PivotSheet!A235","v":455},{"$f":"PivotSheet!B235","v":1},"c",{"$error":"#N/A"},{"$error":"#N/A"},1,{"$error":"#N/A"},{"$error":"#N/A"},0.91930835734870697]
[{"$f":"PivotSheet!A236","v":459},{"$f":"PivotSheet!B236","v":2},"c",{"$error":"#N/A"},{"$error":"#N/A"},1,{"$error":"#N/A"},{"$error":"#N/A"},0.92507204610951388]
[{"$f":"PivotSheet!A237","v":460},{"$f":"PivotSheet!B237","v":1},"c",{"$error":"#N/A"},{"$error":"#N/A"},1,{"$error":"#N/A"},{"$error":"#N/A"},0.92795389048991739]
[{"$f":"PivotSheet!A238","v":461},{"$f":"PivotSheet!B238","v":1},"c",{"$error":"#N/A"},{"$error":"#N/A"},1,{"$error":"#N/A"},{"$error":"#N/A"},0.9308357348703209]
[{"$f":"PivotSheet!A239","v":466},{"$f":"PivotSheet!B239","v":1},"c",{"$error":"#N/A"},{"$error":"#N/A"},1,{"$error":"#N/A"},{"$error":"#N/A"},0.93371757925072441]
[{"$f":"PivotSheet!A240","v":467},{"$f":"PivotSheet!B240","v":1},"c",{"$error":"#N/A"},{"$error":"#N/A"},1,{"$error":"#N/A"},{"$error":"#N/A"},0.93659942363112791]
[{"$f":"PivotSheet!A241","v":469},{"$f":"PivotSheet!B241","v":2},"c",{"$error":"#N/A"},{"$error":"#N/A"},1,{"$error":"#N/A"},{"$error":"#N/A"},0.94236311239193482]
[{"$f":"PivotSheet!A242","v":475},{"$f":"PivotSheet!B242","v":1},"c",{"$error":"#N/A"},{"$error":"#N/A"},1,{"$error":"#N/A"},{"$error":"#N/A"},0.94524495677233833]
[{"$f":"PivotSheet!A243","v":476},{"$f":"PivotSheet!B243","v":3},"c",{"$error":"#N/A"},{"$error":"#N/A"},1,{"$error":"#N/A"},{"$error":"#N/A"},0.95389048991354874]
[{"$f":"PivotSheet!A244","v":480},{"$f":"PivotSheet!B244","v":1},"c",{"$error":"#N/A"},{"$error":"#N/A"},1,{"$error":"#N/A"},{"$error":"#N/A"},0.95677233429395225]
[{"$f":"PivotSheet!A245","v":483},{"$f":"PivotSheet!B245","v":1},"c",{"$error":"#N/A"},{"$error":"#N/A"},1,{"$error":"#N/A"},{"$error":"#N/A"},0.95965417867435576]
[{"$f":"PivotSheet!A246","v":484},{"$f":"PivotSheet!B246","v":1},"c",{"$error":"#N/A"},{"$error":"#N/A"},1,{"$error":"#N/A"},{"$error":"#N/A"},0.96253602305475927]
[{"$f":"PivotSheet!A247","v":485},{"$f":"PivotSheet!B247","v":1},"c",{"$error":"#N/A"},{"$error":"#N/A"},1,{"$error":"#N/A"},{"$error":"#N/A"},0.96541786743516278]
[{"$f":"PivotSheet!A248","v":487},{"$f":"PivotSheet!B248","v":1},"c",{"$error":"#N/A"},{"$error":"#N/A"},1,{"$error":"#N/A"},{"$error":"#N/A"},0.96829971181556629]
[{"$f":"PivotSheet!A249","v":488},{"$f":"PivotSheet!B249","v":3},"c",{"$error":"#N/A"},{"$error":"#N/A"},1,{"$error":"#N/A"},{"$error":"#N/A"},0.9769452449567767]
[{"$f":"PivotSheet!A250","v":489},{"$f":"PivotSheet!B250","v":2},"c",{"$error":"#N/A"},{"$error":"#N/A"},1,{"$error":"#N/A"},{"$error":"#N/A"},0.98270893371758361]
[{"$f":"PivotSheet!A251","v":490},{"$f":"PivotSheet!B251","v":1},"c",{"$error":"#N/A"},{"$error":"#N/A"},1,{"$error":"#N/A"},{"$error":"#N/A"},0.98559077809798712]
[{"$f":"PivotSheet!A252","v":494},{"$f":"PivotSheet!B252","v":1},"c",{"$error":"#N/A"},{"$error":"#N/A"},1,{"$error":"#N/A"},{"$error":"#N/A"},0.98847262247839063]
[{"$f":"PivotSheet!A253","v":496},{"$f":"PivotSheet!B253","v":1},"c",{"$error":"#N/A"},{"$error":"#N/A"},1,{"$error":"#N/A"},{"$error":"#N/A"},0.99135446685879414]
[{"$f":"PivotSheet!A254","v":497},{"$f":"PivotSheet!B254","v":1},"c",{"$error":"#N/A"},{"$error":"#N/A"},1,{"$error":"#N/A"},{"$error":"#N/A"},0.99423631123919765]
[{"$f":"PivotSheet!A255","v":498},{"$f":"PivotSheet!B255","v":2},"c",{"$error":"#N/A"},{"$error":"#N/A"},1,{"$error":"#N/A"},{"$error":"#N/A"},1.0000000000000047]
[{"$f":"PivotSheet!A256","v":"(blank)"},{"$f":"PivotSheet!B256","v":0},{"$error":"#N/A"},{"$error":"#N/A"},{"$error":"#N/A"},{"$error":"#N/A"},{"$error":"#N/A"},{"$error":"#N/A"},1.0000000000000047]
[{"$f":"PivotSheet!A257","v":0},{"$f":"PivotSheet!B257","v":0},"a",1,{"$error":"#N/A"},{"$error":"#N/A"},{"$error":"#N/A"},{"$error":"#N/A"},1.0000000000000047]
[{"$f":"PivotSheet!A258","v":0},{"$f":"PivotSheet!B258","v":0},"a",1,{"$error":"#N/A"},{"$error":"#N/A"},{"$error":"#N/A"},{"$error":"#N/A"},1.0000000000000047]
[{"$f":"PivotSheet!A259","v":0},{"$f":"PivotSheet!B259","v":0},{"$f":"IF(A259<=$V$4,\"a\",IF(A259<=$V$6,\"b\",IF(A259<=$V$8,\"c\",IF(A259<=$V$10,\"d\",IF(A259<=$V$12,\"e\",\"ERROR\")))))","v":"a"},{"$f":"IF(C259=\"a\",1,NA())","v":1},{"$f":"IF($C259=\"b\",1,NA())","v":{"$error":"#N/A"}},{"$f":"IF($C259=\"c\",1,NA())","v":{"$error":"#N/A"}},{"$f":"IF($C259=\"d\",1,NA())","v":{"$error":"#N/A"}},{"$f":"IF($C259=\"e\",1,NA())","v":{"$error":"#N/A"}},1.0000000000000047]
[{"$f":"PivotSheet!A260","v":0},{"$f":"PivotSheet!B260","v":0},"a",1,{"$error":"#N/A"},{"$error":"#N/A"},{"$error":"#N/A"},{"$error":"#N/A"},{"$f":"B260/SUM($B$2:$B$10000)+I259","v":1.0000000000000047}]
[{"$f":"PivotSheet!A261","v":0},{"$f":"PivotSheet!B261","v":0},"a",1,{"$error":"#N/A"},{"$error":"#N/A"},{"$error":"#N/A"},{"$error":"#N/A"},1.0000000000000047]
[{"$f":"PivotSheet!A262","v":0},{"$f":"PivotSheet!B262","v":0},"a",1,{"$error":"#N/A"},{"$error":"#N/A"},{"$error":"#N/A"},{"$error":"#N/A"},1.0000000000000047]
[{"$f":"PivotSheet!A263","v":0},{"$f":"PivotSheet!B263","v":0},"a",1,{"$error":"#N/A"},{"$error":"#N/A"},{"$error":"#N/A"},{"$error":"#N/A"},1.0000000000000047]
[{"$f":"PivotSheet!A264","v":0},{"$f":"PivotSheet!B264","v":0},"a",1,{"$error":"#N/A"},{"$error":"#N/A"},{"$error":"#N/A"},{"$error":"#N/A"},1.0000000000000047]
[{"$f":"PivotSheet!A265","v":0},{"$f":"PivotSheet!B265","v":0},"a",1,{"$error":"#N/A"},{"$error":"#N/A"},{"$error":"#N/A"},{"$error":"#N/A"},1.0000000000000047]
[{"$f":"PivotSheet!A266","v":0},{"$f":"PivotSheet!B266","v":0},"a",1,{"$error":"#N/A"},{"$error":"#N/A"},{"$error":"#N/A"},{"$error":"#N/A"},1.0000000000000047]
[{"$f":"PivotSheet!A267","v":0},{"$f":"PivotSheet!B267","v":0},"a",1,{"$error":"#N/A"},{"$error":"#N/A"},{"$error":"#N/A"},{"$error":"#N/A"},1.0000000000000047]
[{"$f":"PivotSheet!A268","v":0},{"$f":"PivotSheet!B268","v":0},"a",1,{"$error":"#N/A"},{"$error":"#N/A"},{"$error":"#N/A"},{"$error":"#N/A"},1.0000000000000047]
[{"$f":"PivotSheet!A269","v":0},{"$f":"PivotSheet!B269","v":0},"a",1,{"$error":"#N/A"},{"$error":"#N/A"},{"$error":"#N/A"},{"$error":"#N/A"},1.0000000000000047]
[{"$f":"PivotSheet!A270","v":0},{"$f":"PivotSheet!B270","v":0},"a",1,{"$error":"#N/A"},{"$error":"#N/A"},{"$error":"#N/A"},{"$error":"#N/A"},1.0000000000000047]
[{"$f":"PivotSheet!A271","v":0},{"$f":"PivotSheet!B271","v":0},"a",1,{"$error":"#N/A"},{"$error":"#N/A"},{"$error":"#N/A"},{"$error":"#N/A"},1.0000000000000047]
[{"$f":"PivotSheet!A272","v":0},{"$f":"PivotSheet!B272","v":0},"a",1,{"$error":"#N/A"},{"$error":"#N/A"},{"$error":"#N/A"},{"$error":"#N/A"},1.0000000000000047]
[{"$f":"PivotSheet!A273","v":0},{"$f":"PivotSheet!B273","v":0},"a",1,{"$error":"#N/A"},{"$error":"#N/A"},{"$error":"#N/A"},{"$error":"#N/A"},1.0000000000000047]
[{"$f":"PivotSheet!A274","v":0},{"$f":"PivotSheet!B274","v":0},"a",1,{"$error":"#N/A"},{"$error":"#N/A"},{"$error":"#N/A"},{"$error":"#N/A"},1.0000000000000047]
[{"$f":"PivotSheet!A275","v":0},{"$f":"PivotSheet!B275","v":0},"a",1,{"$error":"#N/A"},{"$error":"#N/A"},{"$error":"#N/A"},{"$error":"#N/A"},1.0000000000000047]
[{"$f":"PivotSheet!A276","v":0},{"$f":"PivotSheet!B276","v":0},"a",1,{"$error":"#N/A"},{"$error":"#N/A"},{"$error":"#N/A"},{"$error":"#N/A"},1.0000000000000047]
[{"$f":"PivotSheet!A277","v":0},{"$f":"PivotSheet!B277","v":0},"a",1,{"$error":"#N/A"},{"$error":"#N/A"},{"$error":"#N/A"},{"$error":"#N/A"},1.0000000000000047]
[{"$f":"PivotSheet!A278","v":0},{"$f":"PivotSheet!B278","v":0},"a",1,{"$error":"#N/A"},{"$error":"#N/A"},{"$error":"#N/A"},{"$error":"#N/A"},1.0000000000000047]
[{"$f":"PivotSheet!A279","v":0},{"$f":"PivotSheet!B279","v":0},"a",1,{"$error":"#N/A"},{"$error":"#N/A"},{"$error":"#N/A"},{"$error":"#N/A"},1.0000000000000047]
[{"$f":"PivotSheet!A280","v":0},{"$f":"PivotSheet!B280","v":0},"a",1,{"$error":"#N/A"},{"$error":"#N/A"},{"$error":"#N/A"},{"$error":"#N/A"},1.0000000000000047]
[{"$f":"PivotSheet!A281","v":0},{"$f":"PivotSheet!B281","v":0},"a",1,{"$error":"#N/A"},{"$error":"#N/A"},{"$error":"#N/A"},{"$error":"#N/A"},1.0000000000000047]
[{"$f":"PivotSheet!A282","v":0},{"$f":"PivotSheet!B282","v":0},"a",1,{"$error":"#N/A"},{"$error":"#N/A"},{"$error":"#N/A"},{"$error":"#N/A"},1.0000000000000047]
[{"$f":"PivotSheet!A283","v":0},{"$f":"PivotSheet!B283","v":0},"a",1,{"$error":"#N/A"},{"$error":"#N/A"},{"$error":"#N/A"},{"$error":"#N/A"},1.0000000000000047]
[{"$f":"PivotSheet!A284","v":0},{"$f":"PivotSheet!B284","v":0},"a",1,{"$error":"#N/A"},{"$error":"#N/A"},{"$error":"#N/A"},{"$error":"#N/A"},1.0000000000000047]
[{"$f":"PivotSheet!A285","v":0},{"$f":"PivotSheet!B285","v":0},"a",1,{"$error":"#N/A"},{"$error":"#N/A"},{"$error":"#N/A"},{"$error":"#N/A"},1.0000000000000047]
[{"$f":"PivotSheet!A286","v":0},{"$f":"PivotSheet!B286","v":0},"a",1,{"$error":"#N/A"},{"$error":"#N/A"},{"$error":"#N/A"},{"$error":"#N/A"},1.0000000000000047]
[{"$f":"PivotSheet!A287","v":0},{"$f":"PivotSheet!B287","v":0},"a",1,{"$error":"#N/A"},{"$error":"#N/A"},{"$error":"#N/A"},{"$error":"#N/A"},1.0000000000000047]
[{"$f":"PivotSheet!A288","v":0},{"$f":"PivotSheet!B288","v":0},"a",1,{"$error":"#N/A"},{"$error":"#N/A"},{"$error":"#N/A"},{"$error":"#N/A"},1.0000000000000047]
[{"$f":"PivotSheet!A289","v":0},{"$f":"PivotSheet!B289","v":0},"a",1,{"$error":"#N/A"},{"$error":"#N/A"},{"$error":"#N/A"},{"$error":"#N/A"},1.0000000000000047]
[{"$f":"PivotSheet!A290","v":0},{"$f":"PivotSheet!B290","v":0},"a",1,{"$error":"#N/A"},{"$error":"#N/A"},{"$error":"#N/A"},{"$error":"#N/A"},1.0000000000000047]
[{"$f":"PivotSheet!A291","v":0},{"$f":"PivotSheet!B291","v":0},"a",1,{"$error":"#N/A"},{"$error":"#N/A"},{"$error":"#N/A"},{"$error":"#N/A"},1.0000000000000047]
[{"$f":"PivotSheet!A292","v":0},{"$f":"PivotSheet!B292","v":0},"a",1,{"$error":"#N/A"},{"$error":"#N/A"},{"$error":"#N/A"},{"$error":"#N/A"},1.0000000000000047]
[{"$f":"PivotSheet!A293","v":0},{"$f":"PivotSheet!B293","v":0},"a",1,{"$error":"#N/A"},{"$error":"#N/A"},{"$error":"#N/A"},{"$error":"#N/A"},1.0000000000000047]
[{"$f":"PivotSheet!A294","v":0},{"$f":"PivotSheet!B294","v":0},"a",1,{"$error":"#N/A"},{"$error":"#N/A"},{"$error":"#N/A"},{"$error":"#N/A"},1.0000000000000047]
[{"$f":"PivotSheet!A295","v":0},{"$f":"PivotSheet!B295","v":0},"a",1,{"$error":"#N/A"},{"$error":"#N/A"},{"$error":"#N/A"},{"$error":"#N/A"},1.0000000000000047]
[{"$f":"PivotSheet!A296","v":0},{"$f":"PivotSheet!B296","v":0},"a",1,{"$error":"#N/A"},{"$error":"#N/A"},{"$error":"#N/A"},{"$error":"#N/A"},1.0000000000000047]
[{"$f":"PivotSheet!A297","v":0},{"$f":"PivotSheet!B297","v":0},"a",1,{"$error":"#N/A"},{"$error":"#N/A"},{"$error":"#N/A"},{"$error":"#N/A"},1.0000000000000047]
[{"$f":"PivotSheet!A298","v":0},{"$f":"PivotSheet!B298","v":0},"a",1,{"$error":"#N/A"},{"$error":"#N/A"},{"$error":"#N/A"},{"$error":"#N/A"},1.0000000000000047]
[{"$f":"PivotSheet!A299","v":0},{"$f":"PivotSheet!B299","v":0},"a",1,{"$error":"#N/A"},{"$error":"#N/A"},{"$error":"#N/A"},{"$error":"#N/A"},1.0000000000000047]
[{"$f":"PivotSheet!A300","v":0},{"$f":"PivotSheet!B300","v":0},"a",1,{"$error":"#N/A"},{"$error":"#N/A"},{"$error":"#N/A"},{"$error":"#N/A"},1.0000000000000047]
[{"$f":"PivotSheet!A301","v":0},{"$f":"PivotSheet!B301","v":0},"a",1,{"$error":"#N/A"},{"$error":"#N/A"},{"$error":"#N/A"},{"$error":"#N/A"},1.0000000000000047]
[{"$f":"PivotSheet!A302","v":0},{"$f":"PivotSheet!B302","v":0},"a",1,{"$error":"#N/A"},{"$error":"#N/A"},{"$error":"#N/A"},{"$error":"#N/A"},1.0000000000000047]
[{"$f":"PivotSheet!A303","v":0},{"$f":"PivotSheet!B303","v":0},"a",1,{"$error":"#N/A"},{"$error":"#N/A"},{"$error":"#N/A"},{"$error":"#N/A"},1.0000000000000047]
[{"$f":"PivotSheet!A304","v":0},{"$f":"PivotSheet!B304","v":0},"a",1,{"$error":"#N/A"},{"$error":"#N/A"},{"$error":"#N/A"},{"$error":"#N/A"},1.0000000000000047]
[{"$f":"PivotSheet!A305","v":0},{"$f":"PivotSheet!B305","v":0},"a",1,{"$error":"#N/A"},{"$error":"#N/A"},{"$error":"#N/A"},{"$error":"#N/A"},1.0000000000000047]
[{"$f":"PivotSheet!A306","v":0},{"$f":"PivotSheet!B306","v":0},"a",1,{"$error":"#N/A"},{"$error":"#N/A"},{"$error":"#N/A"},{"$error":"#N/A"},1.0000000000000047]
[{"$f":"PivotSheet!A307","v":0},{"$f":"PivotSheet!B307","v":0},"a",1,{"$error":"#N/A"},{"$error":"#N/A"},{"$error":"#N/A"},{"$error":"#N/A"},1.0000000000000047]
[{"$f":"PivotSheet!A308","v":0},{"$f":"PivotSheet!B308","v":0},"a",1,{"$error":"#N/A"},{"$error":"#N/A"},{"$error":"#N/A"},{"$error":"#N/A"},1.0000000000000047]
[{"$f":"PivotSheet!A309","v":0},{"$f":"PivotSheet!B309","v":0},"a",1,{"$error":"#N/A"},{"$error":"#N/A"},{"$error":"#N/A"},{"$error":"#N/A"},1.0000000000000047]
[{"$f":"PivotSheet!A310","v":0},{"$f":"PivotSheet!B310","v":0},"a",1,{"$error":"#N/A"},{"$error":"#N/A"},{"$error":"#N/A"},{"$error":"#N/A"},1.0000000000000047]
[{"$f":"PivotSheet!A311","v":0},{"$f":"PivotSheet!B311","v":0},"a",1,{"$error":"#N/A"},{"$error":"#N/A"},{"$error":"#N/A"},{"$error":"#N/A"},1.0000000000000047]
[{"$f":"PivotSheet!A312","v":0},{"$f":"PivotSheet!B312","v":0},"a",1,{"$error":"#N/A"},{"$error":"#N/A"},{"$error":"#N/A"},{"$error":"#N/A"},1.0000000000000047]
[{"$f":"PivotSheet!A313","v":0},{"$f":"PivotSheet!B313","v":0},"a",1,{"$error":"#N/A"},{"$error":"#N/A"},{"$error":"#N/A"},{"$error":"#N/A"},1.0000000000000047]
[{"$f":"PivotSheet!A314","v":0},{"$f":"PivotSheet!B314","v":0},"a",1,{"$error":"#N/A"},{"$error":"#N/A"},{"$error":"#N/A"},{"$error":"#N/A"},1.0000000000000047]
[{"$f":"PivotSheet!A315","v":0},{"$f":"PivotSheet!B315","v":0},"a",1,{"$error":"#N/A"},{"$error":"#N/A"},{"$error":"#N/A"},{"$error":"#N/A"},1.0000000000000047]
[{"$f":"PivotSheet!A316","v":0},{"$f":"PivotSheet!B316","v":0},"a",1,{"$error":"#N/A"},{"$error":"#N/A"},{"$error":"#N/A"},{"$error":"#N/A"},1.0000000000000047]
[{"$f":"PivotSheet!A317","v":0},{"$f":"PivotSheet!B317","v":0},"a",1,{"$error":"#N/A"},{"$error":"#N/A"},{"$error":"#N/A"},{"$error":"#N/A"},1.0000000000000047]
[{"$f":"PivotSheet!A318","v":0},{"$f":"PivotSheet!B318","v":0},"a",1,{"$error":"#N/A"},{"$error":"#N/A"},{"$error":"#N/A"},{"$error":"#N/A"},1.0000000000000047]
[{"$f":"PivotSheet!A319","v":0},{"$f":"PivotSheet!B319","v":0},"a",1,{"$error":"#N/A"},{"$error":"#N/A"},{"$error":"#N/A"},{"$error":"#N/A"},1.0000000000000047]
[{"$f":"PivotSheet!A320","v":0},{"$f":"PivotSheet!B320","v":0},"a",1,{"$error":"#N/A"},{"$error":"#N/A"},{"$error":"#N/A"},{"$error":"#N/A"},1.0000000000000047]
[{"$f":"PivotSheet!A321","v":0},{"$f":"PivotSheet!B321","v":0},"a",1,{"$error":"#N/A"},{"$error":"#N/A"},{"$error":"#N/A"},{"$error":"#N/A"},1.0000000000000047]
[{"$f":"PivotSheet!A322","v":0},{"$f":"PivotSheet!B322","v":0},"a",1,{"$error":"#N/A"},{"$error":"#N/A"},{"$error":"#N/A"},{"$error":"#N/A"},1.0000000000000047]
[{"$f":"PivotSheet!A323","v":0},{"$f":"PivotSheet!B323","v":0},{"$f":"IF(A323<=$V$4,\"a\",IF(A323<=$V$6,\"b\",IF(A323<=$V$8,\"c\",IF(A323<=$V$10,\"d\",IF(A323<=$V$12,\"e\",\"ERROR\")))))","v":"a"},{"$f":"IF(C323=\"a\",1,NA())","v":1},{"$f":"IF($C323=\"b\",1,NA())","v":{"$error":"#N/A"}},{"$f":"IF($C323=\"c\",1,NA())","v":{"$error":"#N/A"}},{"$f":"IF($C323=\"d\",1,NA())","v":{"$error":"#N/A"}},{"$f":"IF($C323=\"e\",1,NA())","v":{"$error":"#N/A"}},1.0000000000000047]
[{"$f":"PivotSheet!A324","v":0},{"$f":"PivotSheet!B324","v":0},"a",1,{"$error":"#N/A"},{"$error":"#N/A"},{"$error":"#N/A"},{"$error":"#N/A"},{"$f":"B324/SUM($B$2:$B$10000)+I323","v":1.0000000000000047}]
[{"$f":"PivotSheet!A325","v":0},{"$f":"PivotSheet!B325","v":0},"a",1,{"$error":"#N/A"},{"$error":"#N/A"},{"$error":"#N/A"},{"$error":"#N/A"},1.0000000000000047]
[{"$f":"PivotSheet!A326","v":0},{"$f":"PivotSheet!B326","v":0},"a",1,{"$error":"#N/A"},{"$error":"#N/A"},{"$error":"#N/A"},{"$error":"#N/A"},1.0000000000000047]
[{"$f":"PivotSheet!A327","v":0},{"$f":"PivotSheet!B327","v":0},"a",1,{"$error":"#N/A"},{"$error":"#N/A"},{"$error":"#N/A"},{"$error":"#N/A"},1.0000000000000047]
[{"$f":"PivotSheet!A328","v":0},{"$f":"PivotSheet!B328","v":0},"a",1,{"$error":"#N/A"},{"$error":"#N/A"},{"$error":"#N/A"},{"$error":"#N/A"},1.0000000000000047]
[{"$f":"PivotSheet!A329","v":0},{"$f":"PivotSheet!B329","v":0},"a",1,{"$error":"#N/A"},{"$error":"#N/A"},{"$error":"#N/A"},{"$error":"#N/A"},1.0000000000000047]
[{"$f":"PivotSheet!A330","v":0},{"$f":"PivotSheet!B330","v":0},"a",1,{"$error":"#N/A"},{"$error":"#N/A"},{"$error":"#N/A"},{"$error":"#N/A"},1.0000000000000047]
[{"$f":"PivotSheet!A331","v":0},{"$f":"PivotSheet!B331","v":0},"a",1,{"$error":"#N/A"},{"$error":"#N/A"},{"$error":"#N/A"},{"$error":"#N/A"},1.0000000000000047]
[{"$f":"PivotSheet!A332","v":0},{"$f":"PivotSheet!B332","v":0},"a",1,{"$error":"#N/A"},{"$error":"#N/A"},{"$error":"#N/A"},{"$error":"#N/A"},1.0000000000000047]
[{"$f":"PivotSheet!A333","v":0},{"$f":"PivotSheet!B333","v":0},"a",1,{"$error":"#N/A"},{"$error":"#N/A"},{"$error":"#N/A"},{"$error":"#N/A"},1.0000000000000047]
[{"$f":"PivotSheet!A334","v":0},{"$f":"PivotSheet!B334","v":0},"a",1,{"$error":"#N/A"},{"$error":"#N/A"},{"$error":"#N/A"},{"$error":"#N/A"},1.0000000000000047]
[{"$f":"PivotSheet!A335","v":0},{"$f":"PivotSheet!B335","v":0},"a",1,{"$error":"#N/A"},{"$error":"#N/A"},{"$error":"#N/A"},{"$error":"#N/A"},1.0000000000000047]
[{"$f":"PivotSheet!A336","v":0},{"$f":"PivotSheet!B336","v":0},"a",1,{"$error":"#N/A"},{"$error":"#N/A"},{"$error":"#N/A"},{"$error":"#N/A"},1.0000000000000047]
[{"$f":"PivotSheet!A337","v":0},{"$f":"PivotSheet!B337","v":0},"a",1,{"$error":"#N/A"},{"$error":"#N/A"},{"$error":"#N/A"},{"$error":"#N/A"},1.0000000000000047]
[{"$f":"PivotSheet!A338","v":0},{"$f":"PivotSheet!B338","v":0},"a",1,{"$error":"#N/A"},{"$error":"#N/A"},{"$error":"#N/A"},{"$error":"#N/A"},1.0000000000000047]
[{"$f":"PivotSheet!A339","v":0},{"$f":"PivotSheet!B339","v":0},"a",1,{"$error":"#N/A"},{"$error":"#N/A"},{"$error":"#N/A"},{"$error":"#N/A"},1.0000000000000047]
[{"$f":"PivotSheet!A340","v":0},{"$f":"PivotSheet!B340","v":0},"a",1,{"$error":"#N/A"},{"$error":"#N/A"},{"$error":"#N/A"},{"$error":"#N/A"},1.0000000000000047]
[{"$f":"PivotSheet!A341","v":0},{"$f":"PivotSheet!B341","v":0},{"$f":"IF(A341<=$V$4,\"a\",IF(A341<=$V$6,\"b\",IF(A341<=$V$8,\"c\",IF(A341<=$V$10,\"d\",IF(A341<=$V$12,\"e\",\"ERROR\")))))","v":"a"},1,{"$error":"#N/A"},{"$error":"#N/A"},{"$error":"#N/A"},{"$error":"#N/A"},1.0000000000000047]
[{"$f":"PivotSheet!A342","v":0},{"$f":"PivotSheet!B342","v":0},"a",1,{"$error":"#N/A"},{"$error":"#N/A"},{"$error":"#N/A"},{"$error":"#N/A"},1.0000000000000047]
[{"$f":"PivotSheet!A343","v":0},{"$f":"PivotSheet!B343","v":0},"a",1,{"$error":"#N/A"},{"$error":"#N/A"},{"$error":"#N/A"},{"$error":"#N/A"},1.0000000000000047]
[{"$f":"PivotSheet!A344","v":0},{"$f":"PivotSheet!B344","v":0},"a",1,{"$error":"#N/A"},{"$error":"#N/A"},{"$error":"#N/A"},{"$error":"#N/A"},1.0000000000000047]
[{"$f":"PivotSheet!A345","v":0},{"$f":"PivotSheet!B345","v":0},"a",1,{"$error":"#N/A"},{"$error":"#N/A"},{"$error":"#N/A"},{"$error":"#N/A"},1.0000000000000047]
[{"$f":"PivotSheet!A346","v":0},{"$f":"PivotSheet!B346","v":0},"a",1,{"$error":"#N/A"},{"$error":"#N/A"},{"$error":"#N/A"},{"$error":"#N/A"},1.0000000000000047]
[{"$f":"PivotSheet!A347","v":0},{"$f":"PivotSheet!B347","v":0},"a",1,{"$error":"#N/A"},{"$error":"#N/A"},{"$error":"#N/A"},{"$error":"#N/A"},1.0000000000000047]
[{"$f":"PivotSheet!A348","v":0},{"$f":"PivotSheet!B348","v":0},"a",1,{"$error":"#N/A"},{"$error":"#N/A"},{"$error":"#N/A"},{"$error":"#N/A"},1.0000000000000047]
[{"$f":"PivotSheet!A349","v":0},{"$f":"PivotSheet!B349","v":0},"a",1,{"$error":"#N/A"},{"$error":"#N/A"},{"$error":"#N/A"},{"$error":"#N/A"},1.0000000000000047]
[{"$f":"PivotSheet!A350","v":0},{"$f":"PivotSheet!B350","v":0},"a",1,{"$error":"#N/A"},{"$error":"#N/A"},{"$error":"#N/A"},{"$error":"#N/A"},1.0000000000000047]
[{"$f":"PivotSheet!A351","v":0},{"$f":"PivotSheet!B351","v":0},"a",1,{"$error":"#N/A"},{"$error":"#N/A"},{"$error":"#N/A"},{"$error":"#N/A"},1.0000000000000047]
[{"$f":"PivotSheet!A352","v":0},{"$f":"PivotSheet!B352","v":0},"a",1,{"$error":"#N/A"},{"$error":"#N/A"},{"$error":"#N/A"},{"$error":"#N/A"},1.0000000000000047]
[{"$f":"PivotSheet!A353","v":0},{"$f":"PivotSheet!B353","v":0},"a",1,{"$error":"#N/A"},{"$error":"#N/A"},{"$error":"#N/A"},{"$error":"#N/A"},1.0000000000000047]
[{"$f":"PivotSheet!A354","v":0},{"$f":"PivotSheet!B354","v":0},"a",1,{"$error":"#N/A"},{"$error":"#N/A"},{"$error":"#N/A"},{"$error":"#N/A"},1.0000000000000047]
[{"$f":"PivotSheet!A355","v":0},{"$f":"PivotSheet!B355","v":0},"a",1,{"$error":"#N/A"},{"$error":"#N/A"},{"$error":"#N/A"},{"$error":"#N/A"},1.0000000000000047]
[{"$f":"PivotSheet!A356","v":0},{"$f":"PivotSheet!B356","v":0},"a",1,{"$error":"#N/A"},{"$error":"#N/A"},{"$error":"#N/A"},{"$error":"#N/A"},1.0000000000000047]
[{"$f":"PivotSheet!A357","v":0},{"$f":"PivotSheet!B357","v":0},"a",1,{"$error":"#N/A"},{"$error":"#N/A"},{"$error":"#N/A"},{"$error":"#N/A"},1.0000000000000047]
[{"$f":"PivotSheet!A358","v":0},{"$f":"PivotSheet!B358","v":0},"a",1,{"$error":"#N/A"},{"$error":"#N/A"},{"$error":"#N/A"},{"$error":"#N/A"},1.0000000000000047]
[{"$f":"PivotSheet!A359","v":0},{"$f":"PivotSheet!B359","v":0},"a",1,{"$error":"#N/A"},{"$error":"#N/A"},{"$error":"#N/A"},{"$error":"#N/A"},1.0000000000000047]
[{"$f":"PivotSheet!A360","v":0},{"$f":"PivotSheet!B360","v":0},"a",1,{"$error":"#N/A"},{"$error":"#N/A"},{"$error":"#N/A"},{"$error":"#N/A"},1.0000000000000047]
[{"$f":"PivotSheet!A361","v":0},{"$f":"PivotSheet!B361","v":0},"a",1,{"$error":"#N/A"},{"$error":"#N/A"},{"$error":"#N/A"},{"$error":"#N/A"},1.0000000000000047]
[{"$f":"PivotSheet!A362","v":0},{"$f":"PivotSheet!B362","v":0},"a",1,{"$error":"#N/A"},{"$error":"#N/A"},{"$error":"#N/A"},{"$error":"#N/A"},1.0000000000000047]
[{"$f":"PivotSheet!A363","v":0},{"$f":"PivotSheet!B363","v":0},"a",1,{"$error":"#N/A"},{"$error":"#N/A"},{"$error":"#N/A"},{"$error":"#N/A"},1.0000000000000047]
[{"$f":"PivotSheet!A364","v":0},{"$f":"PivotSheet!B364","v":0},"a",1,{"$error":"#N/A"},{"$error":"#N/A"},{"$error":"#N/A"},{"$error":"#N/A"},1.0000000000000047]

{"sheet":"Equal Interval","index":7,"n_rows":365,"n_cols":22,"rows_kept":365,"cut":false,"hidden":true,"merged":[]}
["Data","Frequency","Group","Group 1","Group 2","Group 3","Group 4","Group 5","Cum. Freq"]
[{"$f":"PivotSheet!A2","v":2},{"$f":"PivotSheet!B2","v":1},{"$f":"IF(A2<=$V$4,\"a\",IF(A2<=$V$6,\"b\",IF(A2<=$V$8,\"c\",IF(A2<=$V$10,\"d\",IF(A2<=$V$12,\"e\",\"ERROR\")))))","v":"a"},{"$f":"IF($C2=\"a\",1,NA())","v":1},{"$f":"IF($C2=\"b\",1,NA())","v":{"$error":"#N/A"}},{"$f":"IF($C2=\"c\",1,NA())","v":{"$error":"#N/A"}},{"$f":"IF($C2=\"d\",1,NA())","v":{"$error":"#N/A"}},{"$f":"IF($C2=\"e\",1,NA())","v":{"$error":"#N/A"}},{"$f":"B2/SUM($B$2:$B$1000)","v":2.881844380403458E-3},"2 levels of Intensity",null,null,null,null,null,null,null,null,null,"Group",null,"Equal Interval"]
[{"$f":"PivotSheet!A3","v":3},{"$f":"PivotSheet!B3","v":2},{"$f":"IF(A3<=$V$4,\"a\",IF(A3<=$V$6,\"b\",IF(A3<=$V$8,\"c\",IF(A3<=$V$10,\"d\",IF(A3<=$V$12,\"e\",\"ERROR\")))))","v":"a"},{"$f":"IF($C3=\"a\",1,NA())","v":1},{"$f":"IF($C3=\"b\",1,NA())","v":{"$error":"#N/A"}},{"$f":"IF($C3=\"c\",1,NA())","v":{"$error":"#N/A"}},{"$f":"IF($C3=\"d\",1,NA())","v":{"$error":"#N/A"}},{"$f":"IF($C3=\"e\",1,NA())","v":{"$error":"#N/A"}},{"$f":"B3/SUM($B$2:$B$1000)+I2","v":8.6455331412103736E-3},null,"Min Value","Max Value",null,null,null,null,null,null,null,"a","Min Value",{"$f":"INDEX('Equal Interval'!$K$4:$L$26,MATCH(1,(Data!$F$2='Equal Interval'!$M$4:$M$26)*(T3='Equal Interval'!$N$4:$N$26),0),MATCH(U3,'Equal Interval'!$K$3:$L$3,0))","v":2}]
[{"$f":"PivotSheet!A4","v":4},{"$f":"PivotSheet!B4","v":1},"a",1,{"$error":"#N/A"},{"$error":"#N/A"},{"$error":"#N/A"},{"$error":"#N/A"},{"$f":"B4/SUM($B$2:$B$1000)+I3","v":1.1527377521613832E-2},"A-Size",{"$f":"MIN([0]!Data_Plot)","v":2},{"$f":"K4+ (L5 - K4)/2","v":250},2,"a",null,null,null,null,null,"a","Max Value",{"$f":"INDEX('Equal Interval'!$K$4:$L$26,MATCH(1,(Data!$F$2='Equal Interval'!$M$4:$M$26)*(T4='Equal Interval'!$N$4:$N$26),0),MATCH(U4,'Equal Interval'!$K$3:$L$3,0))","v":167.33333333333334}]
[{"$f":"PivotSheet!A5","v":5},{"$f":"PivotSheet!B5","v":1},"a",1,{"$error":"#N/A"},{"$error":"#N/A"},{"$error":"#N/A"},{"$error":"#N/A"},1.4409221902017291E-2,"B-Size",{"$f":"$L$4+1","v":251},{"$f":"MAX([0]!Data_Plot)","v":498},2,"b",null,null,null,null,null,"b","Min Value",{"$f":"INDEX('Equal Interval'!$K$4:$L$26,MATCH(1,(Data!$F$2='Equal Interval'!$M$4:$M$26)*(T5='Equal Interval'!$N$4:$N$26),0),MATCH(U5,'Equal Interval'!$K$3:$L$3,0))","v":168.33333333333334}]
[{"$f":"PivotSheet!A6","v":6},{"$f":"PivotSheet!B6","v":1},"a",1,{"$error":"#N/A"},{"$error":"#N/A"},{"$error":"#N/A"},{"$error":"#N/A"},1.7291066282420747E-2,null,null,null,null,null,null,null,null,null,null,"b","Max Value",{"$f":"INDEX('Equal Interval'!$K$4:$L$26,MATCH(1,(Data!$F$2='Equal Interval'!$M$4:$M$26)*(T6='Equal Interval'!$N$4:$N$26),0),MATCH(U6,'Equal Interval'!$K$3:$L$3,0))","v":332.66666666666669}]
[{"$f":"PivotSheet!A7","v":10},{"$f":"PivotSheet!B7","v":2},"a",1,{"$error":"#N/A"},{"$error":"#N/A"},{"$error":"#N/A"},{"$error":"#N/A"},2.3054755043227664E-2,"3 Levels of Intensity",null,null,null,null,null,null,null,null,null,"c","Min Value",{"$f":"INDEX('Equal Interval'!$K$4:$L$26,MATCH(1,(Data!$F$2='Equal Interval'!$M$4:$M$26)*(T7='Equal Interval'!$N$4:$N$26),0),MATCH(U7,'Equal Interval'!$K$3:$L$3,0))","v":333.66666666666669}]
[{"$f":"PivotSheet!A8","v":11},{"$f":"PivotSheet!B8","v":1},"a",1,{"$error":"#N/A"},{"$error":"#N/A"},{"$error":"#N/A"},{"$error":"#N/A"},2.5936599423631121E-2,null,null,null,null,null,null,null,null,null,null,"c","Max Value",{"$f":"INDEX('Equal Interval'!$K$4:$L$26,MATCH(1,(Data!$F$2='Equal Interval'!$M$4:$M$26)*(T8='Equal Interval'!$N$4:$N$26),0),MATCH(U8,'Equal Interval'!$K$3:$L$3,0))","v":498}]
[{"$f":"PivotSheet!A9","v":12},{"$f":"PivotSheet!B9","v":1},"a",1,{"$error":"#N/A"},{"$error":"#N/A"},{"$error":"#N/A"},{"$error":"#N/A"},2.8818443804034578E-2,"A-Size",{"$f":"MIN([0]!Data_Plot)","v":2},{"$f":"K9+ (L11 - K9)/3","v":167.33333333333334},3,"a",null,null,null,null,null,"d","Min Value",{"$f":"INDEX('Equal Interval'!$K$4:$L$26,MATCH(1,(Data!$F$2='Equal Interval'!$M$4:$M$26)*(T9='Equal Interval'!$N$4:$N$26),0),MATCH(U9,'Equal Interval'!$K$3:$L$3,0))","v":{"$error":"#N/A"}}]
[{"$f":"PivotSheet!A10","v":14},{"$f":"PivotSheet!B10","v":1},"a",1,{"$error":"#N/A"},{"$error":"#N/A"},{"$error":"#N/A"},{"$error":"#N/A"},3.1700288184438034E-2,"B-Size",{"$f":"$L$9+1","v":168.33333333333334},{"$f":"K9+2* (L11 - K9)/3","v":332.66666666666669},3,"b",null,null,null,null,null,"d","Max Value",{"$f":"INDEX('Equal Interval'!$K$4:$L$26,MATCH(1,(Data!$F$2='Equal Interval'!$M$4:$M$26)*(T10='Equal Interval'!$N$4:$N$26),0),MATCH(U10,'Equal Interval'!$K$3:$L$3,0))","v":{"$error":"#N/A"}}]
[{"$f":"PivotSheet!A11","v":15},{"$f":"PivotSheet!B11","v":1},"a",1,{"$error":"#N/A"},{"$error":"#N/A"},{"$error":"#N/A"},{"$error":"#N/A"},3.4582132564841495E-2,"C-Size",{"$f":"$L$10+1","v":333.66666666666669},{"$f":"MAX([0]!Data_Plot)","v":498},3,"c",null,null,null,null,null,"e","Min Value",{"$f":"INDEX('Equal Interval'!$K$4:$L$26,MATCH(1,(Data!$F$2='Equal Interval'!$M$4:$M$26)*(T11='Equal Interval'!$N$4:$N$26),0),MATCH(U11,'Equal Interval'!$K$3:$L$3,0))","v":{"$error":"#N/A"}}]
[{"$f":"PivotSheet!A12","v":17},{"$f":"PivotSheet!B12","v":1},"a",1,{"$error":"#N/A"},{"$error":"#N/A"},{"$error":"#N/A"},{"$error":"#N/A"},3.7463976945244955E-2,null,null,null,null,null,null,null,null,null,null,"e","Max Value",{"$f":"INDEX('Equal Interval'!$K$4:$L$26,MATCH(1,(Data!$F$2='Equal Interval'!$M$4:$M$26)*(T12='Equal Interval'!$N$4:$N$26),0),MATCH(U12,'Equal Interval'!$K$3:$L$3,0))","v":{"$error":"#N/A"}}]
[{"$f":"PivotSheet!A13","v":21},{"$f":"PivotSheet!B13","v":1},"a",1,{"$error":"#N/A"},{"$error":"#N/A"},{"$error":"#N/A"},{"$error":"#N/A"},4.0345821325648415E-2,"4 Levels of Intensity"]
[{"$f":"PivotSheet!A14","v":22},{"$f":"PivotSheet!B14","v":1},"a",1,{"$error":"#N/A"},{"$error":"#N/A"},{"$error":"#N/A"},{"$error":"#N/A"},4.3227665706051875E-2]
[{"$f":"PivotSheet!A15","v":25},{"$f":"PivotSheet!B15","v":1},"a",1,{"$error":"#N/A"},{"$error":"#N/A"},{"$error":"#N/A"},{"$error":"#N/A"},4.6109510086455335E-2,"A-Size",{"$f":"MIN([0]!Data_Plot)","v":2},{"$f":"K15+ (L18 - K15)/4","v":126},4,"a"]
[{"$f":"PivotSheet!A16","v":28},{"$f":"PivotSheet!B16","v":1},"a",1,{"$error":"#N/A"},{"$error":"#N/A"},{"$error":"#N/A"},{"$error":"#N/A"},4.8991354466858796E-2,"B-Size",{"$f":"L15+1","v":127},{"$f":"K15+ (L18 - K15)/2","v":250},4,"b"]
[{"$f":"PivotSheet!A17","v":29},{"$f":"PivotSheet!B17","v":3},"a",1,{"$error":"#N/A"},{"$error":"#N/A"},{"$error":"#N/A"},{"$error":"#N/A"},5.7636887608069169E-2,"C-Size",{"$f":"L16+1","v":251},{"$f":"K15+3* (L18 - K15)/4","v":374},4,"c"]
[{"$f":"PivotSheet!A18","v":30},{"$f":"PivotSheet!B18","v":2},"a",1,{"$error":"#N/A"},{"$error":"#N/A"},{"$error":"#N/A"},{"$error":"#N/A"},6.3400576368876083E-2,"D-Size",{"$f":"L17+1","v":375},{"$f":"MAX([0]!Data_Plot)","v":498},4,"d"]
[{"$f":"PivotSheet!A19","v":34},{"$f":"PivotSheet!B19","v":1},"a",1,{"$error":"#N/A"},{"$error":"#N/A"},{"$error":"#N/A"},{"$error":"#N/A"},6.6282420749279536E-2]
[{"$f":"PivotSheet!A20","v":39},{"$f":"PivotSheet!B20","v":2},"a",1,{"$error":"#N/A"},{"$error":"#N/A"},{"$error":"#N/A"},{"$error":"#N/A"},7.2046109510086456E-2,"5 Levels of Intensity"]
[{"$f":"PivotSheet!A21","v":41},{"$f":"PivotSheet!B21","v":1},"a",1,{"$error":"#N/A"},{"$error":"#N/A"},{"$error":"#N/A"},{"$error":"#N/A"},7.492795389048991E-2]
[{"$f":"PivotSheet!A22","v":42},{"$f":"PivotSheet!B22","v":1},"a",1,{"$error":"#N/A"},{"$error":"#N/A"},{"$error":"#N/A"},{"$error":"#N/A"},7.7809798270893363E-2,"A-Size",{"$f":"MIN([0]!Data_Plot)","v":2},{"$f":"K22+ (L26 - K22)/5","v":101.2},5,"a"]
[{"$f":"PivotSheet!A23","v":45},{"$f":"PivotSheet!B23","v":2},"a",1,{"$error":"#N/A"},{"$error":"#N/A"},{"$error":"#N/A"},{"$error":"#N/A"},8.3573487031700283E-2,"B-Size",{"$f":"L22+1","v":102.2},{"$f":"K22+ 2*(L26 - K22)/5","v":200.4},5,"b"]
[{"$f":"PivotSheet!A24","v":47},{"$f":"PivotSheet!B24","v":1},"a",1,{"$error":"#N/A"},{"$error":"#N/A"},{"$error":"#N/A"},{"$error":"#N/A"},8.6455331412103736E-2,"C-Size",{"$f":"L23+1","v":201.4},{"$f":"K22+ 3*(L26 - K22)/5","v":299.60000000000002},5,"c"]
[{"$f":"PivotSheet!A25","v":49},{"$f":"PivotSheet!B25","v":1},"a",1,{"$error":"#N/A"},{"$error":"#N/A"},{"$error":"#N/A"},{"$error":"#N/A"},8.933717579250719E-2,"D-Size",{"$f":"L24+1","v":300.60000000000002},{"$f":"K22+ 4*(L26 - K22)/5","v":398.8},5,"d"]
[{"$f":"PivotSheet!A26","v":50},{"$f":"PivotSheet!B26","v":1},"a",1,{"$error":"#N/A"},{"$error":"#N/A"},{"$error":"#N/A"},{"$error":"#N/A"},9.2219020172910643E-2,"E-size",{"$f":"L25+1","v":399.8},{"$f":"MAX([0]!Data_Plot)","v":498},5,"e"]
[{"$f":"PivotSheet!A27","v":51},{"$f":"PivotSheet!B27","v":1},"a",1,{"$error":"#N/A"},{"$error":"#N/A"},{"$error":"#N/A"},{"$error":"#N/A"},9.5100864553314096E-2]
[{"$f":"PivotSheet!A28","v":53},{"$f":"PivotSheet!B28","v":1},"a",1,{"$error":"#N/A"},{"$error":"#N/A"},{"$error":"#N/A"},{"$error":"#N/A"},9.7982708933717549E-2]
[{"$f":"PivotSheet!A29","v":54},{"$f":"PivotSheet!B29","v":1},"a",1,{"$error":"#N/A"},{"$error":"#N/A"},{"$error":"#N/A"},{"$error":"#N/A"},0.100864553314121]
[{"$f":"PivotSheet!A30","v":55},{"$f":"PivotSheet!B30","v":1},"a",1,{"$error":"#N/A"},{"$error":"#N/A"},{"$error":"#N/A"},{"$error":"#N/A"},0.10374639769452446]
[{"$f":"PivotSheet!A31","v":61},{"$f":"PivotSheet!B31","v":1},"a",1,{"$error":"#N/A"},{"$error":"#N/A"},{"$error":"#N/A"},{"$error":"#N/A"},0.10662824207492791]
[{"$f":"PivotSheet!A32","v":62},{"$f":"PivotSheet!B32","v":2},"a",1,{"$error":"#N/A"},{"$error":"#N/A"},{"$error":"#N/A"},{"$error":"#N/A"},0.11239193083573483]
[{"$f":"PivotSheet!A33","v":63},{"$f":"PivotSheet!B33","v":1},"a",1,{"$error":"#N/A"},{"$error":"#N/A"},{"$error":"#N/A"},{"$error":"#N/A"},0.11527377521613828]
[{"$f":"PivotSheet!A34","v":66},{"$f":"PivotSheet!B34","v":1},"a",1,{"$error":"#N/A"},{"$error":"#N/A"},{"$error":"#N/A"},{"$error":"#N/A"},0.11815561959654174]
[{"$f":"PivotSheet!A35","v":67},{"$f":"PivotSheet!B35","v":1},"a",1,{"$error":"#N/A"},{"$error":"#N/A"},{"$error":"#N/A"},{"$error":"#N/A"},0.12103746397694519]
[{"$f":"PivotSheet!A36","v":68},{"$f":"PivotSheet!B36","v":1},"a",1,{"$error":"#N/A"},{"$error":"#N/A"},{"$error":"#N/A"},{"$error":"#N/A"},0.12391930835734864]
[{"$f":"PivotSheet!A37","v":69},{"$f":"PivotSheet!B37","v":2},"a",1,{"$error":"#N/A"},{"$error":"#N/A"},{"$error":"#N/A"},{"$error":"#N/A"},0.12968299711815556]
[{"$f":"PivotSheet!A38","v":72},{"$f":"PivotSheet!B38","v":1},"a",1,{"$error":"#N/A"},{"$error":"#N/A"},{"$error":"#N/A"},{"$error":"#N/A"},0.13256484149855902]
[{"$f":"PivotSheet!A39","v":75},{"$f":"PivotSheet!B39","v":2},"a",1,{"$error":"#N/A"},{"$error":"#N/A"},{"$error":"#N/A"},{"$error":"#N/A"},0.13832853025936592]
[{"$f":"PivotSheet!A40","v":78},{"$f":"PivotSheet!B40","v":1},"a",1,{"$error":"#N/A"},{"$error":"#N/A"},{"$error":"#N/A"},{"$error":"#N/A"},0.14121037463976938]
[{"$f":"PivotSheet!A41","v":79},{"$f":"PivotSheet!B41","v":2},"a",1,{"$error":"#N/A"},{"$error":"#N/A"},{"$error":"#N/A"},{"$error":"#N/A"},0.14697406340057628]
[{"$f":"PivotSheet!A42","v":82},{"$f":"PivotSheet!B42","v":3},"a",1,{"$error":"#N/A"},{"$error":"#N/A"},{"$error":"#N/A"},{"$error":"#N/A"},0.15561959654178667]
[{"$f":"PivotSheet!A43","v":84},{"$f":"PivotSheet!B43","v":1},"a",1,{"$error":"#N/A"},{"$error":"#N/A"},{"$error":"#N/A"},{"$error":"#N/A"},0.15850144092219012]
[{"$f":"PivotSheet!A44","v":85},{"$f":"PivotSheet!B44","v":2},"a",1,{"$error":"#N/A"},{"$error":"#N/A"},{"$error":"#N/A"},{"$error":"#N/A"},0.16426512968299703]
[{"$f":"PivotSheet!A45","v":87},{"$f":"PivotSheet!B45","v":2},"a",1,{"$error":"#N/A"},{"$error":"#N/A"},{"$error":"#N/A"},{"$error":"#N/A"},0.17002881844380394]
[{"$f":"PivotSheet!A46","v":88},{"$f":"PivotSheet!B46","v":2},"a",1,{"$error":"#N/A"},{"$error":"#N/A"},{"$error":"#N/A"},{"$error":"#N/A"},0.17579250720461084]
[{"$f":"PivotSheet!A47","v":89},{"$f":"PivotSheet!B47","v":3},"a",1,{"$error":"#N/A"},{"$error":"#N/A"},{"$error":"#N/A"},{"$error":"#N/A"},0.18443804034582123]
[{"$f":"PivotSheet!A48","v":90},{"$f":"PivotSheet!B48","v":1},"a",1,{"$error":"#N/A"},{"$error":"#N/A"},{"$error":"#N/A"},{"$error":"#N/A"},0.18731988472622468]
[{"$f":"PivotSheet!A49","v":94},{"$f":"PivotSheet!B49","v":1},"a",1,{"$error":"#N/A"},{"$error":"#N/A"},{"$error":"#N/A"},{"$error":"#N/A"},0.19020172910662814]
[{"$f":"PivotSheet!A50","v":97},{"$f":"PivotSheet!B50","v":1},"a",1,{"$error":"#N/A"},{"$error":"#N/A"},{"$error":"#N/A"},{"$error":"#N/A"},0.19308357348703159]
[{"$f":"PivotSheet!A51","v":98},{"$f":"PivotSheet!B51","v":1},"a",1,{"$error":"#N/A"},{"$error":"#N/A"},{"$error":"#N/A"},{"$error":"#N/A"},0.19596541786743504]
[{"$f":"PivotSheet!A52","v":99},{"$f":"PivotSheet!B52","v":1},"a",1,{"$error":"#N/A"},{"$error":"#N/A"},{"$error":"#N/A"},{"$error":"#N/A"},0.1988472622478385]
[{"$f":"PivotSheet!A53","v":100},{"$f":"PivotSheet!B53","v":1},"a",1,{"$error":"#N/A"},{"$error":"#N/A"},{"$error":"#N/A"},{"$error":"#N/A"},0.20172910662824195]
[{"$f":"PivotSheet!A54","v":102},{"$f":"PivotSheet!B54","v":2},"a",1,{"$error":"#N/A"},{"$error":"#N/A"},{"$error":"#N/A"},{"$error":"#N/A"},0.20749279538904886]
[{"$f":"PivotSheet!A55","v":104},{"$f":"PivotSheet!B55","v":2},"a",1,{"$error":"#N/A"},{"$error":"#N/A"},{"$error":"#N/A"},{"$error":"#N/A"},0.21325648414985576]
[{"$f":"PivotSheet!A56","v":106},{"$f":"PivotSheet!B56","v":3},"a",1,{"$error":"#N/A"},{"$error":"#N/A"},{"$error":"#N/A"},{"$error":"#N/A"},0.22190201729106615]
[{"$f":"PivotSheet!A57","v":108},{"$f":"PivotSheet!B57","v":1},"a",1,{"$error":"#N/A"},{"$error":"#N/A"},{"$error":"#N/A"},{"$error":"#N/A"},0.2247838616714696]
[{"$f":"PivotSheet!A58","v":109},{"$f":"PivotSheet!B58","v":1},"a",1,{"$error":"#N/A"},{"$error":"#N/A"},{"$error":"#N/A"},{"$error":"#N/A"},0.22766570605187306]
[{"$f":"PivotSheet!A59","v":110},{"$f":"PivotSheet!B59","v":1},"a",1,{"$error":"#N/A"},{"$error":"#N/A"},{"$error":"#N/A"},{"$error":"#N/A"},0.23054755043227651]
[{"$f":"PivotSheet!A60","v":111},{"$f":"PivotSheet!B60","v":1},"a",1,{"$error":"#N/A"},{"$error":"#N/A"},{"$error":"#N/A"},{"$error":"#N/A"},0.23342939481267996]
[{"$f":"PivotSheet!A61","v":114},{"$f":"PivotSheet!B61","v":1},"a",1,{"$error":"#N/A"},{"$error":"#N/A"},{"$error":"#N/A"},{"$error":"#N/A"},0.23631123919308342]
[{"$f":"PivotSheet!A62","v":118},{"$f":"PivotSheet!B62","v":1},"a",1,{"$error":"#N/A"},{"$error":"#N/A"},{"$error":"#N/A"},{"$error":"#N/A"},0.23919308357348687]
[{"$f":"PivotSheet!A63","v":121},{"$f":"PivotSheet!B63","v":1},"a",1,{"$error":"#N/A"},{"$error":"#N/A"},{"$error":"#N/A"},{"$error":"#N/A"},0.24207492795389032]
[{"$f":"PivotSheet!A64","v":122},{"$f":"PivotSheet!B64","v":2},"a",1,{"$error":"#N/A"},{"$error":"#N/A"},{"$error":"#N/A"},{"$error":"#N/A"},0.24783861671469723]
[{"$f":"PivotSheet!A65","v":123},{"$f":"PivotSheet!B65","v":3},"a",1,{"$error":"#N/A"},{"$error":"#N/A"},{"$error":"#N/A"},{"$error":"#N/A"},0.25648414985590762]
[{"$f":"PivotSheet!A66","v":125},{"$f":"PivotSheet!B66","v":2},"a",1,{"$error":"#N/A"},{"$error":"#N/A"},{"$error":"#N/A"},{"$error":"#N/A"},0.26224783861671452]
[{"$f":"PivotSheet!A67","v":127},{"$f":"PivotSheet!B67","v":1},{"$f":"IF(A67<=$V$4,\"a\",IF(A67<=$V$6,\"b\",IF(A67<=$V$8,\"c\",IF(A67<=$V$10,\"d\",IF(A67<=$V$12,\"e\",\"ERROR\")))))","v":"a"},{"$f":"IF($C67=\"a\",1,NA())","v":1},{"$f":"IF($C67=\"b\",1,NA())","v":{"$error":"#N/A"}},{"$f":"IF($C67=\"c\",1,NA())","v":{"$error":"#N/A"}},{"$f":"IF($C67=\"d\",1,NA())","v":{"$error":"#N/A"}},{"$f":"IF($C67=\"e\",1,NA())","v":{"$error":"#N/A"}},0.26512968299711798]
[{"$f":"PivotSheet!A68","v":128},{"$f":"PivotSheet!B68","v":1},"a",1,{"$error":"#N/A"},{"$error":"#N/A"},{"$error":"#N/A"},{"$error":"#N/A"},{"$f":"B68/SUM($B$2:$B$1000)+I67","v":0.26801152737752143}]
[{"$f":"PivotSheet!A69","v":129},{"$f":"PivotSheet!B69","v":1},"a",1,{"$error":"#N/A"},{"$error":"#N/A"},{"$error":"#N/A"},{"$error":"#N/A"},0.27089337175792488]
[{"$f":"PivotSheet!A70","v":133},{"$f":"PivotSheet!B70","v":1},"a",1,{"$error":"#N/A"},{"$error":"#N/A"},{"$error":"#N/A"},{"$error":"#N/A"},0.27377521613832834]
[{"$f":"PivotSheet!A71","v":135},{"$f":"PivotSheet!B71","v":1},"a",1,{"$error":"#N/A"},{"$error":"#N/A"},{"$error":"#N/A"},{"$error":"#N/A"},0.27665706051873179]
[{"$f":"PivotSheet!A72","v":137},{"$f":"PivotSheet!B72","v":3},"a",1,{"$error":"#N/A"},{"$error":"#N/A"},{"$error":"#N/A"},{"$error":"#N/A"},0.28530259365994215]
[{"$f":"PivotSheet!A73","v":139},{"$f":"PivotSheet!B73","v":1},"a",1,{"$error":"#N/A"},{"$error":"#N/A"},{"$error":"#N/A"},{"$error":"#N/A"},0.2881844380403456]
[{"$f":"PivotSheet!A74","v":140},{"$f":"PivotSheet!B74","v":1},"a",1,{"$error":"#N/A"},{"$error":"#N/A"},{"$error":"#N/A"},{"$error":"#N/A"},0.29106628242074906]
[{"$f":"PivotSheet!A75","v":141},{"$f":"PivotSheet!B75","v":2},"a",1,{"$error":"#N/A"},{"$error":"#N/A"},{"$error":"#N/A"},{"$error":"#N/A"},0.29682997118155596]
[{"$f":"PivotSheet!A76","v":144},{"$f":"PivotSheet!B76","v":1},"a",1,{"$error":"#N/A"},{"$error":"#N/A"},{"$error":"#N/A"},{"$error":"#N/A"},0.29971181556195942]
[{"$f":"PivotSheet!A77","v":145},{"$f":"PivotSheet!B77","v":2},"a",1,{"$error":"#N/A"},{"$error":"#N/A"},{"$error":"#N/A"},{"$error":"#N/A"},0.30547550432276632]
[{"$f":"PivotSheet!A78","v":147},{"$f":"PivotSheet!B78","v":1},"a",1,{"$error":"#N/A"},{"$error":"#N/A"},{"$error":"#N/A"},{"$error":"#N/A"},0.30835734870316978]
[{"$f":"PivotSheet!A79","v":150},{"$f":"PivotSheet!B79","v":1},"a",1,{"$error":"#N/A"},{"$error":"#N/A"},{"$error":"#N/A"},{"$error":"#N/A"},0.31123919308357323]
[{"$f":"PivotSheet!A80","v":154},{"$f":"PivotSheet!B80","v":1},"a",1,{"$error":"#N/A"},{"$error":"#N/A"},{"$error":"#N/A"},{"$error":"#N/A"},0.31412103746397668]
[{"$f":"PivotSheet!A81","v":155},{"$f":"PivotSheet!B81","v":2},"a",1,{"$error":"#N/A"},{"$error":"#N/A"},{"$error":"#N/A"},{"$error":"#N/A"},0.31988472622478359]
[{"$f":"PivotSheet!A82","v":156},{"$f":"PivotSheet!B82","v":3},"a",1,{"$error":"#N/A"},{"$error":"#N/A"},{"$error":"#N/A"},{"$error":"#N/A"},0.32853025936599395]
[{"$f":"PivotSheet!A83","v":158},{"$f":"PivotSheet!B83","v":1},"a",1,{"$error":"#N/A"},{"$error":"#N/A"},{"$error":"#N/A"},{"$error":"#N/A"},0.3314121037463974]
[{"$f":"PivotSheet!A84","v":159},{"$f":"PivotSheet!B84","v":1},"a",1,{"$error":"#N/A"},{"$error":"#N/A"},{"$error":"#N/A"},{"$error":"#N/A"},0.33429394812680086]
[{"$f":"PivotSheet!A85","v":161},{"$f":"PivotSheet!B85","v":2},"a",1,{"$error":"#N/A"},{"$error":"#N/A"},{"$error":"#N/A"},{"$error":"#N/A"},0.34005763688760776]
[{"$f":"PivotSheet!A86","v":165},{"$f":"PivotSheet!B86","v":1},"a",1,{"$error":"#N/A"},{"$error":"#N/A"},{"$error":"#N/A"},{"$error":"#N/A"},0.34293948126801121]
[{"$f":"PivotSheet!A87","v":166},{"$f":"PivotSheet!B87","v":2},"a",1,{"$error":"#N/A"},{"$error":"#N/A"},{"$error":"#N/A"},{"$error":"#N/A"},0.34870317002881812]
[{"$f":"PivotSheet!A88","v":167},{"$f":"PivotSheet!B88","v":1},"a",1,{"$error":"#N/A"},{"$error":"#N/A"},{"$error":"#N/A"},{"$error":"#N/A"},0.35158501440922157]
[{"$f":"PivotSheet!A89","v":168},{"$f":"PivotSheet!B89","v":1},"b",{"$error":"#N/A"},1,{"$error":"#N/A"},{"$error":"#N/A"},{"$error":"#N/A"},0.35446685878962503]
[{"$f":"PivotSheet!A90","v":169},{"$f":"PivotSheet!B90","v":1},"b",{"$error":"#N/A"},1,{"$error":"#N/A"},{"$error":"#N/A"},{"$error":"#N/A"},0.35734870317002848]
[{"$f":"PivotSheet!A91","v":170},{"$f":"PivotSheet!B91","v":1},"b",{"$error":"#N/A"},1,{"$error":"#N/A"},{"$error":"#N/A"},{"$error":"#N/A"},0.36023054755043193]
[{"$f":"PivotSheet!A92","v":171},{"$f":"PivotSheet!B92","v":3},"b",{"$error":"#N/A"},1,{"$error":"#N/A"},{"$error":"#N/A"},{"$error":"#N/A"},0.36887608069164229]
[{"$f":"PivotSheet!A93","v":172},{"$f":"PivotSheet!B93","v":2},"b",{"$error":"#N/A"},1,{"$error":"#N/A"},{"$error":"#N/A"},{"$error":"#N/A"},0.3746397694524492]
[{"$f":"PivotSheet!A94","v":174},{"$f":"PivotSheet!B94","v":1},"b",{"$error":"#N/A"},1,{"$error":"#N/A"},{"$error":"#N/A"},{"$error":"#N/A"},0.37752161383285265]
[{"$f":"PivotSheet!A95","v":177},{"$f":"PivotSheet!B95","v":1},"b",{"$error":"#N/A"},1,{"$error":"#N/A"},{"$error":"#N/A"},{"$error":"#N/A"},0.38040345821325611]
[{"$f":"PivotSheet!A96","v":178},{"$f":"PivotSheet!B96","v":2},"b",{"$error":"#N/A"},1,{"$error":"#N/A"},{"$error":"#N/A"},{"$error":"#N/A"},0.38616714697406301]
[{"$f":"PivotSheet!A97","v":179},{"$f":"PivotSheet!B97","v":2},"b",{"$error":"#N/A"},1,{"$error":"#N/A"},{"$error":"#N/A"},{"$error":"#N/A"},0.39193083573486992]
[{"$f":"PivotSheet!A98","v":181},{"$f":"PivotSheet!B98","v":3},"b",{"$error":"#N/A"},1,{"$error":"#N/A"},{"$error":"#N/A"},{"$error":"#N/A"},0.40057636887608028]
[{"$f":"PivotSheet!A99","v":182},{"$f":"PivotSheet!B99","v":1},"b",{"$error":"#N/A"},1,{"$error":"#N/A"},{"$error":"#N/A"},{"$error":"#N/A"},0.40345821325648373]
[{"$f":"PivotSheet!A100","v":186},{"$f":"PivotSheet!B100","v":2},"b",{"$error":"#N/A"},1,{"$error":"#N/A"},{"$error":"#N/A"},{"$error":"#N/A"},0.40922190201729064]
[{"$f":"PivotSheet!A101","v":187},{"$f":"PivotSheet!B101","v":2},"b",{"$error":"#N/A"},1,{"$error":"#N/A"},{"$error":"#N/A"},{"$error":"#N/A"},0.41498559077809755]
[{"$f":"PivotSheet!A102","v":189},{"$f":"PivotSheet!B102","v":1},"b",{"$error":"#N/A"},1,{"$error":"#N/A"},{"$error":"#N/A"},{"$error":"#N/A"},0.417867435158501]
[{"$f":"PivotSheet!A103","v":190},{"$f":"PivotSheet!B103","v":2},"b",{"$error":"#N/A"},1,{"$error":"#N/A"},{"$error":"#N/A"},{"$error":"#N/A"},0.42363112391930791]
[{"$f":"PivotSheet!A104","v":191},{"$f":"PivotSheet!B104","v":2},"b",{"$error":"#N/A"},1,{"$error":"#N/A"},{"$error":"#N/A"},{"$error":"#N/A"},0.42939481268011481]
[{"$f":"PivotSheet!A105","v":196},{"$f":"PivotSheet!B105","v":1},"b",{"$error":"#N/A"},1,{"$error":"#N/A"},{"$error":"#N/A"},{"$error":"#N/A"},0.43227665706051827]
[{"$f":"PivotSheet!A106","v":197},{"$f":"PivotSheet!B106","v":1},"b",{"$error":"#N/A"},1,{"$error":"#N/A"},{"$error":"#N/A"},{"$error":"#N/A"},0.43515850144092172]
[{"$f":"PivotSheet!A107","v":203},{"$f":"PivotSheet!B107","v":1},"b",{"$error":"#N/A"},1,{"$error":"#N/A"},{"$error":"#N/A"},{"$error":"#N/A"},0.43804034582132517]
[{"$f":"PivotSheet!A108","v":204},{"$f":"PivotSheet!B108","v":1},"b",{"$error":"#N/A"},1,{"$error":"#N/A"},{"$error":"#N/A"},{"$error":"#N/A"},0.44092219020172863]
[{"$f":"PivotSheet!A109","v":206},{"$f":"PivotSheet!B109","v":1},"b",{"$error":"#N/A"},1,{"$error":"#N/A"},{"$error":"#N/A"},{"$error":"#N/A"},0.44380403458213208]
[{"$f":"PivotSheet!A110","v":208},{"$f":"PivotSheet!B110","v":1},"b",{"$error":"#N/A"},1,{"$error":"#N/A"},{"$error":"#N/A"},{"$error":"#N/A"},0.44668587896253553]
[{"$f":"PivotSheet!A111","v":213},{"$f":"PivotSheet!B111","v":3},"b",{"$error":"#N/A"},1,{"$error":"#N/A"},{"$error":"#N/A"},{"$error":"#N/A"},0.45533141210374589]
[{"$f":"PivotSheet!A112","v":214},{"$f":"PivotSheet!B112","v":1},"b",{"$error":"#N/A"},1,{"$error":"#N/A"},{"$error":"#N/A"},{"$error":"#N/A"},0.45821325648414934]
[{"$f":"PivotSheet!A113","v":217},{"$f":"PivotSheet!B113","v":1},"b",{"$error":"#N/A"},1,{"$error":"#N/A"},{"$error":"#N/A"},{"$error":"#N/A"},0.4610951008645528]
[{"$f":"PivotSheet!A114","v":218},{"$f":"PivotSheet!B114","v":2},"b",{"$error":"#N/A"},1,{"$error":"#N/A"},{"$error":"#N/A"},{"$error":"#N/A"},0.4668587896253597]
[{"$f":"PivotSheet!A115","v":220},{"$f":"PivotSheet!B115","v":1},"b",{"$error":"#N/A"},1,{"$error":"#N/A"},{"$error":"#N/A"},{"$error":"#N/A"},0.46974063400576316]
[{"$f":"PivotSheet!A116","v":222},{"$f":"PivotSheet!B116","v":1},"b",{"$error":"#N/A"},1,{"$error":"#N/A"},{"$error":"#N/A"},{"$error":"#N/A"},0.47262247838616661]
[{"$f":"PivotSheet!A117","v":226},{"$f":"PivotSheet!B117","v":1},"b",{"$error":"#N/A"},1,{"$error":"#N/A"},{"$error":"#N/A"},{"$error":"#N/A"},0.47550432276657006]
[{"$f":"PivotSheet!A118","v":227},{"$f":"PivotSheet!B118","v":1},"b",{"$error":"#N/A"},1,{"$error":"#N/A"},{"$error":"#N/A"},{"$error":"#N/A"},0.47838616714697352]
[{"$f":"PivotSheet!A119","v":228},{"$f":"PivotSheet!B119","v":1},"b",{"$error":"#N/A"},1,{"$error":"#N/A"},{"$error":"#N/A"},{"$error":"#N/A"},0.48126801152737697]
[{"$f":"PivotSheet!A120","v":229},{"$f":"PivotSheet!B120","v":2},"b",{"$error":"#N/A"},1,{"$error":"#N/A"},{"$error":"#N/A"},{"$error":"#N/A"},0.48703170028818388]
[{"$f":"PivotSheet!A121","v":235},{"$f":"PivotSheet!B121","v":1},"b",{"$error":"#N/A"},1,{"$error":"#N/A"},{"$error":"#N/A"},{"$error":"#N/A"},0.48991354466858733]
[{"$f":"PivotSheet!A122","v":236},{"$f":"PivotSheet!B122","v":1},"b",{"$error":"#N/A"},1,{"$error":"#N/A"},{"$error":"#N/A"},{"$error":"#N/A"},0.49279538904899078]
[{"$f":"PivotSheet!A123","v":238},{"$f":"PivotSheet!B123","v":1},"b",{"$error":"#N/A"},1,{"$error":"#N/A"},{"$error":"#N/A"},{"$error":"#N/A"},0.49567723342939424]
[{"$f":"PivotSheet!A124","v":239},{"$f":"PivotSheet!B124","v":2},"b",{"$error":"#N/A"},1,{"$error":"#N/A"},{"$error":"#N/A"},{"$error":"#N/A"},0.5014409221902012]
[{"$f":"PivotSheet!A125","v":241},{"$f":"PivotSheet!B125","v":2},"b",{"$error":"#N/A"},1,{"$error":"#N/A"},{"$error":"#N/A"},{"$error":"#N/A"},0.50720461095100811]
[{"$f":"PivotSheet!A126","v":244},{"$f":"PivotSheet!B126","v":1},"b",{"$error":"#N/A"},1,{"$error":"#N/A"},{"$error":"#N/A"},{"$error":"#N/A"},0.51008645533141161]
[{"$f":"PivotSheet!A127","v":248},{"$f":"PivotSheet!B127","v":1},"b",{"$error":"#N/A"},1,{"$error":"#N/A"},{"$error":"#N/A"},{"$error":"#N/A"},0.51296829971181512]
[{"$f":"PivotSheet!A128","v":249},{"$f":"PivotSheet!B128","v":3},"b",{"$error":"#N/A"},1,{"$error":"#N/A"},{"$error":"#N/A"},{"$error":"#N/A"},0.52161383285302554]
[{"$f":"PivotSheet!A129","v":252},{"$f":"PivotSheet!B129","v":2},"b",{"$error":"#N/A"},1,{"$error":"#N/A"},{"$error":"#N/A"},{"$error":"#N/A"},0.52737752161383245]
[{"$f":"PivotSheet!A130","v":256},{"$f":"PivotSheet!B130","v":1},"b",{"$error":"#N/A"},1,{"$error":"#N/A"},{"$error":"#N/A"},{"$error":"#N/A"},0.53025936599423595]
[{"$f":"PivotSheet!A131","v":257},{"$f":"PivotSheet!B131","v":1},{"$f":"IF(A131<=$V$4,\"a\",IF(A131<=$V$6,\"b\",IF(A131<=$V$8,\"c\",IF(A131<=$V$10,\"d\",IF(A131<=$V$12,\"e\",\"ERROR\")))))","v":"b"},{"$f":"IF($C131=\"a\",1,NA())","v":{"$error":"#N/A"}},{"$f":"IF($C131=\"b\",1,NA())","v":1},{"$f":"IF($C131=\"c\",1,NA())","v":{"$error":"#N/A"}},{"$f":"IF($C131=\"d\",1,NA())","v":{"$error":"#N/A"}},{"$f":"IF($C131=\"e\",1,NA())","v":{"$error":"#N/A"}},0.53314121037463946]
[{"$f":"PivotSheet!A132","v":258},{"$f":"PivotSheet!B132","v":1},"b",{"$error":"#N/A"},1,{"$error":"#N/A"},{"$error":"#N/A"},{"$error":"#N/A"},{"$f":"B132/SUM($B$2:$B$1000)+I131","v":0.53602305475504297}]
[{"$f":"PivotSheet!A133","v":260},{"$f":"PivotSheet!B133","v":1},"b",{"$error":"#N/A"},1,{"$error":"#N/A"},{"$error":"#N/A"},{"$error":"#N/A"},0.53890489913544648]
[{"$f":"PivotSheet!A134","v":264},{"$f":"PivotSheet!B134","v":1},"b",{"$error":"#N/A"},1,{"$error":"#N/A"},{"$error":"#N/A"},{"$error":"#N/A"},0.54178674351584999]
[{"$f":"PivotSheet!A135","v":265},{"$f":"PivotSheet!B135","v":1},"b",{"$error":"#N/A"},1,{"$error":"#N/A"},{"$error":"#N/A"},{"$error":"#N/A"},0.5446685878962535]
[{"$f":"PivotSheet!A136","v":266},{"$f":"PivotSheet!B136","v":1},"b",{"$error":"#N/A"},1,{"$error":"#N/A"},{"$error":"#N/A"},{"$error":"#N/A"},0.54755043227665701]
[{"$f":"PivotSheet!A137","v":267},{"$f":"PivotSheet!B137","v":2},"b",{"$error":"#N/A"},1,{"$error":"#N/A"},{"$error":"#N/A"},{"$error":"#N/A"},0.55331412103746391]
[{"$f":"PivotSheet!A138","v":269},{"$f":"PivotSheet!B138","v":2},"b",{"$error":"#N/A"},1,{"$error":"#N/A"},{"$error":"#N/A"},{"$error":"#N/A"},0.55907780979827082]
[{"$f":"PivotSheet!A139","v":270},{"$f":"PivotSheet!B139","v":1},"b",{"$error":"#N/A"},1,{"$error":"#N/A"},{"$error":"#N/A"},{"$error":"#N/A"},0.56195965417867433]
[{"$f":"PivotSheet!A140","v":273},{"$f":"PivotSheet!B140","v":1},"b",{"$error":"#N/A"},1,{"$error":"#N/A"},{"$error":"#N/A"},{"$error":"#N/A"},0.56484149855907784]
[{"$f":"PivotSheet!A141","v":275},{"$f":"PivotSheet!B141","v":1},"b",{"$error":"#N/A"},1,{"$error":"#N/A"},{"$error":"#N/A"},{"$error":"#N/A"},0.56772334293948135]
[{"$f":"PivotSheet!A142","v":277},{"$f":"PivotSheet!B142","v":1},"b",{"$error":"#N/A"},1,{"$error":"#N/A"},{"$error":"#N/A"},{"$error":"#N/A"},0.57060518731988485]
[{"$f":"PivotSheet!A143","v":278},{"$f":"PivotSheet!B143","v":1},"b",{"$error":"#N/A"},1,{"$error":"#N/A"},{"$error":"#N/A"},{"$error":"#N/A"},0.57348703170028836]
[{"$f":"PivotSheet!A144","v":280},{"$f":"PivotSheet!B144","v":1},"b",{"$error":"#N/A"},1,{"$error":"#N/A"},{"$error":"#N/A"},{"$error":"#N/A"},0.57636887608069187]
[{"$f":"PivotSheet!A145","v":282},{"$f":"PivotSheet!B145","v":1},"b",{"$error":"#N/A"},1,{"$error":"#N/A"},{"$error":"#N/A"},{"$error":"#N/A"},0.57925072046109538]
[{"$f":"PivotSheet!A146","v":286},{"$f":"PivotSheet!B146","v":1},"b",{"$error":"#N/A"},1,{"$error":"#N/A"},{"$error":"#N/A"},{"$error":"#N/A"},0.58213256484149889]
[{"$f":"PivotSheet!A147","v":289},{"$f":"PivotSheet!B147","v":2},"b",{"$error":"#N/A"},1,{"$error":"#N/A"},{"$error":"#N/A"},{"$error":"#N/A"},0.5878962536023058]
[{"$f":"PivotSheet!A148","v":291},{"$f":"PivotSheet!B148","v":1},"b",{"$error":"#N/A"},1,{"$error":"#N/A"},{"$error":"#N/A"},{"$error":"#N/A"},0.5907780979827093]
[{"$f":"PivotSheet!A149","v":292},{"$f":"PivotSheet!B149","v":3},"b",{"$error":"#N/A"},1,{"$error":"#N/A"},{"$error":"#N/A"},{"$error":"#N/A"},0.59942363112391972]
[{"$f":"PivotSheet!A150","v":293},{"$f":"PivotSheet!B150","v":1},"b",{"$error":"#N/A"},1,{"$error":"#N/A"},{"$error":"#N/A"},{"$error":"#N/A"},0.60230547550432323]
[{"$f":"PivotSheet!A151","v":294},{"$f":"PivotSheet!B151","v":1},"b",{"$error":"#N/A"},1,{"$error":"#N/A"},{"$error":"#N/A"},{"$error":"#N/A"},0.60518731988472674]
[{"$f":"PivotSheet!A152","v":295},{"$f":"PivotSheet!B152","v":4},"b",{"$error":"#N/A"},1,{"$error":"#N/A"},{"$error":"#N/A"},{"$error":"#N/A"},0.61671469740634055]
[{"$f":"PivotSheet!A153","v":296},{"$f":"PivotSheet!B153","v":1},"b",{"$error":"#N/A"},1,{"$error":"#N/A"},{"$error":"#N/A"},{"$error":"#N/A"},0.61959654178674406]
[{"$f":"PivotSheet!A154","v":297},{"$f":"PivotSheet!B154","v":2},"b",{"$error":"#N/A"},1,{"$error":"#N/A"},{"$error":"#N/A"},{"$error":"#N/A"},0.62536023054755097]
[{"$f":"PivotSheet!A155","v":301},{"$f":"PivotSheet!B155","v":1},"b",{"$error":"#N/A"},1,{"$error":"#N/A"},{"$error":"#N/A"},{"$error":"#N/A"},0.62824207492795447]
[{"$f":"PivotSheet!A156","v":302},{"$f":"PivotSheet!B156","v":1},"b",{"$error":"#N/A"},1,{"$error":"#N/A"},{"$error":"#N/A"},{"$error":"#N/A"},0.63112391930835798]
[{"$f":"PivotSheet!A157","v":303},{"$f":"PivotSheet!B157","v":1},"b",{"$error":"#N/A"},1,{"$error":"#N/A"},{"$error":"#N/A"},{"$error":"#N/A"},0.63400576368876149]
[{"$f":"PivotSheet!A158","v":305},{"$f":"PivotSheet!B158","v":1},"b",{"$error":"#N/A"},1,{"$error":"#N/A"},{"$error":"#N/A"},{"$error":"#N/A"},0.636887608069165]
[{"$f":"PivotSheet!A159","v":306},{"$f":"PivotSheet!B159","v":1},"b",{"$error":"#N/A"},1,{"$error":"#N/A"},{"$error":"#N/A"},{"$error":"#N/A"},0.63976945244956851]
[{"$f":"PivotSheet!A160","v":308},{"$f":"PivotSheet!B160","v":1},"b",{"$error":"#N/A"},1,{"$error":"#N/A"},{"$error":"#N/A"},{"$error":"#N/A"},0.64265129682997202]
[{"$f":"PivotSheet!A161","v":309},{"$f":"PivotSheet!B161","v":1},"b",{"$error":"#N/A"},1,{"$error":"#N/A"},{"$error":"#N/A"},{"$error":"#N/A"},0.64553314121037553]
[{"$f":"PivotSheet!A162","v":310},{"$f":"PivotSheet!B162","v":1},"b",{"$error":"#N/A"},1,{"$error":"#N/A"},{"$error":"#N/A"},{"$error":"#N/A"},0.64841498559077904]
[{"$f":"PivotSheet!A163","v":313},{"$f":"PivotSheet!B163","v":1},"b",{"$error":"#N/A"},1,{"$error":"#N/A"},{"$error":"#N/A"},{"$error":"#N/A"},0.65129682997118254]
[{"$f":"PivotSheet!A164","v":314},{"$f":"PivotSheet!B164","v":1},"b",{"$error":"#N/A"},1,{"$error":"#N/A"},{"$error":"#N/A"},{"$error":"#N/A"},0.65417867435158605]
[{"$f":"PivotSheet!A165","v":315},{"$f":"PivotSheet!B165","v":1},"b",{"$error":"#N/A"},1,{"$error":"#N/A"},{"$error":"#N/A"},{"$error":"#N/A"},0.65706051873198956]
[{"$f":"PivotSheet!A166","v":319},{"$f":"PivotSheet!B166","v":1},"b",{"$error":"#N/A"},1,{"$error":"#N/A"},{"$error":"#N/A"},{"$error":"#N/A"},0.65994236311239307]
[{"$f":"PivotSheet!A167","v":321},{"$f":"PivotSheet!B167","v":1},"b",{"$error":"#N/A"},1,{"$error":"#N/A"},{"$error":"#N/A"},{"$error":"#N/A"},0.66282420749279658]
[{"$f":"PivotSheet!A168","v":324},{"$f":"PivotSheet!B168","v":1},"b",{"$error":"#N/A"},1,{"$error":"#N/A"},{"$error":"#N/A"},{"$error":"#N/A"},0.66570605187320009]
[{"$f":"PivotSheet!A169","v":326},{"$f":"PivotSheet!B169","v":2},"b",{"$error":"#N/A"},1,{"$error":"#N/A"},{"$error":"#N/A"},{"$error":"#N/A"},0.671469740634007]
[{"$f":"PivotSheet!A170","v":327},{"$f":"PivotSheet!B170","v":1},"b",{"$error":"#N/A"},1,{"$error":"#N/A"},{"$error":"#N/A"},{"$error":"#N/A"},0.6743515850144105]
[{"$f":"PivotSheet!A171","v":328},{"$f":"PivotSheet!B171","v":2},"b",{"$error":"#N/A"},1,{"$error":"#N/A"},{"$error":"#N/A"},{"$error":"#N/A"},0.68011527377521741]
[{"$f":"PivotSheet!A172","v":329},{"$f":"PivotSheet!B172","v":2},"b",{"$error":"#N/A"},1,{"$error":"#N/A"},{"$error":"#N/A"},{"$error":"#N/A"},0.68587896253602432]
[{"$f":"PivotSheet!A173","v":330},{"$f":"PivotSheet!B173","v":1},"b",{"$error":"#N/A"},1,{"$error":"#N/A"},{"$error":"#N/A"},{"$error":"#N/A"},0.68876080691642783]
[{"$f":"PivotSheet!A174","v":332},{"$f":"PivotSheet!B174","v":3},"b",{"$error":"#N/A"},1,{"$error":"#N/A"},{"$error":"#N/A"},{"$error":"#N/A"},0.69740634005763824]
[{"$f":"PivotSheet!A175","v":334},{"$f":"PivotSheet!B175","v":1},"c",{"$error":"#N/A"},{"$error":"#N/A"},1,{"$error":"#N/A"},{"$error":"#N/A"},0.70028818443804175]
[{"$f":"PivotSheet!A176","v":335},{"$f":"PivotSheet!B176","v":1},"c",{"$error":"#N/A"},{"$error":"#N/A"},1,{"$error":"#N/A"},{"$error":"#N/A"},0.70317002881844526]
[{"$f":"PivotSheet!A177","v":337},{"$f":"PivotSheet!B177","v":2},"c",{"$error":"#N/A"},{"$error":"#N/A"},1,{"$error":"#N/A"},{"$error":"#N/A"},0.70893371757925217]
[{"$f":"PivotSheet!A178","v":338},{"$f":"PivotSheet!B178","v":1},"c",{"$error":"#N/A"},{"$error":"#N/A"},1,{"$error":"#N/A"},{"$error":"#N/A"},0.71181556195965567]
[{"$f":"PivotSheet!A179","v":339},{"$f":"PivotSheet!B179","v":2},"c",{"$error":"#N/A"},{"$error":"#N/A"},1,{"$error":"#N/A"},{"$error":"#N/A"},0.71757925072046258]
[{"$f":"PivotSheet!A180","v":343},{"$f":"PivotSheet!B180","v":1},"c",{"$error":"#N/A"},{"$error":"#N/A"},1,{"$error":"#N/A"},{"$error":"#N/A"},0.72046109510086609]
[{"$f":"PivotSheet!A181","v":345},{"$f":"PivotSheet!B181","v":2},"c",{"$error":"#N/A"},{"$error":"#N/A"},1,{"$error":"#N/A"},{"$error":"#N/A"},0.726224783861673]
[{"$f":"PivotSheet!A182","v":346},{"$f":"PivotSheet!B182","v":2},"c",{"$error":"#N/A"},{"$error":"#N/A"},1,{"$error":"#N/A"},{"$error":"#N/A"},0.7319884726224799]
[{"$f":"PivotSheet!A183","v":347},{"$f":"PivotSheet!B183","v":1},"c",{"$error":"#N/A"},{"$error":"#N/A"},1,{"$error":"#N/A"},{"$error":"#N/A"},0.73487031700288341]
[{"$f":"PivotSheet!A184","v":349},{"$f":"PivotSheet!B184","v":1},"c",{"$error":"#N/A"},{"$error":"#N/A"},1,{"$error":"#N/A"},{"$error":"#N/A"},0.73775216138328692]
[{"$f":"PivotSheet!A185","v":350},{"$f":"PivotSheet!B185","v":1},"c",{"$error":"#N/A"},{"$error":"#N/A"},1,{"$error":"#N/A"},{"$error":"#N/A"},0.74063400576369043]
[{"$f":"PivotSheet!A186","v":351},{"$f":"PivotSheet!B186","v":1},"c",{"$error":"#N/A"},{"$error":"#N/A"},1,{"$error":"#N/A"},{"$error":"#N/A"},0.74351585014409394]
[{"$f":"PivotSheet!A187","v":353},{"$f":"PivotSheet!B187","v":1},"c",{"$error":"#N/A"},{"$error":"#N/A"},1,{"$error":"#N/A"},{"$error":"#N/A"},0.74639769452449745]
[{"$f":"PivotSheet!A188","v":354},{"$f":"PivotSheet!B188","v":1},"c",{"$error":"#N/A"},{"$error":"#N/A"},1,{"$error":"#N/A"},{"$error":"#N/A"},0.74927953890490095]
[{"$f":"PivotSheet!A189","v":356},{"$f":"PivotSheet!B189","v":2},"c",{"$error":"#N/A"},{"$error":"#N/A"},1,{"$error":"#N/A"},{"$error":"#N/A"},0.75504322766570786]
[{"$f":"PivotSheet!A190","v":359},{"$f":"PivotSheet!B190","v":1},"c",{"$error":"#N/A"},{"$error":"#N/A"},1,{"$error":"#N/A"},{"$error":"#N/A"},0.75792507204611137]
[{"$f":"PivotSheet!A191","v":361},{"$f":"PivotSheet!B191","v":1},"c",{"$error":"#N/A"},{"$error":"#N/A"},1,{"$error":"#N/A"},{"$error":"#N/A"},0.76080691642651488]
[{"$f":"PivotSheet!A192","v":362},{"$f":"PivotSheet!B192","v":3},"c",{"$error":"#N/A"},{"$error":"#N/A"},1,{"$error":"#N/A"},{"$error":"#N/A"},0.76945244956772529]
[{"$f":"PivotSheet!A193","v":363},{"$f":"PivotSheet!B193","v":1},"c",{"$error":"#N/A"},{"$error":"#N/A"},1,{"$error":"#N/A"},{"$error":"#N/A"},0.7723342939481288]
[{"$f":"PivotSheet!A194","v":365},{"$f":"PivotSheet!B194","v":1},"c",{"$error":"#N/A"},{"$error":"#N/A"},1,{"$error":"#N/A"},{"$error":"#N/A"},0.77521613832853231]
[{"$f":"PivotSheet!A195","v":366},{"$f":"PivotSheet!B195","v":1},{"$f":"IF(A195<=$V$4,\"a\",IF(A195<=$V$6,\"b\",IF(A195<=$V$8,\"c\",IF(A195<=$V$10,\"d\",IF(A195<=$V$12,\"e\",\"ERROR\")))))","v":"c"},{"$f":"IF($C195=\"a\",1,NA())","v":{"$error":"#N/A"}},{"$f":"IF($C195=\"b\",1,NA())","v":{"$error":"#N/A"}},{"$f":"IF($C195=\"c\",1,NA())","v":1},{"$f":"IF($C195=\"d\",1,NA())","v":{"$error":"#N/A"}},{"$f":"IF($C195=\"e\",1,NA())","v":{"$error":"#N/A"}},0.77809798270893582]
[{"$f":"PivotSheet!A196","v":368},{"$f":"PivotSheet!B196","v":1},"c",{"$error":"#N/A"},{"$error":"#N/A"},1,{"$error":"#N/A"},{"$error":"#N/A"},{"$f":"B196/SUM($B$2:$B$1000)+I195","v":0.78097982708933933}]
[{"$f":"PivotSheet!A197","v":369},{"$f":"PivotSheet!B197","v":2},"c",{"$error":"#N/A"},{"$error":"#N/A"},1,{"$error":"#N/A"},{"$error":"#N/A"},0.78674351585014624]
[{"$f":"PivotSheet!A198","v":373},{"$f":"PivotSheet!B198","v":1},"c",{"$error":"#N/A"},{"$error":"#N/A"},1,{"$error":"#N/A"},{"$error":"#N/A"},0.78962536023054974]
[{"$f":"PivotSheet!A199","v":375},{"$f":"PivotSheet!B199","v":1},"c",{"$error":"#N/A"},{"$error":"#N/A"},1,{"$error":"#N/A"},{"$error":"#N/A"},0.79250720461095325]
[{"$f":"PivotSheet!A200","v":376},{"$f":"PivotSheet!B200","v":1},"c",{"$error":"#N/A"},{"$error":"#N/A"},1,{"$error":"#N/A"},{"$error":"#N/A"},0.79538904899135676]
[{"$f":"PivotSheet!A201","v":378},{"$f":"PivotSheet!B201","v":1},"c",{"$error":"#N/A"},{"$error":"#N/A"},1,{"$error":"#N/A"},{"$error":"#N/A"},0.79827089337176027]
[{"$f":"PivotSheet!A202","v":380},{"$f":"PivotSheet!B202","v":1},"c",{"$error":"#N/A"},{"$error":"#N/A"},1,{"$error":"#N/A"},{"$error":"#N/A"},0.80115273775216378]
[{"$f":"PivotSheet!A203","v":381},{"$f":"PivotSheet!B203","v":1},"c",{"$error":"#N/A"},{"$error":"#N/A"},1,{"$error":"#N/A"},{"$error":"#N/A"},0.80403458213256729]
[{"$f":"PivotSheet!A204","v":382},{"$f":"PivotSheet!B204","v":1},"c",{"$error":"#N/A"},{"$error":"#N/A"},1,{"$error":"#N/A"},{"$error":"#N/A"},0.8069164265129708]
[{"$f":"PivotSheet!A205","v":383},{"$f":"PivotSheet!B205","v":1},"c",{"$error":"#N/A"},{"$error":"#N/A"},1,{"$error":"#N/A"},{"$error":"#N/A"},0.80979827089337431]
[{"$f":"PivotSheet!A206","v":385},{"$f":"PivotSheet!B206","v":1},"c",{"$error":"#N/A"},{"$error":"#N/A"},1,{"$error":"#N/A"},{"$error":"#N/A"},0.81268011527377781]
[{"$f":"PivotSheet!A207","v":388},{"$f":"PivotSheet!B207","v":1},"c",{"$error":"#N/A"},{"$error":"#N/A"},1,{"$error":"#N/A"},{"$error":"#N/A"},0.81556195965418132]
[{"$f":"PivotSheet!A208","v":389},{"$f":"PivotSheet!B208","v":1},"c",{"$error":"#N/A"},{"$error":"#N/A"},1,{"$error":"#N/A"},{"$error":"#N/A"},0.81844380403458483]
[{"$f":"PivotSheet!A209","v":390},{"$f":"PivotSheet!B209","v":2},"c",{"$error":"#N/A"},{"$error":"#N/A"},1,{"$error":"#N/A"},{"$error":"#N/A"},0.82420749279539174]
[{"$f":"PivotSheet!A210","v":391},{"$f":"PivotSheet!B210","v":1},"c",{"$error":"#N/A"},{"$error":"#N/A"},1,{"$error":"#N/A"},{"$error":"#N/A"},0.82708933717579525]
[{"$f":"PivotSheet!A211","v":392},{"$f":"PivotSheet!B211","v":1},"c",{"$error":"#N/A"},{"$error":"#N/A"},1,{"$error":"#N/A"},{"$error":"#N/A"},0.82997118155619876]
[{"$f":"PivotSheet!A212","v":393},{"$f":"PivotSheet!B212","v":1},"c",{"$error":"#N/A"},{"$error":"#N/A"},1,{"$error":"#N/A"},{"$error":"#N/A"},0.83285302593660226]
[{"$f":"PivotSheet!A213","v":394},{"$f":"PivotSheet!B213","v":1},"c",{"$error":"#N/A"},{"$error":"#N/A"},1,{"$error":"#N/A"},{"$error":"#N/A"},0.83573487031700577]
[{"$f":"PivotSheet!A214","v":395},{"$f":"PivotSheet!B214","v":1},"c",{"$error":"#N/A"},{"$error":"#N/A"},1,{"$error":"#N/A"},{"$error":"#N/A"},0.83861671469740928]
[{"$f":"PivotSheet!A215","v":398},{"$f":"PivotSheet!B215","v":1},"c",{"$error":"#N/A"},{"$error":"#N/A"},1,{"$error":"#N/A"},{"$error":"#N/A"},0.84149855907781279]
[{"$f":"PivotSheet!A216","v":399},{"$f":"PivotSheet!B216","v":2},"c",{"$error":"#N/A"},{"$error":"#N/A"},1,{"$error":"#N/A"},{"$error":"#N/A"},0.8472622478386197]
[{"$f":"PivotSheet!A217","v":403},{"$f":"PivotSheet!B217","v":1},"c",{"$error":"#N/A"},{"$error":"#N/A"},1,{"$error":"#N/A"},{"$error":"#N/A"},0.85014409221902321]
[{"$f":"PivotSheet!A218","v":405},{"$f":"PivotSheet!B218","v":1},"c",{"$error":"#N/A"},{"$error":"#N/A"},1,{"$error":"#N/A"},{"$error":"#N/A"},0.85302593659942672]
[{"$f":"PivotSheet!A219","v":406},{"$f":"PivotSheet!B219","v":1},"c",{"$error":"#N/A"},{"$error":"#N/A"},1,{"$error":"#N/A"},{"$error":"#N/A"},0.85590778097983022]
[{"$f":"PivotSheet!A220","v":408},{"$f":"PivotSheet!B220","v":1},"c",{"$error":"#N/A"},{"$error":"#N/A"},1,{"$error":"#N/A"},{"$error":"#N/A"},0.85878962536023373]
[{"$f":"PivotSheet!A221","v":411},{"$f":"PivotSheet!B221","v":3},"c",{"$error":"#N/A"},{"$error":"#N/A"},1,{"$error":"#N/A"},{"$error":"#N/A"},0.86743515850144415]
[{"$f":"PivotSheet!A222","v":416},{"$f":"PivotSheet!B222","v":1},"c",{"$error":"#N/A"},{"$error":"#N/A"},1,{"$error":"#N/A"},{"$error":"#N/A"},0.87031700288184766]
[{"$f":"PivotSheet!A223","v":417},{"$f":"PivotSheet!B223","v":2},"c",{"$error":"#N/A"},{"$error":"#N/A"},1,{"$error":"#N/A"},{"$error":"#N/A"},0.87608069164265456]
[{"$f":"PivotSheet!A224","v":418},{"$f":"PivotSheet!B224","v":1},"c",{"$error":"#N/A"},{"$error":"#N/A"},1,{"$error":"#N/A"},{"$error":"#N/A"},0.87896253602305807]
[{"$f":"PivotSheet!A225","v":419},{"$f":"PivotSheet!B225","v":1},"c",{"$error":"#N/A"},{"$error":"#N/A"},1,{"$error":"#N/A"},{"$error":"#N/A"},0.88184438040346158]
[{"$f":"PivotSheet!A226","v":421},{"$f":"PivotSheet!B226","v":1},"c",{"$error":"#N/A"},{"$error":"#N/A"},1,{"$error":"#N/A"},{"$error":"#N/A"},0.88472622478386509]
[{"$f":"PivotSheet!A227","v":423},{"$f":"PivotSheet!B227","v":1},"c",{"$error":"#N/A"},{"$error":"#N/A"},1,{"$error":"#N/A"},{"$error":"#N/A"},0.8876080691642686]
[{"$f":"PivotSheet!A228","v":428},{"$f":"PivotSheet!B228","v":1},"c",{"$error":"#N/A"},{"$error":"#N/A"},1,{"$error":"#N/A"},{"$error":"#N/A"},0.89048991354467211]
[{"$f":"PivotSheet!A229","v":435},{"$f":"PivotSheet!B229","v":2},"c",{"$error":"#N/A"},{"$error":"#N/A"},1,{"$error":"#N/A"},{"$error":"#N/A"},0.89625360230547901]
[{"$f":"PivotSheet!A230","v":439},{"$f":"PivotSheet!B230","v":1},"c",{"$error":"#N/A"},{"$error":"#N/A"},1,{"$error":"#N/A"},{"$error":"#N/A"},0.89913544668588252]
[{"$f":"PivotSheet!A231","v":441},{"$f":"PivotSheet!B231","v":1},"c",{"$error":"#N/A"},{"$error":"#N/A"},1,{"$error":"#N/A"},{"$error":"#N/A"},0.90201729106628603]
[{"$f":"PivotSheet!A232","v":447},{"$f":"PivotSheet!B232","v":1},"c",{"$error":"#N/A"},{"$error":"#N/A"},1,{"$error":"#N/A"},{"$error":"#N/A"},0.90489913544668954]
[{"$f":"PivotSheet!A233","v":449},{"$f":"PivotSheet!B233","v":1},"c",{"$error":"#N/A"},{"$error":"#N/A"},1,{"$error":"#N/A"},{"$error":"#N/A"},0.90778097982709305]
[{"$f":"PivotSheet!A234","v":453},{"$f":"PivotSheet!B234","v":3},"c",{"$error":"#N/A"},{"$error":"#N/A"},1,{"$error":"#N/A"},{"$error":"#N/A"},0.91642651296830346]
[{"$f":"PivotSheet!A235","v":455},{"$f":"PivotSheet!B235","v":1},"c",{"$error":"#N/A"},{"$error":"#N/A"},1,{"$error":"#N/A"},{"$error":"#N/A"},0.91930835734870697]
[{"$f":"PivotSheet!A236","v":459},{"$f":"PivotSheet!B236","v":2},"c",{"$error":"#N/A"},{"$error":"#N/A"},1,{"$error":"#N/A"},{"$error":"#N/A"},0.92507204610951388]
[{"$f":"PivotSheet!A237","v":460},{"$f":"PivotSheet!B237","v":1},"c",{"$error":"#N/A"},{"$error":"#N/A"},1,{"$error":"#N/A"},{"$error":"#N/A"},0.92795389048991739]
[{"$f":"PivotSheet!A238","v":461},{"$f":"PivotSheet!B238","v":1},"c",{"$error":"#N/A"},{"$error":"#N/A"},1,{"$error":"#N/A"},{"$error":"#N/A"},0.9308357348703209]
[{"$f":"PivotSheet!A239","v":466},{"$f":"PivotSheet!B239","v":1},"c",{"$error":"#N/A"},{"$error":"#N/A"},1,{"$error":"#N/A"},{"$error":"#N/A"},0.93371757925072441]
[{"$f":"PivotSheet!A240","v":467},{"$f":"PivotSheet!B240","v":1},"c",{"$error":"#N/A"},{"$error":"#N/A"},1,{"$error":"#N/A"},{"$error":"#N/A"},0.93659942363112791]
[{"$f":"PivotSheet!A241","v":469},{"$f":"PivotSheet!B241","v":2},"c",{"$error":"#N/A"},{"$error":"#N/A"},1,{"$error":"#N/A"},{"$error":"#N/A"},0.94236311239193482]
[{"$f":"PivotSheet!A242","v":475},{"$f":"PivotSheet!B242","v":1},"c",{"$error":"#N/A"},{"$error":"#N/A"},1,{"$error":"#N/A"},{"$error":"#N/A"},0.94524495677233833]
[{"$f":"PivotSheet!A243","v":476},{"$f":"PivotSheet!B243","v":3},"c",{"$error":"#N/A"},{"$error":"#N/A"},1,{"$error":"#N/A"},{"$error":"#N/A"},0.95389048991354874]
[{"$f":"PivotSheet!A244","v":480},{"$f":"PivotSheet!B244","v":1},"c",{"$error":"#N/A"},{"$error":"#N/A"},1,{"$error":"#N/A"},{"$error":"#N/A"},0.95677233429395225]
[{"$f":"PivotSheet!A245","v":483},{"$f":"PivotSheet!B245","v":1},"c",{"$error":"#N/A"},{"$error":"#N/A"},1,{"$error":"#N/A"},{"$error":"#N/A"},0.95965417867435576]
[{"$f":"PivotSheet!A246","v":484},{"$f":"PivotSheet!B246","v":1},"c",{"$error":"#N/A"},{"$error":"#N/A"},1,{"$error":"#N/A"},{"$error":"#N/A"},0.96253602305475927]
[{"$f":"PivotSheet!A247","v":485},{"$f":"PivotSheet!B247","v":1},"c",{"$error":"#N/A"},{"$error":"#N/A"},1,{"$error":"#N/A"},{"$error":"#N/A"},0.96541786743516278]
[{"$f":"PivotSheet!A248","v":487},{"$f":"PivotSheet!B248","v":1},"c",{"$error":"#N/A"},{"$error":"#N/A"},1,{"$error":"#N/A"},{"$error":"#N/A"},0.96829971181556629]
[{"$f":"PivotSheet!A249","v":488},{"$f":"PivotSheet!B249","v":3},"c",{"$error":"#N/A"},{"$error":"#N/A"},1,{"$error":"#N/A"},{"$error":"#N/A"},0.9769452449567767]
[{"$f":"PivotSheet!A250","v":489},{"$f":"PivotSheet!B250","v":2},"c",{"$error":"#N/A"},{"$error":"#N/A"},1,{"$error":"#N/A"},{"$error":"#N/A"},0.98270893371758361]
[{"$f":"PivotSheet!A251","v":490},{"$f":"PivotSheet!B251","v":1},"c",{"$error":"#N/A"},{"$error":"#N/A"},1,{"$error":"#N/A"},{"$error":"#N/A"},0.98559077809798712]
[{"$f":"PivotSheet!A252","v":494},{"$f":"PivotSheet!B252","v":1},"c",{"$error":"#N/A"},{"$error":"#N/A"},1,{"$error":"#N/A"},{"$error":"#N/A"},0.98847262247839063]
[{"$f":"PivotSheet!A253","v":496},{"$f":"PivotSheet!B253","v":1},"c",{"$error":"#N/A"},{"$error":"#N/A"},1,{"$error":"#N/A"},{"$error":"#N/A"},0.99135446685879414]
[{"$f":"PivotSheet!A254","v":497},{"$f":"PivotSheet!B254","v":1},"c",{"$error":"#N/A"},{"$error":"#N/A"},1,{"$error":"#N/A"},{"$error":"#N/A"},0.99423631123919765]
[{"$f":"PivotSheet!A255","v":498},{"$f":"PivotSheet!B255","v":2},"c",{"$error":"#N/A"},{"$error":"#N/A"},1,{"$error":"#N/A"},{"$error":"#N/A"},1.0000000000000047]
[{"$f":"PivotSheet!A256","v":"(blank)"},{"$f":"PivotSheet!B256","v":0},{"$error":"#N/A"},{"$error":"#N/A"},{"$error":"#N/A"},{"$error":"#N/A"},{"$error":"#N/A"},{"$error":"#N/A"},1.0000000000000047]
[{"$f":"PivotSheet!A257","v":0},{"$f":"PivotSheet!B257","v":0},"a",1,{"$error":"#N/A"},{"$error":"#N/A"},{"$error":"#N/A"},{"$error":"#N/A"},1.0000000000000047]
[{"$f":"PivotSheet!A258","v":0},{"$f":"PivotSheet!B258","v":0},"a",1,{"$error":"#N/A"},{"$error":"#N/A"},{"$error":"#N/A"},{"$error":"#N/A"},1.0000000000000047]
[{"$f":"PivotSheet!A259","v":0},{"$f":"PivotSheet!B259","v":0},{"$f":"IF(A259<=$V$4,\"a\",IF(A259<=$V$6,\"b\",IF(A259<=$V$8,\"c\",IF(A259<=$V$10,\"d\",IF(A259<=$V$12,\"e\",\"ERROR\")))))","v":"a"},{"$f":"IF($C259=\"a\",1,NA())","v":1},{"$f":"IF($C259=\"b\",1,NA())","v":{"$error":"#N/A"}},{"$f":"IF($C259=\"c\",1,NA())","v":{"$error":"#N/A"}},{"$f":"IF($C259=\"d\",1,NA())","v":{"$error":"#N/A"}},{"$f":"IF($C259=\"e\",1,NA())","v":{"$error":"#N/A"}},1.0000000000000047]
[{"$f":"PivotSheet!A260","v":0},{"$f":"PivotSheet!B260","v":0},"a",1,{"$error":"#N/A"},{"$error":"#N/A"},{"$error":"#N/A"},{"$error":"#N/A"},{"$f":"B260/SUM($B$2:$B$1000)+I259","v":1.0000000000000047}]
[{"$f":"PivotSheet!A261","v":0},{"$f":"PivotSheet!B261","v":0},"a",1,{"$error":"#N/A"},{"$error":"#N/A"},{"$error":"#N/A"},{"$error":"#N/A"},1.0000000000000047]
[{"$f":"PivotSheet!A262","v":0},{"$f":"PivotSheet!B262","v":0},"a",1,{"$error":"#N/A"},{"$error":"#N/A"},{"$error":"#N/A"},{"$error":"#N/A"},1.0000000000000047]
[{"$f":"PivotSheet!A263","v":0},{"$f":"PivotSheet!B263","v":0},"a",1,{"$error":"#N/A"},{"$error":"#N/A"},{"$error":"#N/A"},{"$error":"#N/A"},1.0000000000000047]
[{"$f":"PivotSheet!A264","v":0},{"$f":"PivotSheet!B264","v":0},"a",1,{"$error":"#N/A"},{"$error":"#N/A"},{"$error":"#N/A"},{"$error":"#N/A"},1.0000000000000047]
[{"$f":"PivotSheet!A265","v":0},{"$f":"PivotSheet!B265","v":0},"a",1,{"$error":"#N/A"},{"$error":"#N/A"},{"$error":"#N/A"},{"$error":"#N/A"},1.0000000000000047]
[{"$f":"PivotSheet!A266","v":0},{"$f":"PivotSheet!B266","v":0},"a",1,{"$error":"#N/A"},{"$error":"#N/A"},{"$error":"#N/A"},{"$error":"#N/A"},1.0000000000000047]
[{"$f":"PivotSheet!A267","v":0},{"$f":"PivotSheet!B267","v":0},"a",1,{"$error":"#N/A"},{"$error":"#N/A"},{"$error":"#N/A"},{"$error":"#N/A"},1.0000000000000047]
[{"$f":"PivotSheet!A268","v":0},{"$f":"PivotSheet!B268","v":0},"a",1,{"$error":"#N/A"},{"$error":"#N/A"},{"$error":"#N/A"},{"$error":"#N/A"},1.0000000000000047]
[{"$f":"PivotSheet!A269","v":0},{"$f":"PivotSheet!B269","v":0},"a",1,{"$error":"#N/A"},{"$error":"#N/A"},{"$error":"#N/A"},{"$error":"#N/A"},1.0000000000000047]
[{"$f":"PivotSheet!A270","v":0},{"$f":"PivotSheet!B270","v":0},"a",1,{"$error":"#N/A"},{"$error":"#N/A"},{"$error":"#N/A"},{"$error":"#N/A"},1.0000000000000047]
[{"$f":"PivotSheet!A271","v":0},{"$f":"PivotSheet!B271","v":0},"a",1,{"$error":"#N/A"},{"$error":"#N/A"},{"$error":"#N/A"},{"$error":"#N/A"},1.0000000000000047]
[{"$f":"PivotSheet!A272","v":0},{"$f":"PivotSheet!B272","v":0},"a",1,{"$error":"#N/A"},{"$error":"#N/A"},{"$error":"#N/A"},{"$error":"#N/A"},1.0000000000000047]
[{"$f":"PivotSheet!A273","v":0},{"$f":"PivotSheet!B273","v":0},"a",1,{"$error":"#N/A"},{"$error":"#N/A"},{"$error":"#N/A"},{"$error":"#N/A"},1.0000000000000047]
[{"$f":"PivotSheet!A274","v":0},{"$f":"PivotSheet!B274","v":0},"a",1,{"$error":"#N/A"},{"$error":"#N/A"},{"$error":"#N/A"},{"$error":"#N/A"},1.0000000000000047]
[{"$f":"PivotSheet!A275","v":0},{"$f":"PivotSheet!B275","v":0},"a",1,{"$error":"#N/A"},{"$error":"#N/A"},{"$error":"#N/A"},{"$error":"#N/A"},1.0000000000000047]
[{"$f":"PivotSheet!A276","v":0},{"$f":"PivotSheet!B276","v":0},"a",1,{"$error":"#N/A"},{"$error":"#N/A"},{"$error":"#N/A"},{"$error":"#N/A"},1.0000000000000047]
[{"$f":"PivotSheet!A277","v":0},{"$f":"PivotSheet!B277","v":0},"a",1,{"$error":"#N/A"},{"$error":"#N/A"},{"$error":"#N/A"},{"$error":"#N/A"},1.0000000000000047]
[{"$f":"PivotSheet!A278","v":0},{"$f":"PivotSheet!B278","v":0},"a",1,{"$error":"#N/A"},{"$error":"#N/A"},{"$error":"#N/A"},{"$error":"#N/A"},1.0000000000000047]
[{"$f":"PivotSheet!A279","v":0},{"$f":"PivotSheet!B279","v":0},"a",1,{"$error":"#N/A"},{"$error":"#N/A"},{"$error":"#N/A"},{"$error":"#N/A"},1.0000000000000047]
[{"$f":"PivotSheet!A280","v":0},{"$f":"PivotSheet!B280","v":0},"a",1,{"$error":"#N/A"},{"$error":"#N/A"},{"$error":"#N/A"},{"$error":"#N/A"},1.0000000000000047]
[{"$f":"PivotSheet!A281","v":0},{"$f":"PivotSheet!B281","v":0},"a",1,{"$error":"#N/A"},{"$error":"#N/A"},{"$error":"#N/A"},{"$error":"#N/A"},1.0000000000000047]
[{"$f":"PivotSheet!A282","v":0},{"$f":"PivotSheet!B282","v":0},"a",1,{"$error":"#N/A"},{"$error":"#N/A"},{"$error":"#N/A"},{"$error":"#N/A"},1.0000000000000047]
[{"$f":"PivotSheet!A283","v":0},{"$f":"PivotSheet!B283","v":0},"a",1,{"$error":"#N/A"},{"$error":"#N/A"},{"$error":"#N/A"},{"$error":"#N/A"},1.0000000000000047]
[{"$f":"PivotSheet!A284","v":0},{"$f":"PivotSheet!B284","v":0},"a",1,{"$error":"#N/A"},{"$error":"#N/A"},{"$error":"#N/A"},{"$error":"#N/A"},1.0000000000000047]
[{"$f":"PivotSheet!A285","v":0},{"$f":"PivotSheet!B285","v":0},"a",1,{"$error":"#N/A"},{"$error":"#N/A"},{"$error":"#N/A"},{"$error":"#N/A"},1.0000000000000047]
[{"$f":"PivotSheet!A286","v":0},{"$f":"PivotSheet!B286","v":0},"a",1,{"$error":"#N/A"},{"$error":"#N/A"},{"$error":"#N/A"},{"$error":"#N/A"},1.0000000000000047]
[{"$f":"PivotSheet!A287","v":0},{"$f":"PivotSheet!B287","v":0},"a",1,{"$error":"#N/A"},{"$error":"#N/A"},{"$error":"#N/A"},{"$error":"#N/A"},1.0000000000000047]
[{"$f":"PivotSheet!A288","v":0},{"$f":"PivotSheet!B288","v":0},"a",1,{"$error":"#N/A"},{"$error":"#N/A"},{"$error":"#N/A"},{"$error":"#N/A"},1.0000000000000047]
[{"$f":"PivotSheet!A289","v":0},{"$f":"PivotSheet!B289","v":0},"a",1,{"$error":"#N/A"},{"$error":"#N/A"},{"$error":"#N/A"},{"$error":"#N/A"},1.0000000000000047]
[{"$f":"PivotSheet!A290","v":0},{"$f":"PivotSheet!B290","v":0},"a",1,{"$error":"#N/A"},{"$error":"#N/A"},{"$error":"#N/A"},{"$error":"#N/A"},1.0000000000000047]
[{"$f":"PivotSheet!A291","v":0},{"$f":"PivotSheet!B291","v":0},"a",1,{"$error":"#N/A"},{"$error":"#N/A"},{"$error":"#N/A"},{"$error":"#N/A"},1.0000000000000047]
[{"$f":"PivotSheet!A292","v":0},{"$f":"PivotSheet!B292","v":0},"a",1,{"$error":"#N/A"},{"$error":"#N/A"},{"$error":"#N/A"},{"$error":"#N/A"},1.0000000000000047]
[{"$f":"PivotSheet!A293","v":0},{"$f":"PivotSheet!B293","v":0},"a",1,{"$error":"#N/A"},{"$error":"#N/A"},{"$error":"#N/A"},{"$error":"#N/A"},1.0000000000000047]
[{"$f":"PivotSheet!A294","v":0},{"$f":"PivotSheet!B294","v":0},"a",1,{"$error":"#N/A"},{"$error":"#N/A"},{"$error":"#N/A"},{"$error":"#N/A"},1.0000000000000047]
[{"$f":"PivotSheet!A295","v":0},{"$f":"PivotSheet!B295","v":0},"a",1,{"$error":"#N/A"},{"$error":"#N/A"},{"$error":"#N/A"},{"$error":"#N/A"},1.0000000000000047]
[{"$f":"PivotSheet!A296","v":0},{"$f":"PivotSheet!B296","v":0},"a",1,{"$error":"#N/A"},{"$error":"#N/A"},{"$error":"#N/A"},{"$error":"#N/A"},1.0000000000000047]
[{"$f":"PivotSheet!A297","v":0},{"$f":"PivotSheet!B297","v":0},"a",1,{"$error":"#N/A"},{"$error":"#N/A"},{"$error":"#N/A"},{"$error":"#N/A"},1.0000000000000047]
[{"$f":"PivotSheet!A298","v":0},{"$f":"PivotSheet!B298","v":0},"a",1,{"$error":"#N/A"},{"$error":"#N/A"},{"$error":"#N/A"},{"$error":"#N/A"},1.0000000000000047]
[{"$f":"PivotSheet!A299","v":0},{"$f":"PivotSheet!B299","v":0},"a",1,{"$error":"#N/A"},{"$error":"#N/A"},{"$error":"#N/A"},{"$error":"#N/A"},1.0000000000000047]
[{"$f":"PivotSheet!A300","v":0},{"$f":"PivotSheet!B300","v":0},"a",1,{"$error":"#N/A"},{"$error":"#N/A"},{"$error":"#N/A"},{"$error":"#N/A"},1.0000000000000047]
[{"$f":"PivotSheet!A301","v":0},{"$f":"PivotSheet!B301","v":0},"a",1,{"$error":"#N/A"},{"$error":"#N/A"},{"$error":"#N/A"},{"$error":"#N/A"},1.0000000000000047]
[{"$f":"PivotSheet!A302","v":0},{"$f":"PivotSheet!B302","v":0},"a",1,{"$error":"#N/A"},{"$error":"#N/A"},{"$error":"#N/A"},{"$error":"#N/A"},1.0000000000000047]
[{"$f":"PivotSheet!A303","v":0},{"$f":"PivotSheet!B303","v":0},"a",1,{"$error":"#N/A"},{"$error":"#N/A"},{"$error":"#N/A"},{"$error":"#N/A"},1.0000000000000047]
[{"$f":"PivotSheet!A304","v":0},{"$f":"PivotSheet!B304","v":0},"a",1,{"$error":"#N/A"},{"$error":"#N/A"},{"$error":"#N/A"},{"$error":"#N/A"},1.0000000000000047]
[{"$f":"PivotSheet!A305","v":0},{"$f":"PivotSheet!B305","v":0},"a",1,{"$error":"#N/A"},{"$error":"#N/A"},{"$error":"#N/A"},{"$error":"#N/A"},1.0000000000000047]
[{"$f":"PivotSheet!A306","v":0},{"$f":"PivotSheet!B306","v":0},"a",1,{"$error":"#N/A"},{"$error":"#N/A"},{"$error":"#N/A"},{"$error":"#N/A"},1.0000000000000047]
[{"$f":"PivotSheet!A307","v":0},{"$f":"PivotSheet!B307","v":0},"a",1,{"$error":"#N/A"},{"$error":"#N/A"},{"$error":"#N/A"},{"$error":"#N/A"},1.0000000000000047]
[{"$f":"PivotSheet!A308","v":0},{"$f":"PivotSheet!B308","v":0},"a",1,{"$error":"#N/A"},{"$error":"#N/A"},{"$error":"#N/A"},{"$error":"#N/A"},1.0000000000000047]
[{"$f":"PivotSheet!A309","v":0},{"$f":"PivotSheet!B309","v":0},"a",1,{"$error":"#N/A"},{"$error":"#N/A"},{"$error":"#N/A"},{"$error":"#N/A"},1.0000000000000047]
[{"$f":"PivotSheet!A310","v":0},{"$f":"PivotSheet!B310","v":0},"a",1,{"$error":"#N/A"},{"$error":"#N/A"},{"$error":"#N/A"},{"$error":"#N/A"},1.0000000000000047]
[{"$f":"PivotSheet!A311","v":0},{"$f":"PivotSheet!B311","v":0},"a",1,{"$error":"#N/A"},{"$error":"#N/A"},{"$error":"#N/A"},{"$error":"#N/A"},1.0000000000000047]
[{"$f":"PivotSheet!A312","v":0},{"$f":"PivotSheet!B312","v":0},"a",1,{"$error":"#N/A"},{"$error":"#N/A"},{"$error":"#N/A"},{"$error":"#N/A"},1.0000000000000047]
[{"$f":"PivotSheet!A313","v":0},{"$f":"PivotSheet!B313","v":0},"a",1,{"$error":"#N/A"},{"$error":"#N/A"},{"$error":"#N/A"},{"$error":"#N/A"},1.0000000000000047]
[{"$f":"PivotSheet!A314","v":0},{"$f":"PivotSheet!B314","v":0},"a",1,{"$error":"#N/A"},{"$error":"#N/A"},{"$error":"#N/A"},{"$error":"#N/A"},1.0000000000000047]
[{"$f":"PivotSheet!A315","v":0},{"$f":"PivotSheet!B315","v":0},"a",1,{"$error":"#N/A"},{"$error":"#N/A"},{"$error":"#N/A"},{"$error":"#N/A"},1.0000000000000047]
[{"$f":"PivotSheet!A316","v":0},{"$f":"PivotSheet!B316","v":0},"a",1,{"$error":"#N/A"},{"$error":"#N/A"},{"$error":"#N/A"},{"$error":"#N/A"},1.0000000000000047]
[{"$f":"PivotSheet!A317","v":0},{"$f":"PivotSheet!B317","v":0},"a",1,{"$error":"#N/A"},{"$error":"#N/A"},{"$error":"#N/A"},{"$error":"#N/A"},1.0000000000000047]
[{"$f":"PivotSheet!A318","v":0},{"$f":"PivotSheet!B318","v":0},"a",1,{"$error":"#N/A"},{"$error":"#N/A"},{"$error":"#N/A"},{"$error":"#N/A"},1.0000000000000047]
[{"$f":"PivotSheet!A319","v":0},{"$f":"PivotSheet!B319","v":0},"a",1,{"$error":"#N/A"},{"$error":"#N/A"},{"$error":"#N/A"},{"$error":"#N/A"},1.0000000000000047]
[{"$f":"PivotSheet!A320","v":0},{"$f":"PivotSheet!B320","v":0},"a",1,{"$error":"#N/A"},{"$error":"#N/A"},{"$error":"#N/A"},{"$error":"#N/A"},1.0000000000000047]
[{"$f":"PivotSheet!A321","v":0},{"$f":"PivotSheet!B321","v":0},"a",1,{"$error":"#N/A"},{"$error":"#N/A"},{"$error":"#N/A"},{"$error":"#N/A"},1.0000000000000047]
[{"$f":"PivotSheet!A322","v":0},{"$f":"PivotSheet!B322","v":0},"a",1,{"$error":"#N/A"},{"$error":"#N/A"},{"$error":"#N/A"},{"$error":"#N/A"},1.0000000000000047]
[{"$f":"PivotSheet!A323","v":0},{"$f":"PivotSheet!B323","v":0},{"$f":"IF(A323<=$V$4,\"a\",IF(A323<=$V$6,\"b\",IF(A323<=$V$8,\"c\",IF(A323<=$V$10,\"d\",IF(A323<=$V$12,\"e\",\"ERROR\")))))","v":"a"},{"$f":"IF($C323=\"a\",1,NA())","v":1},{"$f":"IF($C323=\"b\",1,NA())","v":{"$error":"#N/A"}},{"$f":"IF($C323=\"c\",1,NA())","v":{"$error":"#N/A"}},{"$f":"IF($C323=\"d\",1,NA())","v":{"$error":"#N/A"}},{"$f":"IF($C323=\"e\",1,NA())","v":{"$error":"#N/A"}},1.0000000000000047]
[{"$f":"PivotSheet!A324","v":0},{"$f":"PivotSheet!B324","v":0},"a",1,{"$error":"#N/A"},{"$error":"#N/A"},{"$error":"#N/A"},{"$error":"#N/A"},{"$f":"B324/SUM($B$2:$B$1000)+I323","v":1.0000000000000047}]
[{"$f":"PivotSheet!A325","v":0},{"$f":"PivotSheet!B325","v":0},"a",1,{"$error":"#N/A"},{"$error":"#N/A"},{"$error":"#N/A"},{"$error":"#N/A"},1.0000000000000047]
[{"$f":"PivotSheet!A326","v":0},{"$f":"PivotSheet!B326","v":0},"a",1,{"$error":"#N/A"},{"$error":"#N/A"},{"$error":"#N/A"},{"$error":"#N/A"},1.0000000000000047]
[{"$f":"PivotSheet!A327","v":0},{"$f":"PivotSheet!B327","v":0},"a",1,{"$error":"#N/A"},{"$error":"#N/A"},{"$error":"#N/A"},{"$error":"#N/A"},1.0000000000000047]
[{"$f":"PivotSheet!A328","v":0},{"$f":"PivotSheet!B328","v":0},"a",1,{"$error":"#N/A"},{"$error":"#N/A"},{"$error":"#N/A"},{"$error":"#N/A"},1.0000000000000047]
[{"$f":"PivotSheet!A329","v":0},{"$f":"PivotSheet!B329","v":0},"a",1,{"$error":"#N/A"},{"$error":"#N/A"},{"$error":"#N/A"},{"$error":"#N/A"},1.0000000000000047]
[{"$f":"PivotSheet!A330","v":0},{"$f":"PivotSheet!B330","v":0},"a",1,{"$error":"#N/A"},{"$error":"#N/A"},{"$error":"#N/A"},{"$error":"#N/A"},1.0000000000000047]
[{"$f":"PivotSheet!A331","v":0},{"$f":"PivotSheet!B331","v":0},"a",1,{"$error":"#N/A"},{"$error":"#N/A"},{"$error":"#N/A"},{"$error":"#N/A"},1.0000000000000047]
[{"$f":"PivotSheet!A332","v":0},{"$f":"PivotSheet!B332","v":0},"a",1,{"$error":"#N/A"},{"$error":"#N/A"},{"$error":"#N/A"},{"$error":"#N/A"},1.0000000000000047]
[{"$f":"PivotSheet!A333","v":0},{"$f":"PivotSheet!B333","v":0},"a",1,{"$error":"#N/A"},{"$error":"#N/A"},{"$error":"#N/A"},{"$error":"#N/A"},1.0000000000000047]
[{"$f":"PivotSheet!A334","v":0},{"$f":"PivotSheet!B334","v":0},"a",1,{"$error":"#N/A"},{"$error":"#N/A"},{"$error":"#N/A"},{"$error":"#N/A"},1.0000000000000047]
[{"$f":"PivotSheet!A335","v":0},{"$f":"PivotSheet!B335","v":0},"a",1,{"$error":"#N/A"},{"$error":"#N/A"},{"$error":"#N/A"},{"$error":"#N/A"},1.0000000000000047]
[{"$f":"PivotSheet!A336","v":0},{"$f":"PivotSheet!B336","v":0},"a",1,{"$error":"#N/A"},{"$error":"#N/A"},{"$error":"#N/A"},{"$error":"#N/A"},1.0000000000000047]
[{"$f":"PivotSheet!A337","v":0},{"$f":"PivotSheet!B337","v":0},"a",1,{"$error":"#N/A"},{"$error":"#N/A"},{"$error":"#N/A"},{"$error":"#N/A"},1.0000000000000047]
[{"$f":"PivotSheet!A338","v":0},{"$f":"PivotSheet!B338","v":0},"a",1,{"$error":"#N/A"},{"$error":"#N/A"},{"$error":"#N/A"},{"$error":"#N/A"},1.0000000000000047]
[{"$f":"PivotSheet!A339","v":0},{"$f":"PivotSheet!B339","v":0},"a",1,{"$error":"#N/A"},{"$error":"#N/A"},{"$error":"#N/A"},{"$error":"#N/A"},1.0000000000000047]
[{"$f":"PivotSheet!A340","v":0},{"$f":"PivotSheet!B340","v":0},"a",1,{"$error":"#N/A"},{"$error":"#N/A"},{"$error":"#N/A"},{"$error":"#N/A"},1.0000000000000047]
[{"$f":"PivotSheet!A341","v":0},{"$f":"PivotSheet!B341","v":0},"a",1,{"$error":"#N/A"},{"$error":"#N/A"},{"$error":"#N/A"},{"$error":"#N/A"},1.0000000000000047]
[{"$f":"PivotSheet!A342","v":0},{"$f":"PivotSheet!B342","v":0},"a",1,{"$error":"#N/A"},{"$error":"#N/A"},{"$error":"#N/A"},{"$error":"#N/A"},1.0000000000000047]
[{"$f":"PivotSheet!A343","v":0},{"$f":"PivotSheet!B343","v":0},"a",1,{"$error":"#N/A"},{"$error":"#N/A"},{"$error":"#N/A"},{"$error":"#N/A"},1.0000000000000047]
[{"$f":"PivotSheet!A344","v":0},{"$f":"PivotSheet!B344","v":0},"a",1,{"$error":"#N/A"},{"$error":"#N/A"},{"$error":"#N/A"},{"$error":"#N/A"},1.0000000000000047]
[{"$f":"PivotSheet!A345","v":0},{"$f":"PivotSheet!B345","v":0},"a",1,{"$error":"#N/A"},{"$error":"#N/A"},{"$error":"#N/A"},{"$error":"#N/A"},1.0000000000000047]
[{"$f":"PivotSheet!A346","v":0},{"$f":"PivotSheet!B346","v":0},"a",1,{"$error":"#N/A"},{"$error":"#N/A"},{"$error":"#N/A"},{"$error":"#N/A"},1.0000000000000047]
[{"$f":"PivotSheet!A347","v":0},{"$f":"PivotSheet!B347","v":0},"a",1,{"$error":"#N/A"},{"$error":"#N/A"},{"$error":"#N/A"},{"$error":"#N/A"},1.0000000000000047]
[{"$f":"PivotSheet!A348","v":0},{"$f":"PivotSheet!B348","v":0},"a",1,{"$error":"#N/A"},{"$error":"#N/A"},{"$error":"#N/A"},{"$error":"#N/A"},1.0000000000000047]
[{"$f":"PivotSheet!A349","v":0},{"$f":"PivotSheet!B349","v":0},"a",1,{"$error":"#N/A"},{"$error":"#N/A"},{"$error":"#N/A"},{"$error":"#N/A"},1.0000000000000047]
[{"$f":"PivotSheet!A350","v":0},{"$f":"PivotSheet!B350","v":0},"a",1,{"$error":"#N/A"},{"$error":"#N/A"},{"$error":"#N/A"},{"$error":"#N/A"},1.0000000000000047]
[{"$f":"PivotSheet!A351","v":0},{"$f":"PivotSheet!B351","v":0},"a",1,{"$error":"#N/A"},{"$error":"#N/A"},{"$error":"#N/A"},{"$error":"#N/A"},1.0000000000000047]
[{"$f":"PivotSheet!A352","v":0},{"$f":"PivotSheet!B352","v":0},"a",1,{"$error":"#N/A"},{"$error":"#N/A"},{"$error":"#N/A"},{"$error":"#N/A"},1.0000000000000047]
[{"$f":"PivotSheet!A353","v":0},{"$f":"PivotSheet!B353","v":0},"a",1,{"$error":"#N/A"},{"$error":"#N/A"},{"$error":"#N/A"},{"$error":"#N/A"},1.0000000000000047]
[{"$f":"PivotSheet!A354","v":0},{"$f":"PivotSheet!B354","v":0},"a",1,{"$error":"#N/A"},{"$error":"#N/A"},{"$error":"#N/A"},{"$error":"#N/A"},1.0000000000000047]
[{"$f":"PivotSheet!A355","v":0},{"$f":"PivotSheet!B355","v":0},"a",1,{"$error":"#N/A"},{"$error":"#N/A"},{"$error":"#N/A"},{"$error":"#N/A"},1.0000000000000047]
[{"$f":"PivotSheet!A356","v":0},{"$f":"PivotSheet!B356","v":0},"a",1,{"$error":"#N/A"},{"$error":"#N/A"},{"$error":"#N/A"},{"$error":"#N/A"},1.0000000000000047]
[{"$f":"PivotSheet!A357","v":0},{"$f":"PivotSheet!B357","v":0},"a",1,{"$error":"#N/A"},{"$error":"#N/A"},{"$error":"#N/A"},{"$error":"#N/A"},1.0000000000000047]
[{"$f":"PivotSheet!A358","v":0},{"$f":"PivotSheet!B358","v":0},"a",1,{"$error":"#N/A"},{"$error":"#N/A"},{"$error":"#N/A"},{"$error":"#N/A"},1.0000000000000047]
[{"$f":"PivotSheet!A359","v":0},{"$f":"PivotSheet!B359","v":0},"a",1,{"$error":"#N/A"},{"$error":"#N/A"},{"$error":"#N/A"},{"$error":"#N/A"},1.0000000000000047]
[{"$f":"PivotSheet!A360","v":0},{"$f":"PivotSheet!B360","v":0},"a",1,{"$error":"#N/A"},{"$error":"#N/A"},{"$error":"#N/A"},{"$error":"#N/A"},1.0000000000000047]
[{"$f":"PivotSheet!A361","v":0},{"$f":"PivotSheet!B361","v":0},"a",1,{"$error":"#N/A"},{"$error":"#N/A"},{"$error":"#N/A"},{"$error":"#N/A"},1.0000000000000047]
[{"$f":"PivotSheet!A362","v":0},{"$f":"PivotSheet!B362","v":0},"a",1,{"$error":"#N/A"},{"$error":"#N/A"},{"$error":"#N/A"},{"$error":"#N/A"},1.0000000000000047]
[{"$f":"PivotSheet!A363","v":0},{"$f":"PivotSheet!B363","v":0},"a",1,{"$error":"#N/A"},{"$error":"#N/A"},{"$error":"#N/A"},{"$error":"#N/A"},1.0000000000000047]
[{"$f":"PivotSheet!A364","v":0},{"$f":"PivotSheet!B364","v":0},"a",1,{"$error":"#N/A"},{"$error":"#N/A"},{"$error":"#N/A"},{"$error":"#N/A"},1.0000000000000047]
[{"$f":"PivotSheet!A365","v":0},{"$f":"PivotSheet!B365","v":0},"a",1,{"$error":"#N/A"},{"$error":"#N/A"},{"$error":"#N/A"},{"$error":"#N/A"},1.0000000000000047]