{"text_format":"1","workbook":"xlsx","n_sheets":8,"sheets":["Information","Data","Jenks iteration table","PivotSheet","Jenks","Std. Dev","Quantiles","Equal Interval"],"not_rendered":{"charts":4,"images":1,"macros":1,"external_links":0,"defined_names":33,"comments":0,"pivot_tables":1},"unopened":[],"bounds":{"document_bytes":16777216,"sheet_cells":100000,"rows_first":2000,"rows_last":500,"rows_between":2000,"halvings":0,"cell_chars":16384,"cell_head_chars":4096},"cells_cut":0,"cells_raw":0,"read":"whole","date_system":"1900"}

{"sheet":"Information","index":0,"n_rows":28,"n_cols":22,"rows_kept":28,"cut":false,"hidden":false,"merged":[[3,2,4,2],[5,3,6,3],[5,4,6,4],[5,2,6,2],[3,13,4,13],[5,13,6,13],[5,20,6,20],[5,21,6,21],[3,14,3,15],[3,16,3,17],[3,18,3,19],[5,18,6,18],[5,19,6,19],[7,3,8,3],[7,4,8,4],[9,3,10,3],[11,3,12,3],[13,3,14,3],[9,4,10,4],[11,4,12,4],[13,4,14,4],[3,20,3,21],[3,3,3,4],[3,5,3,6],[3,7,3,8],[3,9,3,10],[7,7,8,7],[7,8,8,8],[9,7,10,7],[5,5,6,5],[5,6,6,6],[7,5,8,5],[7,6,8,6],[9,5,10,5],[9,6,10,6],[7,21,8,21],[9,13,10,13],[7,2,8,2],[9,2,10,2],[11,2,12,2],[5,14,6,14],[5,15,6,15],[5,16,6,16],[5,17,6,17],[11,13,12,13],[11,7,12,7],[11,8,12,8],[5,9,6,9],[5,10,6,10],[7,9,8,9],[7,10,8,10],[9,9,10,9],[9,10,10,10],[7,13,8,13],[9,8,10,8],[11,9,12,9],[11,10,12,10],[11,5,12,5],[11,6,12,6],[5,7,6,7],[5,8,6,8],[9,14,10,14],[9,15,10,15],[9,16,10,16],[9,17,10,17],[9,18,10,18],[9,19,10,19],[9,20,10,20],[9,21,10,21],[7,14,8,14],[7,15,8,15],[7,16,8,16],[7,17,8,17],[7,18,8,18],[7,19,8,19],[7,20,8,20],[11,20,12,20],[11,21,12,21],[13,13,14,13],[13,14,14,14],[13,15,14,15],[13,16,14,16],[13,17,14,17],[13,18,14,18],[13,19,14,19],[13,20,14,20],[11,14,12,14],[11,15,12,15],[11,16,12,16],[11,17,12,17],[11,18,12,18],[11,19,12,19],[19,2,20,2],[19,3,20,3],[19,4,20,4],[19,5,20,5],[19,6,20,6],[19,7,20,7],[21,10,22,10],[13,21,14,21],[17,2,18,2],[17,3,17,4],[17,5,17,6],[17,7,17,8],[17,9,17,10],[13,7,14,7],[13,8,14,8],[13,9,14,9],[13,10,14,10],[13,5,14,5],[13,6,14,6],[13,2,14,2],[23,2,24,2],[23,3,24,3],[23,4,24,4],[23,5,24,5],[23,6,24,6],[23,7,24,7],[23,8,24,8],[23,9,24,9],[1,1,1,22],[2,2,2,10],[2,13,2,21],[16,2,16,10],[23,10,24,10],[21,9,22,9],[19,8,20,8],[19,9,20,9],[19,10,20,10],[21,2,22,2],[21,3,22,3],[21,4,22,4],[21,5,22,5],[21,6,22,6],[21,7,22,7],[21,8,22,8],[27,8,28,8],[27,9,28,9],[27,10,28,10],[27,2,28,2],[27,3,28,3],[27,4,28,4],[27,5,28,5],[27,6,28,6],[27,7,28,7],[25,2,26,2],[25,3,26,3],[25,4,26,4],[25,5,26,5],[25,6,26,6],[25,7,26,7],[25,8,26,8],[25,9,26,9],[25,10,26,10]]}
[]
[null,"Grouping Calculation Information"]
[null,null,"Standard Deviation",null,null,null,null,null,null,null,null,null,null,"Quantiles"]
[null,null,"Level of Intensity",2,null,3,null,4,null,5,null,null,null,"Level of Intensity",2,null,3,null,4,null,5]
[null,null,null,"Min","Max","Min","Max","Min","Max","Min","Max",null,null,null,"Min","Max","Min","Max","Min","Max","Min","Max"]
[null,null,"A Size","Min","Mean","Min","Mean - 1SD","Min","Mean - 1SD","Min","Mean - 1SD",null,null,"A Size","Min","Median","Min","33rd Percentile","Min","25th Percentile","Min","20th Percentile"]
[]
[null,null,"B Size","Mean + 1","Max","Mean - 1SD + 1","Mean + 1SD","Mean - 1SD + 1","Mean","Mean - 1SD + 1","Mean - 0.5*SD",null,null,"B Size","Median + 1","Max","33rd Percentile + 1","66th Percentile","25th Percentile + 1","Median","20th Percentile + 1","40th Percentile"]
[]
[null,null,"C Size",null,null,"Mean + 1SD + 1","Max","Mean + 1","Mean + 1SD","Mean - 0.5*SD + 1","Mean + 0.5*SD",null,null,"C Size",null,null,"66th Percentile + 1","Max","Median + 1","75th Percentile","40th Percentile + 1","60th Percentile"]
{"$rows_left_out":19}
{"sheet":"Data","index":1,"n_rows":20018,"n_cols":33,"rows_kept":20018,"cut":false,"hidden":false,"merged":[[29,30,29,32],[30,30,30,32],[1,7,1,26]]}
[]
[null,"Datapoint Index","Data",null,"Levels of Intensity",3,null,"Enter the data you want to group in column C under the shaded area, then select the number of groups you would like to assign in cell 'F2' ('Levels of intensity'). "]
[null,{"$f":"IF(C3=\"\",\"\",B2+1)","v":{"$error":"#VALUE!"}},3]
[null,{"$f":"IF(#REF!=\"\",\"\",B3+1)","v":{"$error":"#REF!"}},411]
[null,{"$f":"IF(C5=\"\",\"\",B4+1)","v":{"$error":"#REF!"}},4]
[null,{"$error":"#REF!"},2]
[null,{"$error":"#REF!"},339,null,null,null,null,null,null,null,null,null,null,"Group","Min Value","Max Value",null,null,null,null,null,null,null,null,null,null,null,null,null,null,"Group","Min Value","Max Value"]
[null,{"$error":"#REF!"},45,null,null,null,null,null,null,null,null,null,null,"a",{"$f":"IFERROR(INDEX('Std. Dev'!$K$4:$L$26,MATCH(1,(Data!$F$2='Std. Dev'!$M$4:$M$26)*(Data!$N8='Std. Dev'!$N$4:$N$26),0),MATCH(Data!O$7,'Std. Dev'!$K$3:$L$3,0)),\"\")","v":2},{"$f":"IFERROR(INDEX('Std. Dev'!$K$4:$L$26,MATCH(1,(Data!$F$2='Std. Dev'!$M$4:$M$26)*(Data!$N8='Std. Dev'!$N$4:$N$26),0),MATCH(Data!P$7,'Std. Dev'!$K$3:$L$3,0)),\"\")","v":101.81618586118071},null,null,null,null,null,null,null,null,null,null,null,null,null,null,"a",{"$f":"IFERROR(INDEX(Quantiles!$K$4:$L$26,MATCH(1,(Data!$F$2=Quantiles!$M$4:$M$26)*(Data!$AE8=Quantiles!$N$4:$N$26),0),MATCH(Data!AF$7,Quantiles!$K$3:$L$3,0)),\"\")","v":2},{"$f":"IFERROR(INDEX(Quantiles!$K$4:$L$26,MATCH(1,(Data!$F$2=Quantiles!$M$4:$M$26)*(Data!$AE8=Quantiles!$N$4:$N$26),0),MATCH(Data!AG$7,Quantiles!$K$3:$L$3,0)),\"\")","v":158.18}]
[null,{"$error":"#REF!"},310,null,null,null,null,null,null,null,null,null,null,"b",{"$f":"IFERROR(INDEX('Std. Dev'!$K$4:$L$26,MATCH(1,(Data!$F$2='Std. Dev'!$M$4:$M$26)*(Data!$N9='Std. Dev'!$N$4:$N$26),0),MATCH(Data!O$7,'Std. Dev'!$K$3:$L$3,0)),\"\")","v":102.81618586118071},{"$f":"IFERROR(INDEX('Std. Dev'!$K$4:$L$26,MATCH(1,(Data!$F$2='Std. Dev'!$M$4:$M$26)*(Data!$N9='Std. Dev'!$N$4:$N$26),0),MATCH(Data!P$7,'Std. Dev'!$K$3:$L$3,0)),\"\")","v":381.90139338953975},null,null,null,null,null,null,null,null,null,null,null,null,null,null,"b",{"$f":"IFERROR(INDEX(Quantiles!$K$4:$L$26,MATCH(1,(Data!$F$2=Quantiles!$M$4:$M$26)*(Data!$AE9=Quantiles!$N$4:$N$26),0),MATCH(Data!AF$7,Quantiles!$K$3:$L$3,0)),\"\")","v":159.18},{"$f":"IFERROR(INDEX(Quantiles!$K$4:$L$26,MATCH(1,(Data!$F$2=Quantiles!$M$4:$M$26)*(Data!$AE9=Quantiles!$N$4:$N$26),0),MATCH(Data!AG$7,Quantiles!$K$3:$L$3,0)),\"\")","v":319.72000000000003}]
[null,{"$error":"#REF!"},55,null,null,null,null,null,null,null,null,null,null,"c",{"$f":"IFERROR(INDEX('Std. Dev'!$K$4:$L$26,MATCH(1,(Data!$F$2='Std. Dev'!$M$4:$M$26)*(Data!$N10='Std. Dev'!$N$4:$N$26),0),MATCH(Data!O$7,'Std. Dev'!$K$3:$L$3,0)),\"\")","v":382.90139338953975},{"$f":"IFERROR(INDEX('Std. Dev'!$K$4:$L$26,MATCH(1,(Data!$F$2='Std. Dev'!$M$4:$M$26)*(Data!$N10='Std. Dev'!$N$4:$N$26),0),MATCH(Data!P$7,'Std. Dev'!$K$3:$L$3,0)),\"\")","v":498},null,null,null,null,null,null,null,null,null,null,null,null,null,null,"c",{"$f":"IFERROR(INDEX(Quantiles!$K$4:$L$26,MATCH(1,(Data!$F$2=Quantiles!$M$4:$M$26)*(Data!$AE10=Quantiles!$N$4:$N$26),0),MATCH(Data!AF$7,Quantiles!$K$3:$L$3,0)),\"\")","v":320.72000000000003},{"$f":"IFERROR(INDEX(Quantiles!$K$4:$L$26,MATCH(1,(Data!$F$2=Quantiles!$M$4:$M$26)*(Data!$AE10=Quantiles!$N$4:$N$26),0),MATCH(Data!AG$7,Quantiles!$K$3:$L$3,0)),\"\")","v":498}]
{"$rows_left_out":20009}
{"sheet":"Jenks iteration table","index":2,"n_rows":839,"n_cols":6,"rows_kept":839,"cut":false,"hidden":true,"merged":[]}
["Datapoints\\Groups",1,2,3,4,5]
[1,1,0,0,0,0]
[2,1,1,0,0,0]
[3,1,2,1,0,0]
[4,1,3,3,1,0]
[5,1,4,6,4,1]
[6,1,5,10,10,5]
[7,1,6,15,20,15]
[8,1,7,21,35,35]
[9,1,8,28,56,70]
{"$rows_left_out":830}
{"sheet":"PivotSheet","index":3,"n_rows":366,"n_cols":4,"rows_kept":366,"cut":false,"hidden":true,"merged":[]}
["Data","Count of Data",null,"Pivot Index"]
[2,1,null,{"$f":"IF(A2=\"\",\"\",1)","v":1}]
[3,2,null,{"$f":"IF(A3=\"\",\"\",D2+1)","v":2}]
[4,1,null,{"$f":"IF(A4=\"\",\"\",D3+1)","v":3}]
[5,1,null,4]
[6,1,null,5]
[10,2,null,6]
[11,1,null,7]
[12,1,null,8]
[14,1,null,9]
{"$rows_left_out":357}
{"sheet":"Jenks","index":4,"n_rows":366,"n_cols":22,"rows_kept":366,"cut":false,"hidden":true,"merged":[]}
["Data","Group","Frequency","Group 1","Group 2","Group 3","Group 4","Group 5","Cum. Freq"]
[{"$f":"PivotSheet!A2","v":2},"a",{"$f":"PivotSheet!B2","v":1},{"$f":"IF(B2=\"a\",1,NA())","v":1},{"$f":"IF(B2=\"b\",1,NA())","v":{"$error":"#N/A"}},{"$f":"IF(B2=\"c\",1,NA())","v":{"$error":"#N/A"}},{"$f":"IF(B2=\"d\",1,NA())","v":{"$error":"#N/A"}},{"$f":"IF(B2=\"e\",1,NA())","v":{"$error":"#N/A"}},{"$f":"C2/SUM($C$2:$C$10000)","v":2.881844380403458E-3},"2 levels of Intensity",null,null,null,null,null,null,null,null,null,"Group",null,"Std. Dev"]
[{"$f":"PivotSheet!A3","v":3},"a",{"$f":"PivotSheet!B3","v":2},{"$f":"IF(B3=\"a\",1,NA())","v":1},{"$f":"IF(B3=\"b\",1,NA())","v":{"$error":"#N/A"}},{"$f":"IF(B3=\"c\",1,NA())","v":{"$error":"#N/A"}},{"$f":"IF(B3=\"d\",1,NA())","v":{"$error":"#N/A"}},{"$f":"IF(B3=\"e\",1,NA())","v":{"$error":"#N/A"}},{"$f":"C3/SUM($C$2:$C$10000)+I2","v":8.6455331412103736E-3},null,"Min Value","Max Value",null,null,null,null,null,null,null,"a","Min Value",{"$f":"INDEX($K$4:$L$26,MATCH(1,(Data!$F$2=$M$4:$M$26)*(T3=$N$4:$N$26),0),MATCH(U3,$K$3:$L$3,0))","v":2}]
[{"$f":"PivotSheet!A4","v":4},"a",{"$f":"PivotSheet!B4","v":1},1,{"$error":"#N/A"},{"$error":"#N/A"},{"$error":"#N/A"},{"$error":"#N/A"},{"$f":"C4/SUM($C$2:$C$10000)+I3","v":1.1527377521613832E-2},"A-Size",{"$f":"MIN(IF($B$2:$B$365=\"A\",$A$2:$A$365))","v":2},{"$f":"MAX(IF($B$2:$B$365=\"A\",$A$2:$A$365))","v":161},2,"a",null,null,null,null,null,"a","Max Value",{"$f":"INDEX($K$4:$L$26,MATCH(1,(Data!$F$2=$M$4:$M$26)*(T4=$N$4:$N$26),0),MATCH(U4,$K$3:$L$3,0))","v":161}]
[{"$f":"PivotSheet!A5","v":5},"a",{"$f":"PivotSheet!B5","v":1},1,{"$error":"#N/A"},{"$error":"#N/A"},{"$error":"#N/A"},{"$error":"#N/A"},1.4409221902017291E-2,"B-Size",{"$f":"MIN(IF($B$2:$B$365=\"B\",$A$2:$A$365))","v":165},{"$f":"MAX(IF($B$2:$B$365=\"B\",$A$2:$A$365))","v":321},2,"b",null,null,null,null,null,"b","Min Value",{"$f":"INDEX($K$4:$L$26,MATCH(1,(Data!$F$2=$M$4:$M$26)*(T5=$N$4:$N$26),0),MATCH(U5,$K$3:$L$3,0))","v":165}]
[{"$f":"PivotSheet!A6","v":6},"a",{"$f":"PivotSheet!B6","v":1},1,{"$error":"#N/A"},{"$error":"#N/A"},{"$error":"#N/A"},{"$error":"#N/A"},1.7291066282420747E-2,null,null,null,null,null,null,null,null,null,null,"b","Max Value",{"$f":"INDEX($K$4:$L$26,MATCH(1,(Data!$F$2=$M$4:$M$26)*(T6=$N$4:$N$26),0),MATCH(U6,$K$3:$L$3,0))","v":321}]
[{"$f":"PivotSheet!A7","v":10},"a",{"$f":"PivotSheet!B7","v":2},1,{"$error":"#N/A"},{"$error":"#N/A"},{"$error":"#N/A"},{"$error":"#N/A"},2.3054755043227664E-2,"3 Levels of Intensity",null,null,null,null,null,null,null,null,null,"c","Min Value",{"$f":"INDEX($K$4:$L$26,MATCH(1,(Data!$F$2=$M$4:$M$26)*(T7=$N$4:$N$26),0),MATCH(U7,$K$3:$L$3,0))","v":324}]
[{"$f":"PivotSheet!A8","v":11},"a",{"$f":"PivotSheet!B8","v":1},1,{"$error":"#N/A"},{"$error":"#N/A"},{"$error":"#N/A"},{"$error":"#N/A"},2.5936599423631121E-2,null,null,null,null,null,null,null,null,null,null,"c","Max Value",{"$f":"INDEX($K$4:$L$26,MATCH(1,(Data!$F$2=$M$4:$M$26)*(T8=$N$4:$N$26),0),MATCH(U8,$K$3:$L$3,0))","v":498}]
[{"$f":"PivotSheet!A9","v":12},"a",{"$f":"PivotSheet!B9","v":1},1,{"$error":"#N/A"},{"$error":"#N/A"},{"$error":"#N/A"},{"$error":"#N/A"},2.8818443804034578E-2,"A-Size",{"$f":"MIN(IF($B$2:$B$365=\"A\",$A$2:$A$365))","v":2},{"$f":"MAX(IF($B$2:$B$365=\"A\",$A$2:$A$365))","v":161},3,"a",null,null,null,null,null,"d","Min Value",{"$f":"INDEX($K$4:$L$26,MATCH(1,(Data!$F$2=$M$4:$M$26)*(T9=$N$4:$N$26),0),MATCH(U9,$K$3:$L$3,0))","v":{"$error":"#N/A"}}]
[{"$f":"PivotSheet!A10","v":14},"a",{"$f":"PivotSheet!B10","v":1},1,{"$error":"#N/A"},{"$error":"#N/A"},{"$error":"#N/A"},{"$error":"#N/A"},3.1700288184438034E-2,"B-Size",{"$f":"MIN(IF($B$2:$B$365=\"B\",$A$2:$A$365))","v":165},{"$f":"MAX(IF($B$2:$B$365=\"B\",$A$2:$A$365))","v":321},3,"b",null,null,null,null,null,"d","Max Value",{"$f":"INDEX($K$4:$L$26,MATCH(1,(Data!$F$2=$M$4:$M$26)*(T10=$N$4:$N$26),0),MATCH(U10,$K$3:$L$3,0))","v":{"$error":"#N/A"}}]
{"$rows_left_out":357}
{"sheet":"Std. Dev","index":5,"n_rows":365,"n_cols":22,"rows_kept":365,"cut":false,"hidden":true,"merged":[]}
["Data","Frequency","Group","Group 1","Group 2","Group 3","Group 4","Group 5","Cum. Freq"]
[{"$f":"PivotSheet!A2","v":2},{"$f":"PivotSheet!B2","v":1},{"$f":"IF(A2<=$V$4,\"a\",IF(A2<=$V$6,\"b\",IF(A2<=$V$8,\"c\",IF(A2<=$V$10,\"d\",IF(A2<=$V$12,\"e\",\"ERROR\")))))","v":"a"},{"$f":"IF(C2=\"a\",1,NA())","v":1},{"$f":"IF(C2=\"b\",1,NA())","v":{"$error":"#N/A"}},{"$f":"IF(C2=\"c\",1,NA())","v":{"$error":"#N/A"}},{"$f":"IF(C2=\"d\",1,NA())","v":{"$error":"#N/A"}},{"$f":"IF(C2=\"e\",1,NA())","v":{"$error":"#N/A"}},{"$f":"B2/SUM($B$2:$B$10000)","v":2.881844380403458E-3},"2 levels of Intensity",null,null,null,null,null,null,null,null,null,"Group",null,"Std. Dev"]
[{"$f":"PivotSheet!A3","v":3},{"$f":"PivotSheet!B3","v":2},"a",{"$f":"IF(C3=\"a\",1,NA())","v":1},{"$f":"IF(C3=\"b\",1,NA())","v":{"$error":"#N/A"}},{"$f":"IF(C3=\"c\",1,NA())","v":{"$error":"#N/A"}},{"$f":"IF(C3=\"d\",1,NA())","v":{"$error":"#N/A"}},{"$f":"IF(C3=\"e\",1,NA())","v":{"$error":"#N/A"}},{"$f":"B3/SUM($B$2:$B$10000)+I2","v":8.6455331412103736E-3},null,"Min Value","Max Value",null,null,null,null,null,null,null,"a","Min Value",{"$f":"INDEX($K$4:$L$26,MATCH(1,(Data!$F$2=$M$4:$M$26)*(T3=$N$4:$N$26),0),MATCH(U3,$K$3:$L$3,0))","v":2}]
[{"$f":"PivotSheet!A4","v":4},{"$f":"PivotSheet!B4","v":1},"a",1,{"$error":"#N/A"},{"$error":"#N/A"},{"$error":"#N/A"},{"$error":"#N/A"},{"$f":"B4/SUM($B$2:$B$10000)+I3","v":1.1527377521613832E-2},"A-Size",{"$f":"MIN([0]!Data_Plot)","v":2},{"$f":"MAX(AVERAGE([0]!Data_Plot),K4)","v":241.85878962536023},2,"a",null,null,null,null,null,"a","Max Value",{"$f":"INDEX($K$4:$L$26,MATCH(1,(Data!$F$2=$M$4:$M$26)*(T4=$N$4:$N$26),0),MATCH(U4,$K$3:$L$3,0))","v":101.81618586118071}]
[{"$f":"PivotSheet!A5","v":5},{"$f":"PivotSheet!B5","v":1},"a",1,{"$error":"#N/A"},{"$error":"#N/A"},{"$error":"#N/A"},{"$error":"#N/A"},1.4409221902017291E-2,"B-Size",{"$f":"$L$4+1","v":242.85878962536023},{"$f":"MAX([0]!Data_Plot)","v":498},2,"b",null,null,null,null,null,"b","Min Value",{"$f":"INDEX($K$4:$L$26,MATCH(1,(Data!$F$2=$M$4:$M$26)*(T5=$N$4:$N$26),0),MATCH(U5,$K$3:$L$3,0))","v":102.81618586118071}]
[{"$f":"PivotSheet!A6","v":6},{"$f":"PivotSheet!B6","v":1},"a",1,{"$error":"#N/A"},{"$error":"#N/A"},{"$error":"#N/A"},{"$error":"#N/A"},1.7291066282420747E-2,null,null,null,null,null,null,null,null,null,null,"b","Max Value",{"$f":"INDEX($K$4:$L$26,MATCH(1,(Data!$F$2=$M$4:$M$26)*(T6=$N$4:$N$26),0),MATCH(U6,$K$3:$L$3,0))","v":381.90139338953975}]
[{"$f":"PivotSheet!A7","v":10},{"$f":"PivotSheet!B7","v":2},"a",1,{"$error":"#N/A"},{"$error":"#N/A"},{"$error":"#N/A"},{"$error":"#N/A"},2.3054755043227664E-2,"3 Levels of Intensity",null,null,null,null,null,null,null,null,null,"c","Min Value",{"$f":"INDEX($K$4:$L$26,MATCH(1,(Data!$F$2=$M$4:$M$26)*(T7=$N$4:$N$26),0),MATCH(U7,$K$3:$L$3,0))","v":382.90139338953975}]
[{"$f":"PivotSheet!A8","v":11},{"$f":"PivotSheet!B8","v":1},"a",1,{"$error":"#N/A"},{"$error":"#N/A"},{"$error":"#N/A"},{"$error":"#N/A"},2.5936599423631121E-2,null,null,null,null,null,null,null,null,null,null,"c","Max Value",{"$f":"INDEX($K$4:$L$26,MATCH(1,(Data!$F$2=$M$4:$M$26)*(T8=$N$4:$N$26),0),MATCH(U8,$K$3:$L$3,0))","v":498}]
[{"$f":"PivotSheet!A9","v":12},{"$f":"PivotSheet!B9","v":1},"a",1,{"$error":"#N/A"},{"$error":"#N/A"},{"$error":"#N/A"},{"$error":"#N/A"},2.8818443804034578E-2,"A-Size",{"$f":"MIN([0]!Data_Plot)","v":2},{"$f":"MAX(K9,AVERAGE([0]!Data_Plot)-(_xlfn.STDEV.S([0]!Data_Plot)))","v":101.81618586118071},3,"a",null,null,null,null,null,"d","Min Value",{"$f":"INDEX($K$4:$L$26,MATCH(1,(Data!$F$2=$M$4:$M$26)*(T9=$N$4:$N$26),0),MATCH(U9,$K$3:$L$3,0))","v":{"$error":"#N/A"}}]
[{"$f":"PivotSheet!A10","v":14},{"$f":"PivotSheet!B10","v":1},"a",1,{"$error":"#N/A"},{"$error":"#N/A"},{"$error":"#N/A"},{"$error":"#N/A"},3.1700288184438034E-2,"B-Size",{"$f":"$L$9+1","v":102.81618586118071},{"$f":"MAX(K10,AVERAGE([0]!Data_Plot)+(_xlfn.STDEV.S([0]!Data_Plot)))","v":381.90139338953975},3,"b",null,null,null,null,null,"d","Max Value",{"$f":"INDEX($K$4:$L$26,MATCH(1,(Data!$F$2=$M$4:$M$26)*(T10=$N$4:$N$26),0),MATCH(U10,$K$3:$L$3,0))","v":{"$error":"#N/A"}}]
{"$rows_left_out":356}
{"sheet":"Quantiles","index":6,"n_rows":364,"n_cols":22,"rows_kept":364,"cut":false,"hidden":true,"merged":[]}
["Data","Frequency","Group","Group 1","Group 2","Group 3","Group 4","Group 5","Cum. Freq"]
[{"$f":"PivotSheet!A2","v":2},{"$f":"PivotSheet!B2","v":1},{"$f":"IF(A2<=$V$4,\"a\",IF(A2<=$V$6,\"b\",IF(A2<=$V$8,\"c\",IF(A2<=$V$10,\"d\",IF(A2<=$V$12,\"e\",\"ERROR\")))))","v":"a"},{"$f":"IF($C2=\"a\",1,NA())","v":1},{"$f":"IF($C2=\"b\",1,NA())","v":{"$error":"#N/A"}},{"$f":"IF($C2=\"c\",1,NA())","v":{"$error":"#N/A"}},{"$f":"IF($C2=\"d\",1,NA())","v":{"$error":"#N/A"}},{"$f":"IF($C2=\"e\",1,NA())","v":{"$error":"#N/A"}},{"$f":"B2/SUM($B$2:$B$10000)","v":2.881844380403458E-3},"2 levels of Intensity",null,null,null,null,null,null,null,null,null,"Group",null,"Quantiles"]
[{"$f":"PivotSheet!A3","v":3},{"$f":"PivotSheet!B3","v":2},{"$f":"IF(A3<=$V$4,\"a\",IF(A3<=$V$6,\"b\",IF(A3<=$V$8,\"c\",IF(A3<=$V$10,\"d\",IF(A3<=$V$12,\"e\",\"ERROR\")))))","v":"a"},{"$f":"IF(C3=\"a\",1,NA())","v":1},{"$f":"IF($C3=\"b\",1,NA())","v":{"$error":"#N/A"}},{"$f":"IF($C3=\"c\",1,NA())","v":{"$error":"#N/A"}},{"$f":"IF($C3=\"d\",1,NA())","v":{"$error":"#N/A"}},{"$f":"IF($C3=\"e\",1,NA())","v":{"$error":"#N/A"}},{"$f":"B3/SUM($B$2:$B$10000)+I2","v":8.6455331412103736E-3},null,"Min Value","Max Value",null,null,null,null,null,null,null,"a","Min Value",{"$f":"INDEX(Quantiles!$K$4:$L$26,MATCH(1,(Data!$F$2=Quantiles!$M$4:$M$26)*(T3=Quantiles!$N$4:$N$26),0),MATCH(U3,Quantiles!$K$3:$L$3,0))","v":2}]
[{"$f":"PivotSheet!A4","v":4},{"$f":"PivotSheet!B4","v":1},"a",1,{"$error":"#N/A"},{"$error":"#N/A"},{"$error":"#N/A"},{"$error":"#N/A"},{"$f":"B4/SUM($B$2:$B$10000)+I3","v":1.1527377521613832E-2},"A-Size",{"$f":"MIN([0]!Data_Plot)","v":2},{"$f":"MEDIAN([0]!Data_Plot)","v":239},2,"a",null,null,null,null,null,"a","Max Value",{"$f":"INDEX(Quantiles!$K$4:$L$26,MATCH(1,(Data!$F$2=Quantiles!$M$4:$M$26)*(T4=Quantiles!$N$4:$N$26),0),MATCH(U4,Quantiles!$K$3:$L$3,0))","v":158.18}]
[{"$f":"PivotSheet!A5","v":5},{"$f":"PivotSheet!B5","v":1},"a",1,{"$error":"#N/A"},{"$error":"#N/A"},{"$error":"#N/A"},{"$error":"#N/A"},1.4409221902017291E-2,"B-Size",{"$f":"$L$4+1","v":240},{"$f":"MAX([0]!Data_Plot)","v":498},2,"b",null,null,null,null,null,"b","Min Value",{"$f":"INDEX(Quantiles!$K$4:$L$26,MATCH(1,(Data!$F$2=Quantiles!$M$4:$M$26)*(T5=Quantiles!$N$4:$N$26),0),MATCH(U5,Quantiles!$K$3:$L$3,0))","v":159.18}]
[{"$f":"PivotSheet!A6","v":6},{"$f":"PivotSheet!B6","v":1},"a",1,{"$error":"#N/A"},{"$error":"#N/A"},{"$error":"#N/A"},{"$error":"#N/A"},1.7291066282420747E-2,null,null,null,null,null,null,null,null,null,null,"b","Max Value",{"$f":"INDEX(Quantiles!$K$4:$L$26,MATCH(1,(Data!$F$2=Quantiles!$M$4:$M$26)*(T6=Quantiles!$N$4:$N$26),0),MATCH(U6,Quantiles!$K$3:$L$3,0))","v":319.72000000000003}]
[{"$f":"PivotSheet!A7","v":10},{"$f":"PivotSheet!B7","v":2},"a",1,{"$error":"#N/A"},{"$error":"#N/A"},{"$error":"#N/A"},{"$error":"#N/A"},2.3054755043227664E-2,"3 Levels of Intensity",null,null,null,null,null,null,null,null,null,"c","Min Value",{"$f":"INDEX(Quantiles!$K$4:$L$26,MATCH(1,(Data!$F$2=Quantiles!$M$4:$M$26)*(T7=Quantiles!$N$4:$N$26),0),MATCH(U7,Quantiles!$K$3:$L$3,0))","v":320.72000000000003}]
[{"$f":"PivotSheet!A8","v":11},{"$f":"PivotSheet!B8","v":1},"a",1,{"$error":"#N/A"},{"$error":"#N/A"},{"$error":"#N/A"},{"$error":"#N/A"},2.5936599423631121E-2,null,null,null,null,null,null,null,null,null,null,"c","Max Value",{"$f":"INDEX(Quantiles!$K$4:$L$26,MATCH(1,(Data!$F$2=Quantiles!$M$4:$M$26)*(T8=Quantiles!$N$4:$N$26),0),MATCH(U8,Quantiles!$K$3:$L$3,0))","v":498}]
[{"$f":"PivotSheet!A9","v":12},{"$f":"PivotSheet!B9","v":1},"a",1,{"$error":"#N/A"},{"$error":"#N/A"},{"$error":"#N/A"},{"$error":"#N/A"},2.8818443804034578E-2,"A-Size",{"$f":"MIN([0]!Data_Plot)","v":2},{"$f":"PERCENTILE([0]!Data_Plot,0.33)","v":158.18},3,"a",null,null,null,null,null,"d","Min Value",{"$f":"INDEX(Quantiles!$K$4:$L$26,MATCH(1,(Data!$F$2=Quantiles!$M$4:$M$26)*(T9=Quantiles!$N$4:$N$26),0),MATCH(U9,Quantiles!$K$3:$L$3,0))","v":{"$error":"#N/A"}}]
[{"$f":"PivotSheet!A10","v":14},{"$f":"PivotSheet!B10","v":1},"a",1,{"$error":"#N/A"},{"$error":"#N/A"},{"$error":"#N/A"},{"$error":"#N/A"},3.1700288184438034E-2,"B-Size",{"$f":"$L$9+1","v":159.18},{"$f":"PERCENTILE([0]!Data_Plot,0.66)","v":319.72000000000003},3,"b",null,null,null,null,null,"d","Max Value",{"$f":"INDEX(Quantiles!$K$4:$L$26,MATCH(1,(Data!$F$2=Quantiles!$M$4:$M$26)*(T10=Quantiles!$N$4:$N$26),0),MATCH(U10,Quantiles!$K$3:$L$3,0))","v":{"$error":"#N/A"}}]
{"$rows_left_out":355}
{"sheet":"Equal Interval","index":7,"n_rows":365,"n_cols":22,"rows_kept":365,"cut":false,"hidden":true,"merged":[]}
["Data","Frequency","Group","Group 1","Group 2","Group 3","Group 4","Group 5","Cum. Freq"]
[{"$f":"PivotSheet!A2","v":2},{"$f":"PivotSheet!B2","v":1},{"$f":"IF(A2<=$V$4,\"a\",IF(A2<=$V$6,\"b\",IF(A2<=$V$8,\"c\",IF(A2<=$V$10,\"d\",IF(A2<=$V$12,\"e\",\"ERROR\")))))","v":"a"},{"$f":"IF($C2=\"a\",1,NA())","v":1},{"$f":"IF($C2=\"b\",1,NA())","v":{"$error":"#N/A"}},{"$f":"IF($C2=\"c\",1,NA())","v":{"$error":"#N/A"}},{"$f":"IF($C2=\"d\",1,NA())","v":{"$error":"#N/A"}},{"$f":"IF($C2=\"e\",1,NA())","v":{"$error":"#N/A"}},{"$f":"B2/SUM($B$2:$B$1000)","v":2.881844380403458E-3},"2 levels of Intensity",null,null,null,null,null,null,null,null,null,"Group",null,"Equal Interval"]
[{"$f":"PivotSheet!A3","v":3},{"$f":"PivotSheet!B3","v":2},{"$f":"IF(A3<=$V$4,\"a\",IF(A3<=$V$6,\"b\",IF(A3<=$V$8,\"c\",IF(A3<=$V$10,\"d\",IF(A3<=$V$12,\"e\",\"ERROR\")))))","v":"a"},{"$f":"IF($C3=\"a\",1,NA())","v":1},{"$f":"IF($C3=\"b\",1,NA())","v":{"$error":"#N/A"}},{"$f":"IF($C3=\"c\",1,NA())","v":{"$error":"#N/A"}},{"$f":"IF($C3=\"d\",1,NA())","v":{"$error":"#N/A"}},{"$f":"IF($C3=\"e\",1,NA())","v":{"$error":"#N/A"}},{"$f":"B3/SUM($B$2:$B$1000)+I2","v":8.6455331412103736E-3},null,"Min Value","Max Value",null,null,null,null,null,null,null,"a","Min Value",{"$f":"INDEX('Equal Interval'!$K$4:$L$26,MATCH(1,(Data!$F$2='Equal Interval'!$M$4:$M$26)*(T3='Equal Interval'!$N$4:$N$26),0),MATCH(U3,'Equal Interval'!$K$3:$L$3,0))","v":2}]
[{"$f":"PivotSheet!A4","v":4},{"$f":"PivotSheet!B4","v":1},"a",1,{"$error":"#N/A"},{"$error":"#N/A"},{"$error":"#N/A"},{"$error":"#N/A"},{"$f":"B4/SUM($B$2:$B$1000)+I3","v":1.1527377521613832E-2},"A-Size",{"$f":"MIN([0]!Data_Plot)","v":2},{"$f":"K4+ (L5 - K4)/2","v":250},2,"a",null,null,null,null,null,"a","Max Value",{"$f":"INDEX('Equal Interval'!$K$4:$L$26,MATCH(1,(Data!$F$2='Equal Interval'!$M$4:$M$26)*(T4='Equal Interval'!$N$4:$N$26),0),MATCH(U4,'Equal Interval'!$K$3:$L$3,0))","v":167.33333333333334}]
[{"$f":"PivotSheet!A5","v":5},{"$f":"PivotSheet!B5","v":1},"a",1,{"$error":"#N/A"},{"$error":"#N/A"},{"$error":"#N/A"},{"$error":"#N/A"},1.4409221902017291E-2,"B-Size",{"$f":"$L$4+1","v":251},{"$f":"MAX([0]!Data_Plot)","v":498},2,"b",null,null,null,null,null,"b","Min Value",{"$f":"INDEX('Equal Interval'!$K$4:$L$26,MATCH(1,(Data!$F$2='Equal Interval'!$M$4:$M$26)*(T5='Equal Interval'!$N$4:$N$26),0),MATCH(U5,'Equal Interval'!$K$3:$L$3,0))","v":168.33333333333334}]
[{"$f":"PivotSheet!A6","v":6},{"$f":"PivotSheet!B6","v":1},"a",1,{"$error":"#N/A"},{"$error":"#N/A"},{"$error":"#N/A"},{"$error":"#N/A"},1.7291066282420747E-2,null,null,null,null,null,null,null,null,null,null,"b","Max Value",{"$f":"INDEX('Equal Interval'!$K$4:$L$26,MATCH(1,(Data!$F$2='Equal Interval'!$M$4:$M$26)*(T6='Equal Interval'!$N$4:$N$26),0),MATCH(U6,'Equal Interval'!$K$3:$L$3,0))","v":332.66666666666669}]
[{"$f":"PivotSheet!A7","v":10},{"$f":"PivotSheet!B7","v":2},"a",1,{"$error":"#N/A"},{"$error":"#N/A"},{"$error":"#N/A"},{"$error":"#N/A"},2.3054755043227664E-2,"3 Levels of Intensity",null,null,null,null,null,null,null,null,null,"c","Min Value",{"$f":"INDEX('Equal Interval'!$K$4:$L$26,MATCH(1,(Data!$F$2='Equal Interval'!$M$4:$M$26)*(T7='Equal Interval'!$N$4:$N$26),0),MATCH(U7,'Equal Interval'!$K$3:$L$3,0))","v":333.66666666666669}]
[{"$f":"PivotSheet!A8","v":11},{"$f":"PivotSheet!B8","v":1},"a",1,{"$error":"#N/A"},{"$error":"#N/A"},{"$error":"#N/A"},{"$error":"#N/A"},2.5936599423631121E-2,null,null,null,null,null,null,null,null,null,null,"c","Max Value",{"$f":"INDEX('Equal Interval'!$K$4:$L$26,MATCH(1,(Data!$F$2='Equal Interval'!$M$4:$M$26)*(T8='Equal Interval'!$N$4:$N$26),0),MATCH(U8,'Equal Interval'!$K$3:$L$3,0))","v":498}]
[{"$f":"PivotSheet!A9","v":12},{"$f":"PivotSheet!B9","v":1},"a",1,{"$error":"#N/A"},{"$error":"#N/A"},{"$error":"#N/A"},{"$error":"#N/A"},2.8818443804034578E-2,"A-Size",{"$f":"MIN([0]!Data_Plot)","v":2},{"$f":"K9+ (L11 - K9)/3","v":167.33333333333334},3,"a",null,null,null,null,null,"d","Min Value",{"$f":"INDEX('Equal Interval'!$K$4:$L$26,MATCH(1,(Data!$F$2='Equal Interval'!$M$4:$M$26)*(T9='Equal Interval'!$N$4:$N$26),0),MATCH(U9,'Equal Interval'!$K$3:$L$3,0))","v":{"$error":"#N/A"}}]
[{"$f":"PivotSheet!A10","v":14},{"$f":"PivotSheet!B10","v":1},"a",1,{"$error":"#N/A"},{"$error":"#N/A"},{"$error":"#N/A"},{"$error":"#N/A"},3.1700288184438034E-2,"B-Size",{"$f":"$L$9+1","v":168.33333333333334},{"$f":"K9+2* (L11 - K9)/3","v":332.66666666666669},3,"b",null,null,null,null,null,"d","Max Value",{"$f":"INDEX('Equal Interval'!$K$4:$L$26,MATCH(1,(Data!$F$2='Equal Interval'!$M$4:$M$26)*(T10='Equal Interval'!$N$4:$N$26),0),MATCH(U10,'Equal Interval'!$K$3:$L$3,0))","v":{"$error":"#N/A"}}]
{"$rows_left_out":355}