{"text_format":"1","workbook":"xlsx","n_sheets":8,"sheets":["User Guidance","PART A","Part A - hidden","PART B","Part B - hidden","Supporting Information","Data Sheet","Weighted Populations"],"not_rendered":{"charts":0,"images":3,"macros":1,"external_links":3,"defined_names":27,"comments":1,"pivot_tables":0},"unopened":[],"bounds":{"document_bytes":16777216,"sheet_cells":100000,"rows_first":2000,"rows_last":500,"rows_between":2000,"halvings":0,"cell_chars":16384,"cell_head_chars":4096},"cells_cut":0,"cells_raw":0,"read":"whole","date_system":"1900"}

{"sheet":"User Guidance","index":0,"n_rows":2,"n_cols":2,"rows_kept":2,"cut":false,"hidden":false,"merged":[[1,1,2,15]]}
[]
[null,"PCN Workforce Planning Template 2020/21: Guidance notes for completion  \n \nThis workforce planning template is designed to support primary care workforce planning activity at Primary Care Network (PCN) level. Two parts of the template are included (see tabs 'Part A' and 'Part B'), which should be completed in line with the expected timescales set out below. We appreciate that PCNs submitted a previous version of the form for 2020/21 in August.  We are asking that the plans for 2020/21 are re-entered into this updated template. This is to provide an updated view of PCN recruitment plans, reflecting the addition of the Nursing Associate and Trainee Nursing Associate roles from October 2020, and any changes in the 2020/21 plans agreed since that earlier submission.\n\nThe purpose of collecting this data is to support internal planning and so it is not anticipated that the data provided will be shared outside the NHS.\n\nThis is in line with requirements set out in the Network Contract Directed Enhanced Service (DES) Contract Specification 2020/21 – PCN Entitlements and Requirements PCN Network (Section 6.5). A worked example of the template is available at: https://future.nhs.uk/primarycareworkforce/grouphome. \n\nPart A  covers ARRS recruitment only. Working closely with their CCG and the local primary care training hub, PCNs should use this to indicate the number of staff they intend to recruit through the scheme in 2020/21, as well as emerging recruitment intentions for 2021/22 and beyond to support workforce planning activity. For 2020/21, the template will calculate the indicative spend against the financial allocation available to the PCN, and highlight any remaining allocation that could be lost to the PCN if not used.  Once submitted, PCNs are free to change their workforce plan at any stage. To support local flexibility, the process for submission will be defined and communicated by the receiving CCG. \n\nPart B covers indicative recruitment intentions for the wider team. In light of the COVID-19 response, use of this section is voluntary to support discussions between the PCN and their training hub on available local supply, and the education, clinical supervision and ongoing career support and development needs of all staff groups within the PCN team. This will include retention and the support available to PCNs to introduce new roles and ways of working. CCGs and systems will similarly use PCN workforce plans to consider support required for recruitment activity, including opportunities to broker arrangements across PCNs. ICSs, STPs and CCGs may additionally agree local processes to make use of the tool for workforce planning. Completion of this section would provide a more comprehensive view of the Primary Care Workforce Planning intentions of the systems, and so facilitate the provision of a system-wide picture in this regard.\n\nExpected timescales for this stage of the process (please review against latest guidance in light of ongoing COVID-19 response) \n\nAs soon as possible, taking into account COVID-19 response: Lead CCGs and primary care training hubs to liaise with PCNs (and other local health, social and community care stakeholders) to discuss their recruitment plans for 2020/21. In consultation with their training hub, CCG and other stakeholders, PCNs should develop and adjust their workforce plans as needed going forwards, seeking to maximise recruitment through the ARRS scheme. \nFrom 01 April, taking into account latest NHS Digital guidance during COVID-19 response:  PCNs / practices to update the National Workforce Reporting System with workforce changes on a monthly basis, in line with Network Contract DES.\nBy 31 October: PCNs to provide indicative recruitment intentions for 2021/22 and beyond under the ARRS scheme to their CCG utilising the PCN Template. Each PCN should submit one version of their total recrutiment intentions to their agreed lead CCG.\nBy 9 November: CCGs to provide aggregated returns to their region and copied to the Primary Care workforce Team, utilising the CCG Aggregation Tool provided..\nBy 30 November: CCGs to agree an aggregate local plan with PCN clinical directors and consider amounts for in-year redistribution to other PCNs (if required), arranging provision of amended PCN returns if appropriate and submitting an updated CCG return using the CCG Aggregation Tool."]

{"sheet":"PART A","index":1,"n_rows":108,"n_cols":17,"rows_kept":108,"cut":false,"hidden":false,"merged":[[11,12,11,14],[29,6,29,12],[99,2,99,16],[1,2,1,16],[27,2,27,16],[11,4,11,6],[13,4,13,6],[15,12,15,14],[62,2,62,16],[107,2,107,16],[100,2,105,16],[108,2,113,16],[98,2,98,16],[13,12,13,14],[15,4,15,6]]}
[]
[null,null,"     Part A (Required for all PCNs)\t\t\t\t\t\t\t\t\t\t\t\t\t\t"]
[]
[]
[]
[null,null,"PCN Code:",null,null,null,null,null,null,null,"Name of PCN: "]
{"$rows_left_out":103}
{"sheet":"Part A - hidden","index":2,"n_rows":40,"n_cols":6,"rows_kept":40,"cut":false,"hidden":true,"merged":[]}
["Name of PCN: ",{"$f":"'PART A'!E12","v":""}]
["Org Code (if known):",{"$f":"'PART A'!E14","v":""}]
["Last updated:",{"$f":"'PART A'!M16","v":"00:00:00"}]
["PCN Clinical Director: ",{"$f":"'PART A'!M12","v":0}]
["Training Hub Contact:",{"$f":"'PART A'!M14","v":0}]
["Enter the PCN weighted population as at January 2020 (to be sourced from CCG):",{"$f":"'PART A'!K21","v":0}]
{"$rows_left_out":35}
{"sheet":"PART B","index":3,"n_rows":108,"n_cols":15,"rows_kept":108,"cut":false,"hidden":false,"merged":[[91,2,91,14],[92,2,97,14],[108,2,113,14],[2,2,2,15],[6,4,6,6],[6,12,6,14],[8,4,8,6],[8,12,8,14],[38,2,38,14],[89,2,89,14],[10,4,10,6],[16,2,16,15],[99,2,99,14],[100,2,105,14],[107,2,107,14]]}
[]
[]
[null,null,"Part B (Voluntary for all PCNs)"]
[]
[]
[]
{"$rows_left_out":103}
{"sheet":"Part B - hidden","index":4,"n_rows":41,"n_cols":6,"rows_kept":41,"cut":false,"hidden":true,"merged":[]}
["Name of PCN: ",{"$f":"'PART B'!E7","v":""}]
["Org Code (if known):",{"$f":"'PART B'!E9","v":""}]
["Last updated:",{"$f":"'PART B'!E11","v":"00:00:00"}]
["PCN Clinical Director: ",{"$f":"'PART B'!M7","v":0}]
["Training Hub Contact:",{"$f":"'PART B'!M9","v":0}]
[]
{"$rows_left_out":36}
{"sheet":"Supporting Information","index":5,"n_rows":40,"n_cols":19,"rows_kept":40,"cut":false,"hidden":false,"merged":[[39,1,42,18],[6,1,9,1],[6,2,9,2],[6,16,9,16],[6,18,9,18],[7,4,7,15],[3,1,4,18],[8,7,8,9],[8,4,8,6],[8,13,8,15],[8,10,8,12]]}
[]
[null,"PCN Workforce Planning Template: Supporting Information"]
[]
[null,"Additional Roles Reimbursement Scheme \nThe information set out in this template aligns to requirements set out in Updates to the GP Contract - 20/21 - 23/24 (published 6 February 2020). The roles identified align to those available for reimbursement under the Additional Roles Reimbursement Scheme (including on costs). This scheme has expanded from April 2020 to include pharmacy technicians, care co-ordinators, health & wellbeing coaches, dietitians, podiatrists and occupational therapists in addition to the five roles already included (clinical pharmacists, social prescribing link workers, physician associates, paramedics and first contact physiotherapists). Nursing Associates and Trainee Nursing Associates were added from October 2020.\n\n"]
[]
[]
{"$rows_left_out":35}
{"sheet":"Data Sheet","index":6,"n_rows":4,"n_cols":165,"rows_kept":4,"cut":false,"hidden":true,"merged":[]}
["PART A",null,null,null,null,null,null,"Recruitment intentions for 2020/21",null,null,null,null,null,null,null,null,null,null,null,null,null,null,null,null,null,null,null,null,null,null,null,null,null,null,null,null,null,null,null,null,null,null,null,null,null,null,null,null,null,null,null,null,null,null,null,null,null,null,null,null,null,null,null,null,null,null,null,"Indicative intentions for 2021/22 (due by 31st October 2020)",null,null,null,null,null,null,null,null,null,null,null,null,null,null,null,null,null,null,null,null,null,null,null,null,null,null,null,null,null,null,null,null,null,null,null,null,null,null,null,null,null,null,null,"PART B",null,null,null,null,null,null,null,null,null,null,null,null,null,null,null,null,null,null,null,null,null,null,null,null,null,null,null,null,null,null,null,null,null,null,null,"Indicative intentions for the remainder of the five year GP contract deal "]
[null,null,null,null,null,null,null,"Recruited during 2019/20",null,null,null,null,null,null,null,null,null,null,null,"Quarter 1\nApril - Jun",null,null,null,null,null,null,null,null,null,null,null,"Quarter 2\nJul - Sep",null,null,null,null,null,null,null,null,null,null,null,"Quarter 3\nOct - Dec",null,null,null,null,null,null,null,null,null,null,null,"Quarter 4\nJan - Mar",null,null,null,null,null,null,null,null,null,null,null,"2021/22",null,null,null,null,null,null,null,null,null,null,null,null,null,"2022/23",null,null,null,null,null,null,null,null,null,null,null,null,null,"2023/24",null,null,null,null,null,null,null,null,null,null,null,null,null,null,null,null,"Staff numbers as at March 2020",null,null,null,null,null,null,"Quarter 1\nApril - Jun",null,null,null,null,null,null,"Quarter 2\nJul - Sep",null,null,null,null,null,null,"Quarter 3\nOct - Dec",null,null,null,null,null,null,"Quarter 4\nJan - Mar",null,null,null,null,null,null,"2021/22",null,null,null,null,"2022/23",null,null,null,null,"2023/24",null,null,null,null,"Additional comments"]
["Name of PCN: ","Org Code (if known):","Last updated:","PCN Clinical Director:","Training Hub Contact:","Enter the PCN weighted population as at January 2020:","PCN-level ARRS Allocation 2020/21:","Clinical pharmacists","Nurse Associates","Nurse Training Associates","Social prescribing link workers ","First contact physiotherapists","Physician associates","Pharmacy technicians","Occupational therapists","Dietitians","Podiatrists","Health and wellbeing coaches","Care co-ordinators","Clinical pharmacists","Nurse Associates","Nurse Training Associates","Social prescribing link workers ","First contact physiotherapists","Physician associates","Pharmacy technicians","Occupational therapists","Dietitians","Podiatrists","Health and wellbeing coaches","Care co-ordinators","Clinical pharmacists","Nurse Associates","Nurse Training Associates","Social prescribing link workers ","First contact physiotherapists","Physician associates","Pharmacy technicians","Occupational therapists","Dietitians","Podiatrists","Health and wellbeing coaches","Care co-ordinators","Clinical pharmacists","Nurse Associates","Nurse Training Associates","Social prescribing link workers ","First contact physiotherapists","Physician associates","Pharmacy technicians","Occupational therapists","Dietitians","Podiatrists","Health and wellbeing coaches","Care co-ordinators","Clinical pharmacists","Nurse Associates","Nurse Training Associates","Social prescribing link workers ","First contact physiotherapists","Physician associates","Pharmacy technicians","Occupational therapists","Dietitians","Podiatrists","Health and wellbeing coaches","Care co-ordinators","Clinical pharmacists","Nurse Associates","Nurse Training Associates","Social prescribing link workers ","First contact physiotherapists","Physician associates","Pharmacy technicians","Community paramedics","Occupational therapists","Dietitians","Podiatrists","Health and wellbeing coaches","Care co-ordinators","Mental health practitioners","Clinical pharmacists","Nurse Associates","Nurse Training Associates","Social prescribing link workers ","First contact physiotherapists","Physician associates","Pharmacy technicians","Community paramedics","Occupational therapists","Dietitians","Podiatrists","Health and wellbeing coaches","Care co-ordinators","Mental health practitioners","Clinical pharmacists","Nurse Associates","Nurse Training Associates","Social prescribing link workers ","First contact physiotherapists","Physician associates","Pharmacy technicians","Community paramedics","Occupational therapists","Dietitians","Podiatrists","Health and wellbeing coaches","Care co-ordinators","Mental health practitioners","Requests for support to progress recruitment activity (e.g. advertising posts, supporting recruitment activity, brokering recruitment opportunities with neighbouring PCNs):","Any other comments: ","Last updated:","GPs (excluding registrars and locums)","Nurses ","Of these, how many do you anticipate will be: ","…advanced nurse practitioners","PCN Clinical Directors","Other direct patient care staff (outside of ARRS)","Non-clinical / admin roles","GPs (excluding registrars and locums)","Nurses ","Of these, how many do you anticipate will be: ","…advanced nurse practitioners","PCN Clinical Directors","Other direct patient care staff (outside of ARRS)","Non-clinical / admin roles","GPs (excluding registrars and locums)","Nurses ","Of these, how many do you anticipate will be: ","…advanced nurse practitioners","PCN Clinical Directors","Other direct patient care staff (outside of ARRS)","Non-clinical / admin roles","GPs (excluding registrars and locums)","Nurses ","Of these, how many do you anticipate will be: ","…advanced nurse practitioners","PCN Clinical Directors","Other direct patient care staff (outside of ARRS)","Non-clinical / admin roles","GPs (excluding registrars and locums)","Nurses ","Of these, how many do you anticipate will be: ","…advanced nurse practitioners","PCN Clinical Directors","Other direct patient care staff (outside of ARRS)","Non-clinical / admin roles","GPs (excluding registrars and locums)","Nurses ","PCN Clinical Directors","Other direct patient care staff","Non-clinical/admin staff","GPs (excluding registrars and locums)","Nurses ","PCN Clinical Directors","Other direct patient care staff","Non-clinical/admin staff","GPs (excluding registrars and locums)","Nurses ","PCN Clinical Directors","Other direct patient care staff","Non-clinical/admin staff","Supporting information and / or requests for support","Nursing","Other direct patient care staff"]
[{"$f":"IF('PART A'!$E12=\"\",\"\",'PART A'!$E12)","v":""},{"$f":"IF('PART A'!$E14=\"\",\"\",'PART A'!$E14)","v":""},{"$f":"IF('PART A'!$M16=\"\",\"\",'PART A'!$M16)","v":""},{"$f":"IF('PART A'!$M12=\"\",\"\",'PART A'!$M12)","v":""},{"$f":"IF('PART A'!$M14=\"\",\"\",'PART A'!$M14)","v":""},{"$f":"IF('PART A'!$K21=\"\",\"\",'PART A'!$K21)","v":0},{"$f":"IF('PART A'!$K23=\"\",\"\",'PART A'!$K23)","v":""},{"$f":"IF('PART A'!$E32=\"\",\"\",'PART A'!$E32)","v":""},{"$f":"IF('PART A'!$E34=\"\",\"\",'PART A'!$E34)","v":""},{"$f":"IF('PART A'!$E36=\"\",\"\",'PART A'!$E36)","v":""},{"$f":"IF('PART A'!$E38=\"\",\"\",'PART A'!$E38)","v":""},null,null,null,null,null,null,null,null,{"$f":"IF('PART A'!$G32=\"\",\"\",'PART A'!$G32)","v":""},{"$f":"IF('PART A'!$G34=\"\",\"\",'PART A'!$G34)","v":""},{"$f":"IF('PART A'!$G36=\"\",\"\",'PART A'!$G36)","v":""},{"$f":"IF('PART A'!$G38=\"\",\"\",'PART A'!$G38)","v":""},{"$f":"IF('PART A'!$G40=\"\",\"\",'PART A'!$G40)","v":""},{"$f":"IF('PART A'!$G42=\"\",\"\",'PART A'!$G42)","v":""},{"$f":"IF('PART A'!$G44=\"\",\"\",'PART A'!$G44)","v":""},{"$f":"IF('PART A'!$G46=\"\",\"\",'PART A'!$G46)","v":""},{"$f":"IF('PART A'!$G48=\"\",\"\",'PART A'!$G48)","v":""},{"$f":"IF('PART A'!$G50=\"\",\"\",'PART A'!$G50)","v":""},{"$f":"IF('PART A'!$G52=\"\",\"\",'PART A'!$G52)","v":""},{"$f":"IF('PART A'!$G54=\"\",\"\",'PART A'!$G54)","v":""},{"$f":"IF('PART A'!$I32=\"\",\"\",'PART A'!$I32)","v":""},{"$f":"IF('PART A'!$I34=\"\",\"\",'PART A'!$I34)","v":""},{"$f":"IF('PART A'!$I36=\"\",\"\",'PART A'!$I36)","v":""},{"$f":"IF('PART A'!$I38=\"\",\"\",'PART A'!$I38)","v":""},{"$f":"IF('PART A'!$I40=\"\",\"\",'PART A'!$I40)","v":""},{"$f":"IF('PART A'!$I42=\"\",\"\",'PART A'!$I42)","v":""},{"$f":"IF('PART A'!$I44=\"\",\"\",'PART A'!$I44)","v":""},{"$f":"IF('PART A'!$I46=\"\",\"\",'PART A'!$I46)","v":""},{"$f":"IF('PART A'!$I48=\"\",\"\",'PART A'!$I48)","v":""},{"$f":"IF('PART A'!$I50=\"\",\"\",'PART A'!$I50)","v":""},{"$f":"IF('PART A'!$I52=\"\",\"\",'PART A'!$I52)","v":""},{"$f":"IF('PART A'!$I54=\"\",\"\",'PART A'!$I54)","v":""},{"$f":"IF('PART A'!$K32=\"\",\"\",'PART A'!$K32)","v":""},{"$f":"IF('PART A'!$K34=\"\",\"\",'PART A'!$K34)","v":""},{"$f":"IF('PART A'!$K36=\"\",\"\",'PART A'!$K36)","v":""},{"$f":"IF('PART A'!$K38=\"\",\"\",'PART A'!$K38)","v":""},{"$f":"IF('PART A'!$K40=\"\",\"\",'PART A'!$K40)","v":""},{"$f":"IF('PART A'!$K42=\"\",\"\",'PART A'!$K42)","v":""},{"$f":"IF('PART A'!$K44=\"\",\"\",'PART A'!$K44)","v":""},{"$f":"IF('PART A'!$K46=\"\",\"\",'PART A'!$K46)","v":""},{"$f":"IF('PART A'!$K48=\"\",\"\",'PART A'!$K48)","v":""},{"$f":"IF('PART A'!$K50=\"\",\"\",'PART A'!$K50)","v":""},{"$f":"IF('PART A'!$K52=\"\",\"\",'PART A'!$K52)","v":""},{"$f":"IF('PART A'!$K54=\"\",\"\",'PART A'!$K54)","v":""},{"$f":"IF('PART A'!$M32=\"\",\"\",'PART A'!$M32)","v":""},{"$f":"IF('PART A'!$M34=\"\",\"\",'PART A'!$M34)","v":""},{"$f":"IF('PART A'!$M36=\"\",\"\",'PART A'!$M36)","v":""},{"$f":"IF('PART A'!$M38=\"\",\"\",'PART A'!$M38)","v":""},{"$f":"IF('PART A'!$M40=\"\",\"\",'PART A'!$M40)","v":""},{"$f":"IF('PART A'!$M42=\"\",\"\",'PART A'!$M42)","v":""},{"$f":"IF('PART A'!$M44=\"\",\"\",'PART A'!$M44)","v":""},{"$f":"IF('PART A'!$M46=\"\",\"\",'PART A'!$M46)","v":""},{"$f":"IF('PART A'!$M48=\"\",\"\",'PART A'!$M48)","v":""},{"$f":"IF('PART A'!$M50=\"\",\"\",'PART A'!$M50)","v":""},{"$f":"IF('PART A'!$M52=\"\",\"\",'PART A'!$M52)","v":""},{"$f":"IF('PART A'!$M54=\"\",\"\",'PART A'!$M54)","v":""},{"$f":"IF('PART A'!$G67=\"\",\"\",'PART A'!$G67)","v":""},{"$f":"IF('PART A'!$G69=\"\",\"\",'PART A'!$G69)","v":""},{"$f":"IF('PART A'!$G71=\"\",\"\",'PART A'!$G71)","v":""},{"$f":"IF('PART A'!$G73=\"\",\"\",'PART A'!$G73)","v":""},{"$f":"IF('PART A'!$G75=\"\",\"\",'PART A'!$G75)","v":""},{"$f":"IF('PART A'!$G77=\"\",\"\",'PART A'!$G77)","v":""},{"$f":"IF('PART A'!$G79=\"\",\"\",'PART A'!$G79)","v":""},{"$f":"IF('PART A'!$G81=\"\",\"\",'PART A'!$G81)","v":""},{"$f":"IF('PART A'!$G83=\"\",\"\",'PART A'!$G83)","v":""},{"$f":"IF('PART A'!$G85=\"\",\"\",'PART A'!$G85)","v":""},{"$f":"IF('PART A'!$G87=\"\",\"\",'PART A'!$G87)","v":""},{"$f":"IF('PART A'!$G89=\"\",\"\",'PART A'!$G89)","v":""},{"$f":"IF('PART A'!$G91=\"\",\"\",'PART A'!$G91)","v":""},{"$f":"IF('PART A'!$G93=\"\",\"\",'PART A'!$G93)","v":""},{"$f":"IF('PART A'!$I67=\"\",\"\",'PART A'!$I67)","v":""},{"$f":"IF('PART A'!$I69=\"\",\"\",'PART A'!$I69)","v":""},{"$f":"IF('PART A'!$I71=\"\",\"\",'PART A'!$I71)","v":""},{"$f":"IF('PART A'!$I73=\"\",\"\",'PART A'!$I73)","v":""},{"$f":"IF('PART A'!$I75=\"\",\"\",'PART A'!$I75)","v":""},{"$f":"IF('PART A'!$I77=\"\",\"\",'PART A'!$I77)","v":""},{"$f":"IF('PART A'!$I79=\"\",\"\",'PART A'!$I79)","v":""},{"$f":"IF('PART A'!$I81=\"\",\"\",'PART A'!$I81)","v":""},{"$f":"IF('PART A'!$I83=\"\",\"\",'PART A'!$I83)","v":""},{"$f":"IF('PART A'!$I85=\"\",\"\",'PART A'!$I85)","v":""},{"$f":"IF('PART A'!$I87=\"\",\"\",'PART A'!$I87)","v":""},{"$f":"IF('PART A'!$I89=\"\",\"\",'PART A'!$I89)","v":""},{"$f":"IF('PART A'!$I91=\"\",\"\",'PART A'!$I91)","v":""},{"$f":"IF('PART A'!$I93=\"\",\"\",'PART A'!$I93)","v":""},{"$f":"IF('PART A'!$K67=\"\",\"\",'PART A'!$K67)","v":""},{"$f":"IF('PART A'!$K69=\"\",\"\",'PART A'!$K69)","v":""},{"$f":"IF('PART A'!$K71=\"\",\"\",'PART A'!$K71)","v":""},{"$f":"IF('PART A'!$K73=\"\",\"\",'PART A'!$K73)","v":""},{"$f":"IF('PART A'!$K75=\"\",\"\",'PART A'!$K75)","v":""},{"$f":"IF('PART A'!$K77=\"\",\"\",'PART A'!$K77)","v":""},{"$f":"IF('PART A'!$K79=\"\",\"\",'PART A'!$K79)","v":""},{"$f":"IF('PART A'!$K81=\"\",\"\",'PART A'!$K81)","v":""},{"$f":"IF('PART A'!$K83=\"\",\"\",'PART A'!$K83)","v":""},{"$f":"IF('PART A'!$K85=\"\",\"\",'PART A'!$K85)","v":""},{"$f":"IF('PART A'!$K87=\"\",\"\",'PART A'!$K87)","v":""},{"$f":"IF('PART A'!$K89=\"\",\"\",'PART A'!$K89)","v":""},{"$f":"IF('PART A'!$K91=\"\",\"\",'PART A'!$K91)","v":""},{"$f":"IF('PART A'!$K93=\"\",\"\",'PART A'!$K93)","v":""},{"$f":"IF('PART A'!$C101=\"\",\"\",'PART A'!$C101)","v":""},{"$f":"IF('PART A'!$C109=\"\",\"\",'PART A'!$C109)","v":""},{"$f":"IF('PART B'!$E11=\"\",\"\",'PART B'!$E11)","v":""},{"$f":"IF('PART B'!$E20=\"\",\"\",'PART B'!$E20)","v":""},{"$f":"IF('PART B'!$E22=\"\",\"\",'PART B'!$E22)","v":""},null,null,{"$f":"IF('PART B'!$E28=\"\",\"\",'PART B'!$E28)","v":""},{"$f":"IF('PART B'!$E30=\"\",\"\",'PART B'!$E30)","v":""},{"$f":"IF('PART B'!$E32=\"\",\"\",'PART B'!$E32)","v":""},{"$f":"IF('PART B'!$G20=\"\",\"\",'PART B'!$G20)","v":""},{"$f":"IF('PART B'!$G22=\"\",\"\",'PART B'!$G22)","v":""},{"$f":"IF('PART B'!$G24=\"\",\"\",'PART B'!$G24)","v":""},{"$f":"IF('PART B'!$G26=\"\",\"\",'PART B'!$G26)","v":""},{"$f":"IF('PART B'!$G28=\"\",\"\",'PART B'!$G28)","v":""},{"$f":"IF('PART B'!$G30=\"\",\"\",'PART B'!$G30)","v":""},{"$f":"IF('PART B'!$G32=\"\",\"\",'PART B'!$G32)","v":""},{"$f":"IF('PART B'!$I20=\"\",\"\",'PART B'!$I20)","v":""},{"$f":"IF('PART B'!$I22=\"\",\"\",'PART B'!$I22)","v":""},{"$f":"IF('PART B'!$I24=\"\",\"\",'PART B'!$I24)","v":""},{"$f":"IF('PART B'!$I26=\"\",\"\",'PART B'!$I26)","v":""},{"$f":"IF('PART B'!$I28=\"\",\"\",'PART B'!$I28)","v":""},{"$f":"IF('PART B'!$I30=\"\",\"\",'PART B'!$I30)","v":""},{"$f":"IF('PART B'!$I32=\"\",\"\",'PART B'!$I32)","v":""},{"$f":"IF('PART B'!$K20=\"\",\"\",'PART B'!$K20)","v":""},{"$f":"IF('PART B'!$K22=\"\",\"\",'PART B'!$K22)","v":""},{"$f":"IF('PART B'!$K24=\"\",\"\",'PART B'!$K24)","v":""},{"$f":"IF('PART B'!$K26=\"\",\"\",'PART B'!$K26)","v":""},{"$f":"IF('PART B'!$K28=\"\",\"\",'PART B'!$K28)","v":""},{"$f":"IF('PART B'!$K30=\"\",\"\",'PART B'!$K30)","v":""},{"$f":"IF('PART B'!$K32=\"\",\"\",'PART B'!$K32)","v":""},{"$f":"IF('PART B'!$M20=\"\",\"\",'PART B'!$M20)","v":""},{"$f":"IF('PART B'!$M22=\"\",\"\",'PART B'!$M22)","v":""},{"$f":"IF('PART B'!$M24=\"\",\"\",'PART B'!$M24)","v":""},{"$f":"IF('PART B'!$M26=\"\",\"\",'PART B'!$M26)","v":""},{"$f":"IF('PART B'!$M28=\"\",\"\",'PART B'!$M28)","v":""},{"$f":"IF('PART B'!$M30=\"\",\"\",'PART B'!$M30)","v":""},{"$f":"IF('PART B'!$M32=\"\",\"\",'PART B'!$M32)","v":""},{"$f":"IF('PART B'!$G43=\"\",\"\",'PART B'!$G43)","v":""},{"$f":"IF('PART B'!$G46=\"\",\"\",'PART B'!$G46)","v":""},{"$f":"IF('PART B'!$G78=\"\",\"\",'PART B'!$G78)","v":""},{"$f":"IF('PART B'!$G81=\"\",\"\",'PART B'!$G81)","v":""},{"$f":"IF('PART B'!$G84=\"\",\"\",'PART B'!$G84)","v":""},{"$f":"IF('PART B'!$I43=\"\",\"\",'PART B'!$I43)","v":""},{"$f":"IF('PART B'!$I46=\"\",\"\",'PART B'!$I46)","v":""},{"$f":"IF('PART B'!$I78=\"\",\"\",'PART B'!$I78)","v":""},{"$f":"IF('PART B'!$I81=\"\",\"\",'PART B'!$I81)","v":""},{"$f":"IF('PART B'!$I84=\"\",\"\",'PART B'!$I84)","v":""},{"$f":"IF('PART B'!$K43=\"\",\"\",'PART B'!$K43)","v":""},{"$f":"IF('PART B'!$K46=\"\",\"\",'PART B'!$K46)","v":""},{"$f":"IF('PART B'!$K78=\"\",\"\",'PART B'!$K78)","v":""},{"$f":"IF('PART B'!$K81=\"\",\"\",'PART B'!$K81)","v":""},{"$f":"IF('PART B'!$K84=\"\",\"\",'PART B'!$K84)","v":""},{"$f":"IF('PART B'!C93=\"\",\"\",'PART B'!C93)","v":""},{"$f":"IF('PART B'!C101=\"\",\"\",'PART B'!C101)","v":""},{"$f":"IF('PART B'!C109=\"\",\"\",'PART B'!C109)","v":""}]

{"sheet":"Weighted Populations","index":7,"n_rows":1266,"n_cols":17,"rows_kept":1266,"cut":false,"hidden":true,"merged":[]}
["PCN Code","PCN Name","Normalised Weighted List Size","PCN Code","PCN Parent\nCCG Code","PCN Parent\nCCG Name",null,null,null,null,"PCN Code","PCN Name","PCN Parent\nCCG Code","PCN Parent\nCCG Name",null,"PCN Code","PCN Name"]
["U00070","WEST MERTON PCN",25756.443284708999,{"$f":"A2","v":"U00070"},{"$f":"VLOOKUP($A2,$K$2:$N$1255,3,FALSE)","v":"36L"},{"$f":"VLOOKUP($A2,$K$2:$N$1255,4,FALSE)","v":"NHS SOUTH WEST LONDON CCG"},null,null,null,null,"U00070","WEST MERTON PCN","36L","NHS SOUTH WEST LONDON CCG",null,"U60176","3 CENTRES PCN"]
["U00147","AEGIS HEALTHCARE PCN",44081.87514870576,{"$f":"A3","v":"U00147"},{"$f":"VLOOKUP($A3,$K$2:$N$1255,3,FALSE)","v":"04C"},{"$f":"VLOOKUP($A3,$K$2:$N$1255,4,FALSE)","v":"NHS LEICESTER CITY CCG"},null,null,null,null,"U00147","AEGIS HEALTHCARE PCN","04C","NHS LEICESTER CITY CCG",null,"U72999","4 DONCASTER PCN"]
["U00203","ECCLES & IRLAM PCN",61820.012986500442,"U00203","01G","NHS SALFORD CCG",null,null,null,null,"U00203","ECCLES & IRLAM PCN","01G","NHS SALFORD CCG",null,"U16600","4PCC (BNSSG) PCN"]
["U00254","BLACKHEATH AND CHARLTON PCN",45653.480727063041,"U00254","72Q","NHS SOUTH EAST LONDON CCG",null,null,null,null,"U00254","BLACKHEATH AND CHARLTON PCN","72Q","NHS SOUTH EAST LONDON CCG",null,"U89554","A1 NETWORK PCN"]
["U00351","SOLIHULL SOUTH CENTRAL PCN",26992.153601899008,"U00351","15E","NHS BIRMINGHAM AND SOLIHULL CCG",null,null,null,null,"U00351","SOLIHULL SOUTH CENTRAL PCN","15E","NHS BIRMINGHAM AND SOLIHULL CCG",null,"U72748","A31 GROUP PCN"]
{"$rows_left_out":1260}