{"text_format":"1","workbook":"xlsx","n_sheets":9,"sheets":["Home","Questions for Managers","Questions for Staff","PID","Standards and targets","Scores","action recomendations","Improvement Summary","Action Plan"],"not_rendered":{"charts":6,"images":1,"macros":1,"external_links":0,"defined_names":126,"comments":0,"pivot_tables":0},"unopened":[],"bounds":{"document_bytes":16777216,"sheet_cells":100000,"rows_first":2000,"rows_last":500,"rows_between":2000,"halvings":0,"cell_chars":16384,"cell_head_chars":4096},"cells_cut":0,"cells_raw":0,"read":"whole","date_system":"1900"}

{"sheet":"Home","index":0,"n_rows":17,"n_cols":2,"rows_kept":17,"cut":false,"hidden":false,"merged":[[3,1,3,11]]}
[]
[]
[null,"Improvement Tool"]
[null,"Reducing deaths of people with a learning disability in NHS acute (hospital) trusts in England"]
[null,"Contents"]
[null,"Instructions"]
[null,"Questions for managers"]
[null,"Questions for staff"]
[null,"Improvement summary"]
[null,"Action plan"]
{"$rows_left_out":8}
{"sheet":"Questions for Managers","index":1,"n_rows":47,"n_cols":7,"rows_kept":47,"cut":false,"hidden":false,"merged":[[3,1,3,5],[19,1,22,1],[23,1,25,1],[12,1,18,1],[5,1,11,1],[45,1,46,1],[28,1,28,5],[32,1,34,1],[37,1,37,5],[39,1,41,1],[42,1,44,1],[30,1,31,1]]}
[]
[null,"Managers responses:",null,null,{"$f":"IF(TrustName<>\"\",TrustName,\"\")&\",\"&IF(CompletionDate<>\"\",TEXT(CompletionDate,\" dd-mmm-yy\"),\"\")","v":","}]
[null,"Respecting and protecting peoples' rights"]
[null,"All NHS trusts must ensure that they meet their Equality Act Duties to people with a learning disability; and ensure that their wider human rights are respected and protected, as required by the Human Rights Act."]
[null,"Improvement measures",null,"Mgr Rating Code","Questions for managers","Manager rating","mgrs scores"]
[null,"Trusts must have measures in place to promote anti discriminatory practice in relation to people with learning disabilities.","Question 1","MR1a","Does your trust have systems in place to ensure that senior managers hear about the experiences of patients with learning disabilities and their families, who use your services; and if so, can these be disaggregated, so that the views of patients with learning disabilities can be considered separately, and compared to other patients.",null,{"$f":"IF(F6=\"Currently achieving.\",5,IF(F6=\"Confident we will  achieve within 6 months.\",3,IF(F6=\"Not fully achieved, but will in the next 12 months.\",1,IF(F6=\"Not achieving and unlikely to do so in next 12 months.\",0))))","v":false}]
[null,null,"Question 2","MR1b","Does your trust monitor the 'clinical outcomes' of services delivered to patients with learning disabilities in a way that allows data about service use to be disaggregated for patients with learning disabilities, so that any inequalities in service use can be identified and addressed?",null,{"$f":"IF(F7=\"Currently achieving.\",5,IF(F7=\"Confident we will  achieve within 6 months.\",3,IF(F7=\"Not fully achieved, but will in the next 12 months.\",1,IF(F7=\"Not achieving and unlikely to do so in next 12 months.\",0))))","v":false}]
[null,null,"Question 3","MR1c","Does your trust monitor numbers of patients with learning disabilities on waiting lists and the lengths of their waits, so that comparisons can be made with other groups? And, if there are concerns, do you proactively report these to service commissioners?",null,false]
[null,null,"Question 4","MR1d","Does your trust have a robust Mental Capacity Act policy which requires staff do everything possible to support patients to make their own decisions about their care and treatment. And, if a patient has been assessed as lacking capacity to make a particular decision, does the policy outline how the decision is to be made in accordance with a lawful 'best interests' process?",null,false]
[null,null,"Question 5","MR1e","Does your trust undertake at least annual audits of compliance with its Mental Capacity Act Policy so that you can understand how effectively it is being followed; and make improvements where needed?",null,false]
{"$rows_left_out":38}
{"sheet":"Questions for Staff","index":2,"n_rows":46,"n_cols":7,"rows_kept":46,"cut":false,"hidden":false,"merged":[[27,1,27,5],[5,1,10,1],[11,1,17,1],[3,1,3,5],[18,1,21,1],[22,1,24,1],[37,1,37,5],[41,1,43,1],[44,1,45,1],[29,1,32,1],[39,1,40,1],[33,1,34,1]]}
[]
[null,"Staff responses:",{"$f":"IF(TrustName<>\"\",TrustName,\"\")&\",\"&IF(CompletionDate<>\"\",TEXT(CompletionDate,\" dd-mmm-yy\"),\"\")","v":","}]
[null,"Respecting and protecting peoples' rights"]
[null,"All NHS trusts must ensure that they meet their Equality Act Duties to people with a learning disability; and ensure that their wider human rights are respected and protected, as required by the Human Rights Act."]
[null,"Improvement measures",null,"Mgr Rating Code","Questions for staff","Staff rating"]
[null,"Trusts must have measures in place to promote anti discriminatory practice in relation to people with learning disabilities.","Question 1","SR1a","As far as you know, does your trust use systems and measures to check whether the experiences of patients with learning disabilities who use your services, are the same as anyone else's?",null,{"$f":"IF(F6=\"Yes, definitely\",5,IF(F6=\"To some extent\",3,IF(F6=\"Not certain but I expect so\",1,IF(F6=\"I doubt it\",0))))","v":false}]
[null,null,"Question 2","SR1b","Within your team, do you ever get to see and reflect on data that shows how clinically effective your trust/service is at supporting patients with learning disabilities?",null,{"$f":"IF(F7=\"Yes, routinely\",5,IF(F7=\"Now and again\",3,IF(F7=\"Not often\",1,IF(F7=\"Not really\",0))))","v":false}]
[null,null,"Question 3","SR1c","When offering learning disabled patients choices about their care and treatment, if staff think a patient might lack the ability to make a decision, are they able to either formally assess the person’s capacity themselves; or arrange for a specialist to come quickly and do it?",null,{"$f":"IF(F8=\"Yes, routinely\",5,IF(F8=\"More often than not\",3,IF(F8=\"Sometimes / partially\",1,IF(F8=\"Not really\",0))))","v":false}]
[null,null,"Question 4","SR1d","If a learning disabled patient has been found to lack the capacity to make an important decision, do staff: routinely consult the person’s family; or, if there is no-one appropriate to consult, do they know how to arrange a referral for an Independent Mental Capacity Advocate instead?",null,{"$f":"IF(F9=\"Yes, routinely\",5,IF(F9=\"More often than not\",3,IF(F9=\"Sometimes / partially\",1,IF(F9=\"Not really\",0))))","v":false}]
[null,null,"Question 5","SR1f","Have staff been trained to understand their duty to respect and protect learning disabled patients' right to life; and importantly, to follow processes that are consistent with the Mental Capacity Act,  if contributing to decisions about withholding life sustaining treatments or resuscitation?",null,{"$f":"IF(F10=\"Yes, in detail\",5,IF(F10=\"Mostly\",3,IF(F10=\"Partially\",1,IF(F10=\"Not really\",0))))","v":false}]
{"$rows_left_out":37}
{"sheet":"PID","index":3,"n_rows":71,"n_cols":12,"rows_kept":71,"cut":false,"hidden":true,"merged":[]}
["Currently achieving."]
["Confident we will  achieve within 6 months."]
["Not fully achieved, but will in the next 12 months."]
["Not achieving and unlikely to do so in next 12 months."]
["N/A"]
["Q1"]
["Yes, definitely"]
["To some extent",null,null,null,"VLOOKUP table"]
["Not certain but I expect so",null,null,null,"mean greater than","value to return"]
["I doubt it",null,null,null,0,0,"Not achieving and unlikely to do so in next 12 months."]
{"$rows_left_out":62}
{"sheet":"Standards and targets","index":4,"n_rows":54,"n_cols":12,"rows_kept":54,"cut":false,"hidden":true,"merged":[]}
["Domain","Improvement Code","Improvement Measure","Manager Indicator Codes","Mgr Supp raw scores","Managers scores","Manager indicators","Staff Indicator Codes","Staff supp raw scors","Staff score","Staff indicators"]
["Rights","R1","Trusts must have measures in place to promote anti discriminatory practice in relation to people with learning disabilities.","MR1a",null,{"$f":"'Questions for Managers'!G6","v":false},{"$f":"'Questions for Managers'!E6","v":"Does your trust have systems in place to ensure that senior managers hear about the experiences of patients with learning disabilities and their families, who use your services; and if so, can these be disaggregated, so that the views of patients with learning disabilities can be considered separately, and compared to other patients."},"SR1a",null,{"$f":"'Questions for Staff'!G6","v":false},{"$f":"'Questions for Staff'!E6","v":"As far as you know, does your trust use systems and measures to check whether the experiences of patients with learning disabilities who use your services, are the same as anyone else's?"},"x"]
["Rights","R1","Trusts must have measures in place to promote anti discriminatory practice in relation to people with learning disabilities.","MR1b",null,{"$f":"'Questions for Managers'!G7","v":false},{"$f":"'Questions for Managers'!E7","v":"Does your trust monitor the 'clinical outcomes' of services delivered to patients with learning disabilities in a way that allows data about service use to be disaggregated for patients with learning disabilities, so that any inequalities in service use can be identified and addressed?"},"SR1b",null,{"$f":"'Questions for Staff'!G7","v":false},{"$f":"'Questions for Staff'!E7","v":"Within your team, do you ever get to see and reflect on data that shows how clinically effective your trust/service is at supporting patients with learning disabilities?"},"x"]
["Rights","R1","Trusts must have measures in place to promote anti discriminatory practice in relation to people with learning disabilities.","MR1c",null,{"$f":"'Questions for Managers'!G8","v":false},{"$f":"'Questions for Managers'!E8","v":"Does your trust monitor numbers of patients with learning disabilities on waiting lists and the lengths of their waits, so that comparisons can be made with other groups? And, if there are concerns, do you proactively report these to service commissioners?"},"SR1c",null,{"$f":"'Questions for Staff'!G8","v":false},{"$f":"'Questions for Staff'!E8","v":"When offering learning disabled patients choices about their care and treatment, if staff think a patient might lack the ability to make a decision, are they able to either formally assess the person’s capacity themselves; or arrange for a specialist to come quickly and do it?"},"x"]
["Rights","R1","Trusts must have measures in place to promote anti discriminatory practice in relation to people with learning disabilities.","MR1d",null,{"$f":"'Questions for Managers'!G9","v":false},{"$f":"'Questions for Managers'!E9","v":"Does your trust have a robust Mental Capacity Act policy which requires staff do everything possible to support patients to make their own decisions about their care and treatment. And, if a patient has been assessed as lacking capacity to make a particular decision, does the policy outline how the decision is to be made in accordance with a lawful 'best interests' process?"},"SR1d",null,{"$f":"'Questions for Staff'!G9","v":false},{"$f":"'Questions for Staff'!E9","v":"If a learning disabled patient has been found to lack the capacity to make an important decision, do staff: routinely consult the person’s family; or, if there is no-one appropriate to consult, do they know how to arrange a referral for an Independent Mental Capacity Advocate instead?"},"x"]
["Rights","R1","Trusts must have measures in place to promote anti discriminatory practice in relation to people with learning disabilities.","MR1e",null,{"$f":"'Questions for Managers'!G10","v":false},{"$f":"'Questions for Managers'!E10","v":"Does your trust undertake at least annual audits of compliance with its Mental Capacity Act Policy so that you can understand how effectively it is being followed; and make improvements where needed?"},"SR1e",null,null,null,"x"]
["Rights","R1","Trusts must have measures in place to promote anti discriminatory practice in relation to people with learning disabilities.","MR1f",null,{"$f":"'Questions for Managers'!G11","v":false},{"$f":"'Questions for Managers'!E11","v":"Does your trust have a clear policy (based on the principles of the Mental Capacity Act), which guides and supports staff when making decisions about withdrawing life sustaining treatments, or not to attempt cardio-pulmonary resuscitation?"},"SR1f",null,{"$f":"'Questions for Staff'!G10","v":false},{"$f":"'Questions for Staff'!E10","v":"Have staff been trained to understand their duty to respect and protect learning disabled patients' right to life; and importantly, to follow processes that are consistent with the Mental Capacity Act,  if contributing to decisions about withholding life sustaining treatments or resuscitation?"},"x"]
["Rights","R1","Trusts must have measures in place to promote anti discriminatory practice in relation to people with learning disabilities.","MR1g",null,{"$f":"'Questions for Managers'!G12","v":false},{"$f":"'Questions for Managers'!E12","v":"Does your trust audit clinical records and communications to ensure that information about a patient's learning disability and the reasonable adjustments they need is shared both within the trust and wherever appropriate, with external agencies?"},"SR1g",null,{"$f":"'Questions for Staff'!G11","v":false},{"$f":"'Questions for Staff'!E11","v":"If staff make referrals to other departments within the trust, or other external agencies, are they always explicit if a patient has a learning disability, and about any reasonable adjustments they are known to require?"}]
["Rights","R1","Trusts must have measures in place to promote anti discriminatory practice in relation to people with learning disabilities.","MR1supp1",{"$f":"AVERAGE('Questions for Managers'!G13:G19)","v":{"$error":"#DIV/0!"}},{"$f":"VLOOKUP(MR1supp1raw,PID!$E$10:$F$13,2,TRUE)","v":{"$error":"#DIV/0!"}},"Mean of MR2a-g","SR1supp1",{"$f":"AVERAGE('Questions for Staff'!G12:G18)","v":{"$error":"#DIV/0!"}},{"$f":"VLOOKUP(SR1supp1raw,PID!$E$10:$F$13,2,TRUE)","v":{"$error":"#DIV/0!"}},"Mean of SR2a-g","x"]
["Rights","R1","Trusts must have measures in place to promote anti discriminatory practice in relation to people with learning disabilities.","MR1supp2",null,{"$f":"MW1c","v":false},{"$f":"'Questions for Managers'!E42","v":"Where it can reasonably be predicted that trust staff require access to specialist practitioners (including on a liaison basis) from other health or social care providers, does the trust have clear service level agreements, or joint working protocols, with them which include referral mechanisms and response times?"},"SR1supp2",null,{"$f":"SW1c","v":false},{"$f":"K47","v":"Where in order to meet patients' needs, trust staff need to work with staff from another health or social care provider, are there clear referral mechanisms and arrangements for joint working?"},"x"]
{"$rows_left_out":45}
{"sheet":"Scores","index":5,"n_rows":74,"n_cols":19,"rows_kept":74,"cut":false,"hidden":true,"merged":[]}
["Standard","Improvement Measure","Manager Total","Manager max","Manager % max","Staff Total","Staff Max","Staff % max",null,null,null,"Mean managers score","Mean staff score","Overall mean score"]
["Rights","R1",{"$f":"SUM(MR1a,MR1b,MR1c,MR1d,MR1e,MR1f,MR1g,MR1supp1,MR1supp2,MR1supp3)","v":{"$error":"#DIV/0!"}},{"$f":"(COUNT(MR1a,MR1b,MR1c,MR1d,MR1e,MR1f,MR1g,MR1supp1,MR1supp2,MR1supp3))*5","v":0},{"$f":"IFERROR(C2/D2,\"\")","v":""},{"$f":"SUM(SR1a,SR1b,SR1c,SR1d,SR1f,SR1g,SR1supp1,SR1supp2,SR1supp3,SR1supp4)","v":{"$error":"#DIV/0!"}},{"$f":"(COUNT(SR1a,SR1b,SR1c,SR1d,SR1f,SR1g,SR1supp1,SR1supp2,SR1supp3,SR1supp4))*5","v":0},{"$f":"IFERROR(F2/G2,\"\")","v":""},"R1 Mean",{"$f":"AVERAGE(E2,H2)","v":{"$error":"#DIV/0!"}},null,{"$f":"IFERROR(AVERAGE(MR1a,MR1b,MR1c,MR1d,MR1e,MR1f,MR1g,MR1supp1,MR1supp2,MR1supp3),\"\")","v":""},{"$f":"IFERROR(AVERAGE(SR1a,SR1b,SR1c,SR1d,SR1f,SR1g,SR1supp1,SR1supp2,SR1supp3,SR1supp4),\"\")","v":""},{"$f":"AVERAGE(L2,M2)","v":{"$error":"#DIV/0!"}}]
["Rights","R2",{"$f":"SUM(MR2a,MR2b,MR2c,MR2d,MR2e,MR2f,MR2g,MR2Supp1,MR2Supp2,MR2Supp3,MR2Supp4)","v":{"$error":"#DIV/0!"}},{"$f":"(COUNT(MR2a,MR2b,MR2c,MR2d,MR2e,MR2f,MR2g,MR2Supp1,MR2Supp2,MR2Supp3,MR2Supp4))*5","v":0},{"$f":"IFERROR(C3/D3,\"\")","v":""},{"$f":"SUM(SR2a,SR2b,SR2c,SR2d,SR2e,SR2f,SR2g,SR2supp2,SR2supp3,SR2supp4)","v":{"$error":"#DIV/0!"}},{"$f":"(COUNT(SR2a,SR2b,SR2c,SR2d,SR2e,SR2f,SR2g,SR2supp2,SR2supp3,SR2supp4))*5","v":0},{"$f":"IFERROR(F3/G3,\"\")","v":""},"R2 Mean",{"$f":"AVERAGE(E3,H3)","v":{"$error":"#DIV/0!"}},null,{"$f":"IFERROR(AVERAGE(MR2a,MR2b,MR2c,MR2d,MR2e,MR2f,MR2g,MR2Supp1,MR2Supp2,MR2Supp3,MR2Supp4),\"\")","v":""},{"$f":"IFERROR(AVERAGE(SR2a,SR2b,SR2c,SR2d,SR2e,SR2f,SR2g,SR2supp2,SR2supp3,SR2supp4),\"\")","v":""},{"$f":"AVERAGE(L3,M3)","v":{"$error":"#DIV/0!"}}]
["Rights","R3",{"$f":"SUM(MR3a,MR3b,MR3c,MR3d)","v":0},{"$f":"(COUNT(MR3a,MR3b,MR3c,MR3d))*5","v":0},"",{"$f":"SUM(SR3a,SR3b,SR3c,SR3d,SR3supp1)","v":0},{"$f":"(COUNT(SR3a,SR3b,SR3c,SR3d,SR3supp1))*5","v":0},"","R3 Mean",{"$error":"#DIV/0!"},null,{"$f":"IFERROR(AVERAGE(MR3a,MR3b,MR3c,MR3d),\"\")","v":""},{"$f":"IFERROR(AVERAGE(SR3a,SR3b,SR3c,SR3d,SR3supp1),\"\")","v":""},{"$error":"#DIV/0!"}]
["Rights","R5",{"$f":"SUM(MR5a,MR5b,MR5c,MR5Supp1)","v":{"$error":"#DIV/0!"}},{"$f":"(COUNT(MR5a,MR5b,MR5c,MR5Supp1))*5","v":0},"",{"$f":"SUM(SR5a,SR5bi,SR5bii,SR5supp1)","v":0},{"$f":"(COUNT(SR5a,SR5bi,SR5bii,SR5supp1))*5","v":0},"","R5 Mean",{"$error":"#DIV/0!"},null,{"$f":"IFERROR(AVERAGE(MR5a,MR5b,MR5c,MR5Supp1),\"\")","v":""},{"$f":"IFERROR(AVERAGE(SR5a,SR5bi,SR5bii,SR5supp1),\"\")","v":""},{"$error":"#DIV/0!"}]
["Rights","TOTALS",{"$f":"SUM(C2:C5)","v":{"$error":"#DIV/0!"}},{"$f":"SUM(D2:D5)","v":0},"",{"$f":"SUM(F2:F5)","v":{"$error":"#DIV/0!"}},{"$f":"SUM(G2:G5)","v":0},"","Overall Mean","Rights",{"$f":"AVERAGE(H6,E6)","v":{"$error":"#DIV/0!"}}]
["Inclusion","I1",{"$f":"SUM(MI1a,MI1b,MISupp1)","v":{"$error":"#DIV/0!"}},{"$f":"(COUNT(MI1a,MI1b,MISupp1))*5","v":0},"",{"$f":"SUM(SI1ai,SI1aii,SI1aiii,SI1b)","v":0},{"$f":"(COUNT(SI1ai,SI1aii,SI1aiii,SI1b))*5","v":0},"","I1 mean",{"$f":"AVERAGE(E7,H7)","v":{"$error":"#DIV/0!"}},null,{"$f":"IFERROR(AVERAGE(MI1a,MI1b,MISupp1),\"\")","v":""},{"$f":"IFERROR(AVERAGE(SI1ai,SI1aii,SI1aiii,SI1b,SI1supp1),\"\")","v":""},{"$error":"#DIV/0!"}]
["Inclusion","I4",{"$f":"SUM(MI4a,MI4b,MI4c,MI4supp1,MI4supp2)","v":{"$error":"#DIV/0!"}},{"$f":"(COUNT(MI4a,MI4b,MI4c,MI4supp1,MI4supp2))*5","v":0},"",{"$f":"SUM(SI4ai,SI4aii,SI4supp1,SI4supp2,SI4supp3)","v":{"$error":"#DIV/0!"}},{"$f":"(COUNT(SI4ai,SI4aii,SI4supp1,SI4supp2,SI4supp3))*5","v":0},"","I4 mean",{"$f":"AVERAGE(E8,H8)","v":{"$error":"#DIV/0!"}},null,{"$f":"IFERROR(AVERAGE(MI4a,MI4b,MI4c,MI4supp1,MI4supp2),\"\")","v":""},{"$f":"IFERROR(AVERAGE(SI4ai,SI4aii,SI4supp1,SI4supp2,SI4supp3),\"\")","v":""},{"$error":"#DIV/0!"}]
["Inclusion","TOTALS",{"$f":"SUM(C7:C8)","v":{"$error":"#DIV/0!"}},{"$f":"SUM(D7:D8)","v":0},"",{"$f":"SUM(F7:F8)","v":{"$error":"#DIV/0!"}},{"$f":"SUM(G7:G8)","v":0},"","Overall Mean","Inclusion & Engagement",{"$f":"AVERAGE(E9,H9)","v":{"$error":"#DIV/0!"}}]
["Workforce","W1",{"$f":"SUM(MW1a,MW1b,MW1c)","v":0},{"$f":"(COUNT(MW1a,MW1b,MW1c))*5","v":0},"",{"$f":"SUM(S1a,SW1c)","v":0},{"$f":"(COUNT(S1a,SW1c))*5","v":0},"","W1 mean",{"$f":"AVERAGE(E10,H10)","v":{"$error":"#DIV/0!"}},null,{"$f":"IFERROR(AVERAGE(MW1a,MW1b,MW1c),\"\")","v":""},{"$f":"IFERROR(AVERAGE(S1a,SW1c),\"\")","v":""},{"$error":"#DIV/0!"}]
{"$rows_left_out":65}
{"sheet":"action recomendations","index":6,"n_rows":29,"n_cols":6,"rows_kept":29,"cut":false,"hidden":true,"merged":[]}
[{"$f":"AVERAGE(MR1a:SR1a)","v":{"$error":"#DIV/0!"}},1,{"$f":"IF(A1=5,5,A1*(1/B1))","v":{"$error":"#DIV/0!"}},"Ensuring staff and managers across the trust routinely hear and reflect on the subjective experiences of individual patients with learning disabilities.",{"$f":"RANK(C1,$C$1:$C$26,1)+COUNTIF(C$1:C1,C1)-1","v":{"$error":"#DIV/0!"}},{"$f":"IFERROR(INDEX(D:D,MATCH(SMALL(E:E,ROW(D1)),E:E,0)),\"\")","v":""}]
[{"$f":"AVERAGE(MR1b:SR2a)","v":{"$error":"#DIV/0!"}},1.0449999999999999,{"$error":"#DIV/0!"},"Ensuring staff and managers see and reflect on data about the clinical outcomes that patients with learning disabilities experience.",{"$f":"RANK(C2,$C$1:$C$26,1)+COUNTIF(C$1:C2,C2)-1","v":{"$error":"#DIV/0!"}},{"$f":"IFERROR(INDEX(D:D,MATCH(SMALL(E:E,ROW(D2)),E:E,0)),\"\")","v":""}]
[{"$f":"MR1c","v":false},1,0,"Providing additional checks and support to patient with learning disabilities on waiting lists.",{"$f":"RANK(C3,$C$1:$C$26,1)+COUNTIF(C$1:C3,C3)-1","v":{"$error":"#DIV/0!"}},""]
[{"$f":"AVERAGE(MR1d:MR1e:MR1f:SR1c:SR1d:SR1f)","v":{"$error":"#DIV/0!"}},1,{"$error":"#DIV/0!"},"Checking that practice reflects MCA policies and that staff have the skills and time to implement them.",{"$f":"RANK(C4,$C$1:$C$26,1)+COUNTIF(C$1:C4,C4)-1","v":{"$error":"#DIV/0!"}},""]
[{"$f":"AVERAGE(MR1g:SR1g)","v":{"$error":"#DIV/0!"}},1,{"$error":"#DIV/0!"},"Making sure information about reasonable adjustments is being shared both within the trust and, where appropriate, externally.",{"$f":"RANK(C5,$C$1:$C$26,1)+COUNTIF(C$1:C5,C5)-1","v":{"$error":"#DIV/0!"}},""]
[{"$f":"AVERAGE(MR2a:SR2a)","v":{"$error":"#DIV/0!"}},1.17,{"$error":"#DIV/0!"},"Making sure due regard is paid to the content of hospital passports, across all wards / departments.",{"$f":"RANK(C6,$C$1:$C$26,1)+COUNTIF(C$1:C6,C6)-1","v":{"$error":"#DIV/0!"}},{"$f":"IFERROR(INDEX(D:D,MATCH(SMALL(E:E,ROW(D6)),E:E,0)),\"\")","v":""}]
[{"$f":"AVERAGE(MR2b:SR2b)","v":{"$error":"#DIV/0!"}},1.17,{"$error":"#DIV/0!"},"Making sure people’s communication / information needs are considered and taken account of.",{"$f":"RANK(C7,$C$1:$C$26,1)+COUNTIF(C$1:C7,C7)-1","v":{"$error":"#DIV/0!"}},""]
[{"$f":"AVERAGE(MR2c:SR2c)","v":{"$error":"#DIV/0!"}},1.17,{"$error":"#DIV/0!"},"Making sure staff know how to access and use accessible information.",{"$f":"RANK(C8,$C$1:$C$26,1)+COUNTIF(C$1:C8,C8)-1","v":{"$error":"#DIV/0!"}},""]
[{"$f":"AVERAGE(MR2d:SR2d)","v":{"$error":"#DIV/0!"}},1.17,{"$error":"#DIV/0!"},"Supporting the use of adapted pain recognition / assessment approaches.",{"$f":"RANK(C9,$C$1:$C$26,1)+COUNTIF(C$1:C9,C9)-1","v":{"$error":"#DIV/0!"}},""]
[{"$f":"AVERAGE(MR2e:SR2e)","v":{"$error":"#DIV/0!"}},1.17,{"$error":"#DIV/0!"},"Making proper arrangements for care coordination where people have multiple long term needs which mean they are frequent users of Trust services.",{"$f":"RANK(C10,$C$1:$C$26,1)+COUNTIF(C$1:C10,C10)-1","v":{"$error":"#DIV/0!"}},""]
{"$rows_left_out":20}
{"sheet":"Improvement Summary","index":7,"n_rows":39,"n_cols":7,"rows_kept":39,"cut":false,"hidden":false,"merged":[[9,1,9,3],[0,1,0,2],[1,1,1,6]]}
[null,"Performance and areas for improvement"]
[null,{"$f":"IF(TrustName<>\"\",TrustName,\"\")&\",\"&IF(CompletionDate<>\"\",TEXT(CompletionDate,\" dd-mmm-yy\"),\"\")&\": \"&IF(Wards<>\"\",Wards,\"\")","v":",: "}]
[]
[]
[]
[]
[]
[]
[]
[null,"Improvement measures: current position\n(Informed by combined staff & manager ratings)"]
{"$rows_left_out":30}
{"sheet":"Action Plan","index":8,"n_rows":14,"n_cols":8,"rows_kept":14,"cut":false,"hidden":false,"merged":[[2,1,2,7],[3,1,3,7],[1,1,1,7]]}
[]
[null,{"$f":"IF(TrustName<>\"\",TrustName,\"\")&\",\"&IF(CompletionDate<>\"\",TEXT(CompletionDate,\" dd-mmm-yy\"),\"\")&\": \"&IF(Wards<>\"\",Wards,\"\")","v":",: "}]
[null,"NHSI learning disability improvement standards: action plan"]
[null,"Complete the columns below by inserting relevant information concerning your action plan. "]
[null,null,"Improvement Measure","Type of plan needed","Think about things like","What needs to be done to achieve the standard / sustain adherence?","Who will be responsible for making sure it happens?","When does it need to be done by?"]
[null,"R1",{"$f":"'Standards and targets'!C2","v":"Trusts must have measures in place to promote anti discriminatory practice in relation to people with learning disabilities."},{"$f":"IF(Scores!N2>4,\"Sustainability plan\",\"Improvement plan\")","v":{"$error":"#DIV/0!"}},"How the Mental Capacity Act is applied; outcomes monitoring; waiting list management; reasonable adjustments; and access to learning disability specialists."]
[null,"R2",{"$f":"'Standards and targets'!C13","v":"Trusts must demonstrate that reasonable adjustments are made to care pathways, to allow people with learning disabilities to access highly personalised care, and to achieve equality of outcomes."},{"$f":"IF(Scores!N3>4,\"Sustainability plan\",\"Improvement plan\")","v":{"$error":"#DIV/0!"}},"The use of health passports; meeting information and communication needs; adapted assessments; care coordination; environmental modifications; outcomes monitoring; access to specialists; training."]
[null,"R3",{"$f":"'Standards and targets'!C24","v":"Trusts must demonstrate that they vigilantly monitor any restrictions or deprivations of liberty associated with the delivery of care and treatment."},{"$f":"IF(Scores!N4>4,\"Sustainability plan\",\"Improvement plan\")","v":{"$error":"#DIV/0!"}},"Policies; training; user involvement; governance; and data driven practice."]
[null,"R5",{"$f":"'Standards and targets'!C29","v":"Trusts must have processes to investigate and learn lessons if people with learning disabilities die whilst using their services."},{"$f":"IF(Scores!N5>4,\"Sustainability plan\",\"Improvement plan\")","v":{"$error":"#DIV/0!"}},"Engagement with LeDeR programme; governance structures; data analysis; and engagement with families."]
[null,"I1",{"$f":"'Standards and targets'!C34","v":"Trusts must demonstrate processes that ensure they work and engage with people receiving care, their families and carers, as set out in the NHS constitution."},{"$f":"IF(Scores!N7>4,\"Sustainability plan\",\"Improvement plan\")","v":{"$error":"#DIV/0!"}},"How are people included in meetings and care planning; responses to safety incidents; and governance arrangements for driving improvements in response to investigations."]
{"$rows_left_out":4}