{"text_format":"1","workbook":"xlsx","n_sheets":9,"sheets":["Menu","DTOC_Tool","DTOC_Charts","DTOC_Tool LA","LA_Charts","Pivots","Pivots_LA","ReferenceSheet","INFO"],"not_rendered":{"charts":14,"images":13,"macros":1,"external_links":0,"defined_names":32,"comments":0,"pivot_tables":3},"unopened":[],"bounds":{"document_bytes":16777216,"sheet_cells":100000,"rows_first":2000,"rows_last":500,"rows_between":2000,"halvings":0,"cell_chars":16384,"cell_head_chars":4096},"cells_cut":0,"cells_raw":0,"read":"whole","date_system":"1900"}

{"sheet":"Menu","index":0,"n_rows":16,"n_cols":3,"rows_kept":16,"cut":false,"hidden":false,"merged":[[23,8,23,9],[7,1,13,21],[1,1,3,21],[15,1,15,21],[21,8,21,9],[22,8,22,9]]}
[]
[null,"Delayed transfer of care \nimprovement tool"]
[]
[]
[]
[null,"Latest data: ",{"$f":"Pivots!A33","v":"2020-02-01"}]
[]
[null,"Introduction to the Delayed transfers of care improvement tool\n\nThis tool has been developed to enable trusts, CCGs and local authorities to easily understand what their most common reasons for delayed transfers of care are so that interventions can be focused on the areas which will have the biggest impact.\n\nThe Pareto chart at the top of the tool ranks the reasons in descending order with the ability to change the time period that this covers. The filters on the right of the tool allow you to view the reasons for delay in different ways and the service to which they are attributed (NHS, social care or both). Data can be viewed at regional, trust and local authority level. \n\nThe tool also tracks data over time and uses a technique called statistical process control (SPC) to:\n• identify when interventions result in an improvement\n• highlight when activities are not resulting in change, indicating that a change of approach is required\n\nSPC is one of the best ways to look at data as it identifies change that is statistically significant rather than due to chance.  \nFour charts are displayed underneath the Pareto chart. These show you the top four reasons over time using SPC charts, with the option to select a fifth chart.  \n\nIf you have any comments or feedback on the tool please email: nhsi.improvementanalyticsteam@nhs.net\n\nSource: Unify2 Data Collection - MSitDT\nPublished:  9 April 2020\n\n"]
[]
[]
[]
[]
[]
[]
[]
[null,"Navigation "]

{"sheet":"DTOC_Tool","index":1,"n_rows":54,"n_cols":32,"rows_kept":54,"cut":false,"hidden":false,"merged":[[8,16,8,26],[7,16,7,26],[1,1,5,26],[7,1,7,8],[8,1,8,8],[7,10,7,11],[7,13,7,14],[8,10,8,11],[8,13,8,14],[24,1,24,8],[38,1,38,8],[24,10,24,17],[38,10,39,17],[10,19,11,27],[38,19,50,26]]}
[]
[null,"Delayed transfer of care (NHS) \n By reason (number of delayed days)"]
[null,null,null,null,null,null,null,null,null,null,null,null,null,null,null,null,null,null,null,null,null,null,null,null,null,null,null,null,null,null,"Click on button to go to:"]
[]
[]
[]
[]
[null,"Region",null,null,null,null,null,null,null,null,"Type",null,null,"Source",null,null,"Provider",null,null,null,null,null,null,null,null,null,null,null,null,"To view England overview remove filters from 'Region' and 'Provider name'"]
[null,{"$f":"IF(DTOC_Charts!$G$11=1,\"England\",DTOC_Charts!C11)","v":"England"},null,null,null,null,null,null,null,null,{"$f":"DTOC_Charts!C13","v":"(All)"},null,null,{"$f":"DTOC_Charts!C14","v":"(All)"},null,null,{"$f":"IF(DTOC_Charts!$G$12=1,\"All\",DTOC_Charts!C12)","v":"All"}]
[]
[]
[]
[]
[]
[]
[]
[]
[]
[]
[]
[]
[]
[]
[]
[]
[]
[]
[]
[]
[]
[]
[]
[]
[]
[]
[null,null,null,null,null,null,null,null,null,null,null,null,null,null,null,null,null,null,null,null,null,null,null,null,null,null,null,null,null,"Key:"]
[]
[]
[null,null,null,null,null,null,null,null,null,null,null,null,null,null,null,null,null,null,null,"\nAdditional comments:\nThe five charts displaying the reasons will change from SPC charts to run charts if more than 5 data points are 0.\n\nThe Pareto chart will display the number of delayed days for the period selected and will rank them in descending order.\n\nThe four charts underneath will display the last 25 months of data for each of the top four reasons.\n\nThe user can select to display a fifth chart and the reason it displays."]
[]
[]
[]
[]
[]
[]
[]
[]
[null,null,null,null,null,null,null,null,null,null,null,null,null,null,null,null,null,null,null,null,null,null,null,null,null,null,null,null,null,null,null,"`"]
[]
[]
[]
[]
[]
["`"]

{"sheet":"DTOC_Charts","index":2,"n_rows":222,"n_cols":44,"rows_kept":222,"cut":false,"hidden":true,"merged":[[134,14,134,15],[163,14,163,15],[15,15,15,17],[7,1,7,2],[15,2,15,5],[47,3,47,5],[10,2,10,5],[13,2,13,5],[134,16,134,17],[163,16,163,17],[47,14,47,15],[47,16,47,17],[105,14,105,15],[105,16,105,17],[76,14,76,15],[76,16,76,17],[163,34,163,40],[134,19,135,19],[134,20,135,20],[134,26,134,32],[134,34,134,40],[163,19,164,19],[163,20,164,20],[163,26,163,32],[105,34,105,40],[76,19,77,19],[76,20,77,20],[76,26,76,32],[76,34,76,40],[105,19,106,19],[105,20,106,20],[105,26,105,32],[45,22,45,41],[47,19,48,19],[47,20,48,20],[47,26,47,32],[47,34,47,40],[192,34,192,40],[192,14,192,15],[192,16,192,17],[192,19,193,19],[192,20,193,20],[192,26,192,32]]}
[null,"Source",null,"Unify: pivot tables linked to excel extracts"]
[null,"Earliest week",null,{"$f":"MIN(Pivots!A8:A38)","v":"2018-02-01"},null,{"$f":"MONTH(D2)","v":2},{"$f":"YEAR(D2)","v":2018}]
[null,"Last date",null,{"$f":"MAX(Pivots!A9:A39)","v":"2020-02-01"},null,{"$f":"MONTH(D3)","v":2},{"$f":"YEAR(D3)","v":2020}]
[null,"Rows of data"]
[]
[]
[]
[null,"Start month ",null,{"$f":"D2","v":"2018-02-01"}]
[]
[null,null,null,null,null,null,"IF = all put 1 else 0",null,null,null,null,null,null,null,null,null,null,null,"Chart title",{"$f":"IF(U14=1,T11,T12)","v":"Pareto chart showing delayed days by reason for 6 months"}]
[null,"Region ref",{"$f":"Pivots!$B$5","v":"(All)"},null,null,null,{"$f":"IF(AND(C11=\"(All)\"),1,0)","v":1},null,null,null,null,null,null,null,null,null,"date end date plus offset ",null,null,{"$f":"\"Pareto chart showing delayed days by reason for\" &\" \"&U14&\" \"&\"month\"","v":"Pareto chart showing delayed days by reason for 6 month"}]
[null,"Provider name",{"$f":"Pivots!B1","v":"(All)"},null,null,null,{"$f":"IF(AND(C12=\"(All)\"),1,0)","v":1},null,null,null,null,null,null,null,null,null,null,null,null,{"$f":"\"Pareto chart showing delayed days by reason for\" &\" \"&U14&\" \"&\"months\"","v":"Pareto chart showing delayed days by reason for 6 months"}]
[null,"Type",{"$f":"Pivots!B3","v":"(All)"}]
[null,"Source",{"$f":"Pivots!B4","v":"(All)"},null,null,null,null,null,null,null,null,null,null,null,null,null,null,null,null,"Total months",{"$f":"COUNT(V17:V41)","v":6}]
[null,null,null,null,null,null,null,null,null,null,null,null,null,null,null,null,null,null,null,null,null,1,2,3,4,5,6,7,8,9,10,11]
[null,"Chart number","Title",null,null,null,null,null,null,"Chart look-up ref",null,null,null,null,null,"Delayed reasons adjust date range calculations",null,null,null,null,"Region","A) Awaiting completion of assessment","B) Awaiting public funding","C) Awaiting further non-acute NHS care (including intermediate care, rehabilitation services etc)","Di) Awaiting residential home placement or availability","Dii) Awaiting nursing home placement or availability","E) Awaiting care package in own home","F) Awaiting community equipment and adaptations","G) Patient or family choice","H) Disputes","I) Housing – patients not covered by NHS Care Act","O) Other"]
[null,1,{"$f":"C13&\" \"&\"Delayed Reasons\"","v":"(All) Delayed Reasons"},null,null,null,null,null,null,null,null,null,null,null,null,"From Drop down","Date start",20,1,{"$f":"B50","v":"2018-02-01"},{"$f":"$C$11","v":"(All)"},{"$f":"IFERROR(IF(AND($T17>=$R$24,$T17<=$R$25),(GETPIVOTDATA(\"Value\",Pivots!$A$6,\"Month\",$T17,\"Delay reason\",V$16)),\"\"),0)","v":""},{"$f":"IFERROR(IF(AND($T17>=$R$24,$T17<=$R$25),(GETPIVOTDATA(\"Value\",Pivots!$A$6,\"Month\",$T17,\"Delay reason\",W$16)),\"\"),0)","v":""},{"$f":"IFERROR(IF(AND($T17>=$R$24,$T17<=$R$25),(GETPIVOTDATA(\"Value\",Pivots!$A$6,\"Month\",$T17,\"Delay reason\",X$16)),\"\"),0)","v":""},{"$f":"IFERROR(IF(AND($T17>=$R$24,$T17<=$R$25),(GETPIVOTDATA(\"Value\",Pivots!$A$6,\"Month\",$T17,\"Delay reason\",Y$16)),\"\"),0)","v":""},{"$f":"IFERROR(IF(AND($T17>=$R$24,$T17<=$R$25),(GETPIVOTDATA(\"Value\",Pivots!$A$6,\"Month\",$T17,\"Delay reason\",Z$16)),\"\"),0)","v":""},{"$f":"IFERROR(IF(AND($T17>=$R$24,$T17<=$R$25),(GETPIVOTDATA(\"Value\",Pivots!$A$6,\"Month\",$T17,\"Delay reason\",AA$16)),\"\"),0)","v":""},{"$f":"IFERROR(IF(AND($T17>=$R$24,$T17<=$R$25),(GETPIVOTDATA(\"Value\",Pivots!$A$6,\"Month\",$T17,\"Delay reason\",AB$16)),\"\"),0)","v":""},{"$f":"IFERROR(IF(AND($T17>=$R$24,$T17<=$R$25),(GETPIVOTDATA(\"Value\",Pivots!$A$6,\"Month\",$T17,\"Delay reason\",AC$16)),\"\"),0)","v":""},{"$f":"IFERROR(IF(AND($T17>=$R$24,$T17<=$R$25),(GETPIVOTDATA(\"Value\",Pivots!$A$6,\"Month\",$T17,\"Delay reason\",AD$16)),\"\"),0)","v":""},{"$f":"IFERROR(IF(AND($T17>=$R$24,$T17<=$R$25),(GETPIVOTDATA(\"Value\",Pivots!$A$6,\"Month\",$T17,\"Delay reason\",AE$16)),\"\"),0)","v":""},{"$f":"IFERROR(IF(AND($T17>=$R$24,$T17<=$R$25),(GETPIVOTDATA(\"Value\",Pivots!$A$6,\"Month\",$T17,\"Delay reason\",AF$16)),\"\"),0)","v":""},{"$f":"COUNT(V17:AF17)","v":0}]
[null,null,"Top 4 Reasons + self selected reason",null,null,null,null,null,null,null,null,null,null,null,null,"From Drop down","Date end",25,2,{"$f":"B51","v":"2018-03-01"},{"$f":"$C$11","v":"(All)"},{"$f":"IFERROR(IF(AND($T18>=$R$24,$T18<=$R$25),(GETPIVOTDATA(\"Value\",Pivots!$A$6,\"Month\",$T18,\"Delay reason\",V$16)),\"\"),0)","v":""},{"$f":"IFERROR(IF(AND($T18>=$R$24,$T18<=$R$25),(GETPIVOTDATA(\"Value\",Pivots!$A$6,\"Month\",$T18,\"Delay reason\",W$16)),\"\"),0)","v":""},{"$f":"IFERROR(IF(AND($T18>=$R$24,$T18<=$R$25),(GETPIVOTDATA(\"Value\",Pivots!$A$6,\"Month\",$T18,\"Delay reason\",X$16)),\"\"),0)","v":""},{"$f":"IFERROR(IF(AND($T18>=$R$24,$T18<=$R$25),(GETPIVOTDATA(\"Value\",Pivots!$A$6,\"Month\",$T18,\"Delay reason\",Y$16)),\"\"),0)","v":""},{"$f":"IFERROR(IF(AND($T18>=$R$24,$T18<=$R$25),(GETPIVOTDATA(\"Value\",Pivots!$A$6,\"Month\",$T18,\"Delay reason\",Z$16)),\"\"),0)","v":""},{"$f":"IFERROR(IF(AND($T18>=$R$24,$T18<=$R$25),(GETPIVOTDATA(\"Value\",Pivots!$A$6,\"Month\",$T18,\"Delay reason\",AA$16)),\"\"),0)","v":""},{"$f":"IFERROR(IF(AND($T18>=$R$24,$T18<=$R$25),(GETPIVOTDATA(\"Value\",Pivots!$A$6,\"Month\",$T18,\"Delay reason\",AB$16)),\"\"),0)","v":""},{"$f":"IFERROR(IF(AND($T18>=$R$24,$T18<=$R$25),(GETPIVOTDATA(\"Value\",Pivots!$A$6,\"Month\",$T18,\"Delay reason\",AC$16)),\"\"),0)","v":""},{"$f":"IFERROR(IF(AND($T18>=$R$24,$T18<=$R$25),(GETPIVOTDATA(\"Value\",Pivots!$A$6,\"Month\",$T18,\"Delay reason\",AD$16)),\"\"),0)","v":""},{"$f":"IFERROR(IF(AND($T18>=$R$24,$T18<=$R$25),(GETPIVOTDATA(\"Value\",Pivots!$A$6,\"Month\",$T18,\"Delay reason\",AE$16)),\"\"),0)","v":""},{"$f":"IFERROR(IF(AND($T18>=$R$24,$T18<=$R$25),(GETPIVOTDATA(\"Value\",Pivots!$A$6,\"Month\",$T18,\"Delay reason\",AF$16)),\"\"),0)","v":""},{"$f":"COUNT(V18:AF18)","v":0}]
[null,3,{"$f":"J33","v":"E) Awaiting care package in own home"},null,null,null,null,null,null,{"$f":"VLOOKUP(C19,ReferenceSheet!$B$2:$C$12,2,0)","v":6},null,null,null,null,null,null,null,null,3,"2018-04-01",{"$f":"$C$11","v":"(All)"},{"$f":"IFERROR(IF(AND($T19>=$R$24,$T19<=$R$25),(GETPIVOTDATA(\"Value\",Pivots!$A$6,\"Month\",$T19,\"Delay reason\",V$16)),\"\"),0)","v":""},{"$f":"IFERROR(IF(AND($T19>=$R$24,$T19<=$R$25),(GETPIVOTDATA(\"Value\",Pivots!$A$6,\"Month\",$T19,\"Delay reason\",W$16)),\"\"),0)","v":""},{"$f":"IFERROR(IF(AND($T19>=$R$24,$T19<=$R$25),(GETPIVOTDATA(\"Value\",Pivots!$A$6,\"Month\",$T19,\"Delay reason\",X$16)),\"\"),0)","v":""},{"$f":"IFERROR(IF(AND($T19>=$R$24,$T19<=$R$25),(GETPIVOTDATA(\"Value\",Pivots!$A$6,\"Month\",$T19,\"Delay reason\",Y$16)),\"\"),0)","v":""},{"$f":"IFERROR(IF(AND($T19>=$R$24,$T19<=$R$25),(GETPIVOTDATA(\"Value\",Pivots!$A$6,\"Month\",$T19,\"Delay reason\",Z$16)),\"\"),0)","v":""},{"$f":"IFERROR(IF(AND($T19>=$R$24,$T19<=$R$25),(GETPIVOTDATA(\"Value\",Pivots!$A$6,\"Month\",$T19,\"Delay reason\",AA$16)),\"\"),0)","v":""},{"$f":"IFERROR(IF(AND($T19>=$R$24,$T19<=$R$25),(GETPIVOTDATA(\"Value\",Pivots!$A$6,\"Month\",$T19,\"Delay reason\",AB$16)),\"\"),0)","v":""},{"$f":"IFERROR(IF(AND($T19>=$R$24,$T19<=$R$25),(GETPIVOTDATA(\"Value\",Pivots!$A$6,\"Month\",$T19,\"Delay reason\",AC$16)),\"\"),0)","v":""},{"$f":"IFERROR(IF(AND($T19>=$R$24,$T19<=$R$25),(GETPIVOTDATA(\"Value\",Pivots!$A$6,\"Month\",$T19,\"Delay reason\",AD$16)),\"\"),0)","v":""},{"$f":"IFERROR(IF(AND($T19>=$R$24,$T19<=$R$25),(GETPIVOTDATA(\"Value\",Pivots!$A$6,\"Month\",$T19,\"Delay reason\",AE$16)),\"\"),0)","v":""},{"$f":"IFERROR(IF(AND($T19>=$R$24,$T19<=$R$25),(GETPIVOTDATA(\"Value\",Pivots!$A$6,\"Month\",$T19,\"Delay reason\",AF$16)),\"\"),0)","v":""},0]
[null,4,{"$f":"J34","v":"C) Awaiting further non-acute NHS care (including intermediate care, rehabilitation services etc)"},null,null,null,null,null,null,{"$f":"VLOOKUP(C20,ReferenceSheet!$B$2:$C$12,2,0)","v":{"$error":"#N/A"}},null,null,null,null,null,null,"Offset end date",{"$f":"R17-1","v":19},4,"2018-05-01",{"$f":"$C$11","v":"(All)"},{"$f":"IFERROR(IF(AND($T20>=$R$24,$T20<=$R$25),(GETPIVOTDATA(\"Value\",Pivots!$A$6,\"Month\",$T20,\"Delay reason\",V$16)),\"\"),0)","v":""},{"$f":"IFERROR(IF(AND($T20>=$R$24,$T20<=$R$25),(GETPIVOTDATA(\"Value\",Pivots!$A$6,\"Month\",$T20,\"Delay reason\",W$16)),\"\"),0)","v":""},{"$f":"IFERROR(IF(AND($T20>=$R$24,$T20<=$R$25),(GETPIVOTDATA(\"Value\",Pivots!$A$6,\"Month\",$T20,\"Delay reason\",X$16)),\"\"),0)","v":""},{"$f":"IFERROR(IF(AND($T20>=$R$24,$T20<=$R$25),(GETPIVOTDATA(\"Value\",Pivots!$A$6,\"Month\",$T20,\"Delay reason\",Y$16)),\"\"),0)","v":""},{"$f":"IFERROR(IF(AND($T20>=$R$24,$T20<=$R$25),(GETPIVOTDATA(\"Value\",Pivots!$A$6,\"Month\",$T20,\"Delay reason\",Z$16)),\"\"),0)","v":""},{"$f":"IFERROR(IF(AND($T20>=$R$24,$T20<=$R$25),(GETPIVOTDATA(\"Value\",Pivots!$A$6,\"Month\",$T20,\"Delay reason\",AA$16)),\"\"),0)","v":""},{"$f":"IFERROR(IF(AND($T20>=$R$24,$T20<=$R$25),(GETPIVOTDATA(\"Value\",Pivots!$A$6,\"Month\",$T20,\"Delay reason\",AB$16)),\"\"),0)","v":""},{"$f":"IFERROR(IF(AND($T20>=$R$24,$T20<=$R$25),(GETPIVOTDATA(\"Value\",Pivots!$A$6,\"Month\",$T20,\"Delay reason\",AC$16)),\"\"),0)","v":""},{"$f":"IFERROR(IF(AND($T20>=$R$24,$T20<=$R$25),(GETPIVOTDATA(\"Value\",Pivots!$A$6,\"Month\",$T20,\"Delay reason\",AD$16)),\"\"),0)","v":""},{"$f":"IFERROR(IF(AND($T20>=$R$24,$T20<=$R$25),(GETPIVOTDATA(\"Value\",Pivots!$A$6,\"Month\",$T20,\"Delay reason\",AE$16)),\"\"),0)","v":""},{"$f":"IFERROR(IF(AND($T20>=$R$24,$T20<=$R$25),(GETPIVOTDATA(\"Value\",Pivots!$A$6,\"Month\",$T20,\"Delay reason\",AF$16)),\"\"),0)","v":""},0]
[null,5,{"$f":"J35","v":"Dii) Awaiting nursing home placement or availability"},null,null,null,null,null,null,{"$f":"VLOOKUP(C21,ReferenceSheet!$B$2:$C$12,2,0)","v":5},null,null,null,null,null,null,"Count",26,5,"2018-06-01",{"$f":"$C$11","v":"(All)"},{"$f":"IFERROR(IF(AND($T21>=$R$24,$T21<=$R$25),(GETPIVOTDATA(\"Value\",Pivots!$A$6,\"Month\",$T21,\"Delay reason\",V$16)),\"\"),0)","v":""},{"$f":"IFERROR(IF(AND($T21>=$R$24,$T21<=$R$25),(GETPIVOTDATA(\"Value\",Pivots!$A$6,\"Month\",$T21,\"Delay reason\",W$16)),\"\"),0)","v":""},{"$f":"IFERROR(IF(AND($T21>=$R$24,$T21<=$R$25),(GETPIVOTDATA(\"Value\",Pivots!$A$6,\"Month\",$T21,\"Delay reason\",X$16)),\"\"),0)","v":""},{"$f":"IFERROR(IF(AND($T21>=$R$24,$T21<=$R$25),(GETPIVOTDATA(\"Value\",Pivots!$A$6,\"Month\",$T21,\"Delay reason\",Y$16)),\"\"),0)","v":""},{"$f":"IFERROR(IF(AND($T21>=$R$24,$T21<=$R$25),(GETPIVOTDATA(\"Value\",Pivots!$A$6,\"Month\",$T21,\"Delay reason\",Z$16)),\"\"),0)","v":""},{"$f":"IFERROR(IF(AND($T21>=$R$24,$T21<=$R$25),(GETPIVOTDATA(\"Value\",Pivots!$A$6,\"Month\",$T21,\"Delay reason\",AA$16)),\"\"),0)","v":""},{"$f":"IFERROR(IF(AND($T21>=$R$24,$T21<=$R$25),(GETPIVOTDATA(\"Value\",Pivots!$A$6,\"Month\",$T21,\"Delay reason\",AB$16)),\"\"),0)","v":""},{"$f":"IFERROR(IF(AND($T21>=$R$24,$T21<=$R$25),(GETPIVOTDATA(\"Value\",Pivots!$A$6,\"Month\",$T21,\"Delay reason\",AC$16)),\"\"),0)","v":""},{"$f":"IFERROR(IF(AND($T21>=$R$24,$T21<=$R$25),(GETPIVOTDATA(\"Value\",Pivots!$A$6,\"Month\",$T21,\"Delay reason\",AD$16)),\"\"),0)","v":""},{"$f":"IFERROR(IF(AND($T21>=$R$24,$T21<=$R$25),(GETPIVOTDATA(\"Value\",Pivots!$A$6,\"Month\",$T21,\"Delay reason\",AE$16)),\"\"),0)","v":""},{"$f":"IFERROR(IF(AND($T21>=$R$24,$T21<=$R$25),(GETPIVOTDATA(\"Value\",Pivots!$A$6,\"Month\",$T21,\"Delay reason\",AF$16)),\"\"),0)","v":""},0]
[null,6,{"$f":"J36","v":"A) Awaiting completion of assessment"},null,null,null,null,null,null,{"$f":"VLOOKUP(C22,ReferenceSheet!$B$2:$C$12,2,0)","v":1},null,null,null,null,null,null,"Height",{"$f":"R21-R17","v":6},6,"2018-07-01","(All)",{"$f":"IFERROR(IF(AND($T22>=$R$24,$T22<=$R$25),(GETPIVOTDATA(\"Value\",Pivots!$A$6,\"Month\",$T22,\"Delay reason\",V$16)),\"\"),0)","v":""},{"$f":"IFERROR(IF(AND($T22>=$R$24,$T22<=$R$25),(GETPIVOTDATA(\"Value\",Pivots!$A$6,\"Month\",$T22,\"Delay reason\",W$16)),\"\"),0)","v":""},{"$f":"IFERROR(IF(AND($T22>=$R$24,$T22<=$R$25),(GETPIVOTDATA(\"Value\",Pivots!$A$6,\"Month\",$T22,\"Delay reason\",X$16)),\"\"),0)","v":""},{"$f":"IFERROR(IF(AND($T22>=$R$24,$T22<=$R$25),(GETPIVOTDATA(\"Value\",Pivots!$A$6,\"Month\",$T22,\"Delay reason\",Y$16)),\"\"),0)","v":""},{"$f":"IFERROR(IF(AND($T22>=$R$24,$T22<=$R$25),(GETPIVOTDATA(\"Value\",Pivots!$A$6,\"Month\",$T22,\"Delay reason\",Z$16)),\"\"),0)","v":""},{"$f":"IFERROR(IF(AND($T22>=$R$24,$T22<=$R$25),(GETPIVOTDATA(\"Value\",Pivots!$A$6,\"Month\",$T22,\"Delay reason\",AA$16)),\"\"),0)","v":""},{"$f":"IFERROR(IF(AND($T22>=$R$24,$T22<=$R$25),(GETPIVOTDATA(\"Value\",Pivots!$A$6,\"Month\",$T22,\"Delay reason\",AB$16)),\"\"),0)","v":""},{"$f":"IFERROR(IF(AND($T22>=$R$24,$T22<=$R$25),(GETPIVOTDATA(\"Value\",Pivots!$A$6,\"Month\",$T22,\"Delay reason\",AC$16)),\"\"),0)","v":""},{"$f":"IFERROR(IF(AND($T22>=$R$24,$T22<=$R$25),(GETPIVOTDATA(\"Value\",Pivots!$A$6,\"Month\",$T22,\"Delay reason\",AD$16)),\"\"),0)","v":""},{"$f":"IFERROR(IF(AND($T22>=$R$24,$T22<=$R$25),(GETPIVOTDATA(\"Value\",Pivots!$A$6,\"Month\",$T22,\"Delay reason\",AE$16)),\"\"),0)","v":""},{"$f":"IFERROR(IF(AND($T22>=$R$24,$T22<=$R$25),(GETPIVOTDATA(\"Value\",Pivots!$A$6,\"Month\",$T22,\"Delay reason\",AF$16)),\"\"),0)","v":""},0]
[null,7,{"$f":"HLOOKUP(J23,V15:AF42,2,0)","v":"E) Awaiting care package in own home"},null,null,null,null,null,null,6,null,null,null,null,null,null,null,null,7,"2018-08-01","(All)",{"$f":"IFERROR(IF(AND($T23>=$R$24,$T23<=$R$25),(GETPIVOTDATA(\"Value\",Pivots!$A$6,\"Month\",$T23,\"Delay reason\",V$16)),\"\"),0)","v":""},{"$f":"IFERROR(IF(AND($T23>=$R$24,$T23<=$R$25),(GETPIVOTDATA(\"Value\",Pivots!$A$6,\"Month\",$T23,\"Delay reason\",W$16)),\"\"),0)","v":""},{"$f":"IFERROR(IF(AND($T23>=$R$24,$T23<=$R$25),(GETPIVOTDATA(\"Value\",Pivots!$A$6,\"Month\",$T23,\"Delay reason\",X$16)),\"\"),0)","v":""},{"$f":"IFERROR(IF(AND($T23>=$R$24,$T23<=$R$25),(GETPIVOTDATA(\"Value\",Pivots!$A$6,\"Month\",$T23,\"Delay reason\",Y$16)),\"\"),0)","v":""},{"$f":"IFERROR(IF(AND($T23>=$R$24,$T23<=$R$25),(GETPIVOTDATA(\"Value\",Pivots!$A$6,\"Month\",$T23,\"Delay reason\",Z$16)),\"\"),0)","v":""},{"$f":"IFERROR(IF(AND($T23>=$R$24,$T23<=$R$25),(GETPIVOTDATA(\"Value\",Pivots!$A$6,\"Month\",$T23,\"Delay reason\",AA$16)),\"\"),0)","v":""},{"$f":"IFERROR(IF(AND($T23>=$R$24,$T23<=$R$25),(GETPIVOTDATA(\"Value\",Pivots!$A$6,\"Month\",$T23,\"Delay reason\",AB$16)),\"\"),0)","v":""},{"$f":"IFERROR(IF(AND($T23>=$R$24,$T23<=$R$25),(GETPIVOTDATA(\"Value\",Pivots!$A$6,\"Month\",$T23,\"Delay reason\",AC$16)),\"\"),0)","v":""},{"$f":"IFERROR(IF(AND($T23>=$R$24,$T23<=$R$25),(GETPIVOTDATA(\"Value\",Pivots!$A$6,\"Month\",$T23,\"Delay reason\",AD$16)),\"\"),0)","v":""},{"$f":"IFERROR(IF(AND($T23>=$R$24,$T23<=$R$25),(GETPIVOTDATA(\"Value\",Pivots!$A$6,\"Month\",$T23,\"Delay reason\",AE$16)),\"\"),0)","v":""},{"$f":"IFERROR(IF(AND($T23>=$R$24,$T23<=$R$25),(GETPIVOTDATA(\"Value\",Pivots!$A$6,\"Month\",$T23,\"Delay reason\",AF$16)),\"\"),0)","v":""},0]
[null,null,null,null,null,null,null,null,null,null,null,null,null,null,null,{"$f":"R17","v":20},"Start date",{"$f":"VLOOKUP(P24,S17:T41,2,0)","v":"2019-09-01"},8,"2018-09-01","(All)",{"$f":"IFERROR(IF(AND($T24>=$R$24,$T24<=$R$25),(GETPIVOTDATA(\"Value\",Pivots!$A$6,\"Month\",$T24,\"Delay reason\",V$16)),\"\"),0)","v":""},{"$f":"IFERROR(IF(AND($T24>=$R$24,$T24<=$R$25),(GETPIVOTDATA(\"Value\",Pivots!$A$6,\"Month\",$T24,\"Delay reason\",W$16)),\"\"),0)","v":""},{"$f":"IFERROR(IF(AND($T24>=$R$24,$T24<=$R$25),(GETPIVOTDATA(\"Value\",Pivots!$A$6,\"Month\",$T24,\"Delay reason\",X$16)),\"\"),0)","v":""},{"$f":"IFERROR(IF(AND($T24>=$R$24,$T24<=$R$25),(GETPIVOTDATA(\"Value\",Pivots!$A$6,\"Month\",$T24,\"Delay reason\",Y$16)),\"\"),0)","v":""},{"$f":"IFERROR(IF(AND($T24>=$R$24,$T24<=$R$25),(GETPIVOTDATA(\"Value\",Pivots!$A$6,\"Month\",$T24,\"Delay reason\",Z$16)),\"\"),0)","v":""},{"$f":"IFERROR(IF(AND($T24>=$R$24,$T24<=$R$25),(GETPIVOTDATA(\"Value\",Pivots!$A$6,\"Month\",$T24,\"Delay reason\",AA$16)),\"\"),0)","v":""},{"$f":"IFERROR(IF(AND($T24>=$R$24,$T24<=$R$25),(GETPIVOTDATA(\"Value\",Pivots!$A$6,\"Month\",$T24,\"Delay reason\",AB$16)),\"\"),0)","v":""},{"$f":"IFERROR(IF(AND($T24>=$R$24,$T24<=$R$25),(GETPIVOTDATA(\"Value\",Pivots!$A$6,\"Month\",$T24,\"Delay reason\",AC$16)),\"\"),0)","v":""},{"$f":"IFERROR(IF(AND($T24>=$R$24,$T24<=$R$25),(GETPIVOTDATA(\"Value\",Pivots!$A$6,\"Month\",$T24,\"Delay reason\",AD$16)),\"\"),0)","v":""},{"$f":"IFERROR(IF(AND($T24>=$R$24,$T24<=$R$25),(GETPIVOTDATA(\"Value\",Pivots!$A$6,\"Month\",$T24,\"Delay reason\",AE$16)),\"\"),0)","v":""},{"$f":"IFERROR(IF(AND($T24>=$R$24,$T24<=$R$25),(GETPIVOTDATA(\"Value\",Pivots!$A$6,\"Month\",$T24,\"Delay reason\",AF$16)),\"\"),0)","v":""},0]
[null,null,"Reasons 6 month summary pareto chart",null,null,null,null,null,null,null,null,null,null,null,null,{"$f":"IF((R18+R20)>25,25,(R18+R20))","v":25},"End date",{"$f":"VLOOKUP(P25,S17:T41,2,0)","v":"2020-02-01"},9,"2018-10-01","(All)",{"$f":"IFERROR(IF(AND($T25>=$R$24,$T25<=$R$25),(GETPIVOTDATA(\"Value\",Pivots!$A$6,\"Month\",$T25,\"Delay reason\",V$16)),\"\"),0)","v":""},{"$f":"IFERROR(IF(AND($T25>=$R$24,$T25<=$R$25),(GETPIVOTDATA(\"Value\",Pivots!$A$6,\"Month\",$T25,\"Delay reason\",W$16)),\"\"),0)","v":""},{"$f":"IFERROR(IF(AND($T25>=$R$24,$T25<=$R$25),(GETPIVOTDATA(\"Value\",Pivots!$A$6,\"Month\",$T25,\"Delay reason\",X$16)),\"\"),0)","v":""},{"$f":"IFERROR(IF(AND($T25>=$R$24,$T25<=$R$25),(GETPIVOTDATA(\"Value\",Pivots!$A$6,\"Month\",$T25,\"Delay reason\",Y$16)),\"\"),0)","v":""},{"$f":"IFERROR(IF(AND($T25>=$R$24,$T25<=$R$25),(GETPIVOTDATA(\"Value\",Pivots!$A$6,\"Month\",$T25,\"Delay reason\",Z$16)),\"\"),0)","v":""},{"$f":"IFERROR(IF(AND($T25>=$R$24,$T25<=$R$25),(GETPIVOTDATA(\"Value\",Pivots!$A$6,\"Month\",$T25,\"Delay reason\",AA$16)),\"\"),0)","v":""},{"$f":"IFERROR(IF(AND($T25>=$R$24,$T25<=$R$25),(GETPIVOTDATA(\"Value\",Pivots!$A$6,\"Month\",$T25,\"Delay reason\",AB$16)),\"\"),0)","v":""},{"$f":"IFERROR(IF(AND($T25>=$R$24,$T25<=$R$25),(GETPIVOTDATA(\"Value\",Pivots!$A$6,\"Month\",$T25,\"Delay reason\",AC$16)),\"\"),0)","v":""},{"$f":"IFERROR(IF(AND($T25>=$R$24,$T25<=$R$25),(GETPIVOTDATA(\"Value\",Pivots!$A$6,\"Month\",$T25,\"Delay reason\",AD$16)),\"\"),0)","v":""},{"$f":"IFERROR(IF(AND($T25>=$R$24,$T25<=$R$25),(GETPIVOTDATA(\"Value\",Pivots!$A$6,\"Month\",$T25,\"Delay reason\",AE$16)),\"\"),0)","v":""},{"$f":"IFERROR(IF(AND($T25>=$R$24,$T25<=$R$25),(GETPIVOTDATA(\"Value\",Pivots!$A$6,\"Month\",$T25,\"Delay reason\",AF$16)),\"\"),0)","v":""},0]
[null,null,null,null,null,null,null,null,null,null,null,null,null,null,null,null,null,null,10,"2018-11-01","(All)",{"$f":"IFERROR(IF(AND($T26>=$R$24,$T26<=$R$25),(GETPIVOTDATA(\"Value\",Pivots!$A$6,\"Month\",$T26,\"Delay reason\",V$16)),\"\"),0)","v":""},{"$f":"IFERROR(IF(AND($T26>=$R$24,$T26<=$R$25),(GETPIVOTDATA(\"Value\",Pivots!$A$6,\"Month\",$T26,\"Delay reason\",W$16)),\"\"),0)","v":""},{"$f":"IFERROR(IF(AND($T26>=$R$24,$T26<=$R$25),(GETPIVOTDATA(\"Value\",Pivots!$A$6,\"Month\",$T26,\"Delay reason\",X$16)),\"\"),0)","v":""},{"$f":"IFERROR(IF(AND($T26>=$R$24,$T26<=$R$25),(GETPIVOTDATA(\"Value\",Pivots!$A$6,\"Month\",$T26,\"Delay reason\",Y$16)),\"\"),0)","v":""},{"$f":"IFERROR(IF(AND($T26>=$R$24,$T26<=$R$25),(GETPIVOTDATA(\"Value\",Pivots!$A$6,\"Month\",$T26,\"Delay reason\",Z$16)),\"\"),0)","v":""},{"$f":"IFERROR(IF(AND($T26>=$R$24,$T26<=$R$25),(GETPIVOTDATA(\"Value\",Pivots!$A$6,\"Month\",$T26,\"Delay reason\",AA$16)),\"\"),0)","v":""},{"$f":"IFERROR(IF(AND($T26>=$R$24,$T26<=$R$25),(GETPIVOTDATA(\"Value\",Pivots!$A$6,\"Month\",$T26,\"Delay reason\",AB$16)),\"\"),0)","v":""},{"$f":"IFERROR(IF(AND($T26>=$R$24,$T26<=$R$25),(GETPIVOTDATA(\"Value\",Pivots!$A$6,\"Month\",$T26,\"Delay reason\",AC$16)),\"\"),0)","v":""},{"$f":"IFERROR(IF(AND($T26>=$R$24,$T26<=$R$25),(GETPIVOTDATA(\"Value\",Pivots!$A$6,\"Month\",$T26,\"Delay reason\",AD$16)),\"\"),0)","v":""},{"$f":"IFERROR(IF(AND($T26>=$R$24,$T26<=$R$25),(GETPIVOTDATA(\"Value\",Pivots!$A$6,\"Month\",$T26,\"Delay reason\",AE$16)),\"\"),0)","v":""},{"$f":"IFERROR(IF(AND($T26>=$R$24,$T26<=$R$25),(GETPIVOTDATA(\"Value\",Pivots!$A$6,\"Month\",$T26,\"Delay reason\",AF$16)),\"\"),0)","v":""},0]
[null,null,null,null,null,null,null,null,null,null,null,null,null,null,null,null,null,null,11,"2018-12-01","(All)",{"$f":"IFERROR(IF(AND($T27>=$R$24,$T27<=$R$25),(GETPIVOTDATA(\"Value\",Pivots!$A$6,\"Month\",$T27,\"Delay reason\",V$16)),\"\"),0)","v":""},{"$f":"IFERROR(IF(AND($T27>=$R$24,$T27<=$R$25),(GETPIVOTDATA(\"Value\",Pivots!$A$6,\"Month\",$T27,\"Delay reason\",W$16)),\"\"),0)","v":""},{"$f":"IFERROR(IF(AND($T27>=$R$24,$T27<=$R$25),(GETPIVOTDATA(\"Value\",Pivots!$A$6,\"Month\",$T27,\"Delay reason\",X$16)),\"\"),0)","v":""},{"$f":"IFERROR(IF(AND($T27>=$R$24,$T27<=$R$25),(GETPIVOTDATA(\"Value\",Pivots!$A$6,\"Month\",$T27,\"Delay reason\",Y$16)),\"\"),0)","v":""},{"$f":"IFERROR(IF(AND($T27>=$R$24,$T27<=$R$25),(GETPIVOTDATA(\"Value\",Pivots!$A$6,\"Month\",$T27,\"Delay reason\",Z$16)),\"\"),0)","v":""},{"$f":"IFERROR(IF(AND($T27>=$R$24,$T27<=$R$25),(GETPIVOTDATA(\"Value\",Pivots!$A$6,\"Month\",$T27,\"Delay reason\",AA$16)),\"\"),0)","v":""},{"$f":"IFERROR(IF(AND($T27>=$R$24,$T27<=$R$25),(GETPIVOTDATA(\"Value\",Pivots!$A$6,\"Month\",$T27,\"Delay reason\",AB$16)),\"\"),0)","v":""},{"$f":"IFERROR(IF(AND($T27>=$R$24,$T27<=$R$25),(GETPIVOTDATA(\"Value\",Pivots!$A$6,\"Month\",$T27,\"Delay reason\",AC$16)),\"\"),0)","v":""},{"$f":"IFERROR(IF(AND($T27>=$R$24,$T27<=$R$25),(GETPIVOTDATA(\"Value\",Pivots!$A$6,\"Month\",$T27,\"Delay reason\",AD$16)),\"\"),0)","v":""},{"$f":"IFERROR(IF(AND($T27>=$R$24,$T27<=$R$25),(GETPIVOTDATA(\"Value\",Pivots!$A$6,\"Month\",$T27,\"Delay reason\",AE$16)),\"\"),0)","v":""},{"$f":"IFERROR(IF(AND($T27>=$R$24,$T27<=$R$25),(GETPIVOTDATA(\"Value\",Pivots!$A$6,\"Month\",$T27,\"Delay reason\",AF$16)),\"\"),0)","v":""},0]
[null,null,null,null,null,null,null,null,null,null,null,null,null,null,null,null,null,null,12,"2019-01-01","(All)",{"$f":"IFERROR(IF(AND($T28>=$R$24,$T28<=$R$25),(GETPIVOTDATA(\"Value\",Pivots!$A$6,\"Month\",$T28,\"Delay reason\",V$16)),\"\"),0)","v":""},{"$f":"IFERROR(IF(AND($T28>=$R$24,$T28<=$R$25),(GETPIVOTDATA(\"Value\",Pivots!$A$6,\"Month\",$T28,\"Delay reason\",W$16)),\"\"),0)","v":""},{"$f":"IFERROR(IF(AND($T28>=$R$24,$T28<=$R$25),(GETPIVOTDATA(\"Value\",Pivots!$A$6,\"Month\",$T28,\"Delay reason\",X$16)),\"\"),0)","v":""},{"$f":"IFERROR(IF(AND($T28>=$R$24,$T28<=$R$25),(GETPIVOTDATA(\"Value\",Pivots!$A$6,\"Month\",$T28,\"Delay reason\",Y$16)),\"\"),0)","v":""},{"$f":"IFERROR(IF(AND($T28>=$R$24,$T28<=$R$25),(GETPIVOTDATA(\"Value\",Pivots!$A$6,\"Month\",$T28,\"Delay reason\",Z$16)),\"\"),0)","v":""},{"$f":"IFERROR(IF(AND($T28>=$R$24,$T28<=$R$25),(GETPIVOTDATA(\"Value\",Pivots!$A$6,\"Month\",$T28,\"Delay reason\",AA$16)),\"\"),0)","v":""},{"$f":"IFERROR(IF(AND($T28>=$R$24,$T28<=$R$25),(GETPIVOTDATA(\"Value\",Pivots!$A$6,\"Month\",$T28,\"Delay reason\",AB$16)),\"\"),0)","v":""},{"$f":"IFERROR(IF(AND($T28>=$R$24,$T28<=$R$25),(GETPIVOTDATA(\"Value\",Pivots!$A$6,\"Month\",$T28,\"Delay reason\",AC$16)),\"\"),0)","v":""},{"$f":"IFERROR(IF(AND($T28>=$R$24,$T28<=$R$25),(GETPIVOTDATA(\"Value\",Pivots!$A$6,\"Month\",$T28,\"Delay reason\",AD$16)),\"\"),0)","v":""},{"$f":"IFERROR(IF(AND($T28>=$R$24,$T28<=$R$25),(GETPIVOTDATA(\"Value\",Pivots!$A$6,\"Month\",$T28,\"Delay reason\",AE$16)),\"\"),0)","v":""},{"$f":"IFERROR(IF(AND($T28>=$R$24,$T28<=$R$25),(GETPIVOTDATA(\"Value\",Pivots!$A$6,\"Month\",$T28,\"Delay reason\",AF$16)),\"\"),0)","v":""},0]
[null,null,null,null,null,null,null,null,null,null,null,null,null,null,null,null,null,null,13,"2019-02-01","(All)",{"$f":"IFERROR(IF(AND($T29>=$R$24,$T29<=$R$25),(GETPIVOTDATA(\"Value\",Pivots!$A$6,\"Month\",$T29,\"Delay reason\",V$16)),\"\"),0)","v":""},{"$f":"IFERROR(IF(AND($T29>=$R$24,$T29<=$R$25),(GETPIVOTDATA(\"Value\",Pivots!$A$6,\"Month\",$T29,\"Delay reason\",W$16)),\"\"),0)","v":""},{"$f":"IFERROR(IF(AND($T29>=$R$24,$T29<=$R$25),(GETPIVOTDATA(\"Value\",Pivots!$A$6,\"Month\",$T29,\"Delay reason\",X$16)),\"\"),0)","v":""},{"$f":"IFERROR(IF(AND($T29>=$R$24,$T29<=$R$25),(GETPIVOTDATA(\"Value\",Pivots!$A$6,\"Month\",$T29,\"Delay reason\",Y$16)),\"\"),0)","v":""},{"$f":"IFERROR(IF(AND($T29>=$R$24,$T29<=$R$25),(GETPIVOTDATA(\"Value\",Pivots!$A$6,\"Month\",$T29,\"Delay reason\",Z$16)),\"\"),0)","v":""},{"$f":"IFERROR(IF(AND($T29>=$R$24,$T29<=$R$25),(GETPIVOTDATA(\"Value\",Pivots!$A$6,\"Month\",$T29,\"Delay reason\",AA$16)),\"\"),0)","v":""},{"$f":"IFERROR(IF(AND($T29>=$R$24,$T29<=$R$25),(GETPIVOTDATA(\"Value\",Pivots!$A$6,\"Month\",$T29,\"Delay reason\",AB$16)),\"\"),0)","v":""},{"$f":"IFERROR(IF(AND($T29>=$R$24,$T29<=$R$25),(GETPIVOTDATA(\"Value\",Pivots!$A$6,\"Month\",$T29,\"Delay reason\",AC$16)),\"\"),0)","v":""},{"$f":"IFERROR(IF(AND($T29>=$R$24,$T29<=$R$25),(GETPIVOTDATA(\"Value\",Pivots!$A$6,\"Month\",$T29,\"Delay reason\",AD$16)),\"\"),0)","v":""},{"$f":"IFERROR(IF(AND($T29>=$R$24,$T29<=$R$25),(GETPIVOTDATA(\"Value\",Pivots!$A$6,\"Month\",$T29,\"Delay reason\",AE$16)),\"\"),0)","v":""},{"$f":"IFERROR(IF(AND($T29>=$R$24,$T29<=$R$25),(GETPIVOTDATA(\"Value\",Pivots!$A$6,\"Month\",$T29,\"Delay reason\",AF$16)),\"\"),0)","v":""},0]
[null,{"$f":"C17","v":"(All) Delayed Reasons"},null,null,null,null,null,null,null,null,null,null,null,null,null,null,null,null,14,"2019-03-01","(All)",{"$f":"IFERROR(IF(AND($T30>=$R$24,$T30<=$R$25),(GETPIVOTDATA(\"Value\",Pivots!$A$6,\"Month\",$T30,\"Delay reason\",V$16)),\"\"),0)","v":""},{"$f":"IFERROR(IF(AND($T30>=$R$24,$T30<=$R$25),(GETPIVOTDATA(\"Value\",Pivots!$A$6,\"Month\",$T30,\"Delay reason\",W$16)),\"\"),0)","v":""},{"$f":"IFERROR(IF(AND($T30>=$R$24,$T30<=$R$25),(GETPIVOTDATA(\"Value\",Pivots!$A$6,\"Month\",$T30,\"Delay reason\",X$16)),\"\"),0)","v":""},{"$f":"IFERROR(IF(AND($T30>=$R$24,$T30<=$R$25),(GETPIVOTDATA(\"Value\",Pivots!$A$6,\"Month\",$T30,\"Delay reason\",Y$16)),\"\"),0)","v":""},{"$f":"IFERROR(IF(AND($T30>=$R$24,$T30<=$R$25),(GETPIVOTDATA(\"Value\",Pivots!$A$6,\"Month\",$T30,\"Delay reason\",Z$16)),\"\"),0)","v":""},{"$f":"IFERROR(IF(AND($T30>=$R$24,$T30<=$R$25),(GETPIVOTDATA(\"Value\",Pivots!$A$6,\"Month\",$T30,\"Delay reason\",AA$16)),\"\"),0)","v":""},{"$f":"IFERROR(IF(AND($T30>=$R$24,$T30<=$R$25),(GETPIVOTDATA(\"Value\",Pivots!$A$6,\"Month\",$T30,\"Delay reason\",AB$16)),\"\"),0)","v":""},{"$f":"IFERROR(IF(AND($T30>=$R$24,$T30<=$R$25),(GETPIVOTDATA(\"Value\",Pivots!$A$6,\"Month\",$T30,\"Delay reason\",AC$16)),\"\"),0)","v":""},{"$f":"IFERROR(IF(AND($T30>=$R$24,$T30<=$R$25),(GETPIVOTDATA(\"Value\",Pivots!$A$6,\"Month\",$T30,\"Delay reason\",AD$16)),\"\"),0)","v":""},{"$f":"IFERROR(IF(AND($T30>=$R$24,$T30<=$R$25),(GETPIVOTDATA(\"Value\",Pivots!$A$6,\"Month\",$T30,\"Delay reason\",AE$16)),\"\"),0)","v":""},{"$f":"IFERROR(IF(AND($T30>=$R$24,$T30<=$R$25),(GETPIVOTDATA(\"Value\",Pivots!$A$6,\"Month\",$T30,\"Delay reason\",AF$16)),\"\"),0)","v":""},0]
[null,1,{"$f":"ROW()","v":31},null,null,"Table to rank data",null,null,null,null,null,null,null,null,null,null,"Chart set up",null,15,"2019-04-01","(All)",{"$f":"IFERROR(IF(AND($T31>=$R$24,$T31<=$R$25),(GETPIVOTDATA(\"Value\",Pivots!$A$6,\"Month\",$T31,\"Delay reason\",V$16)),\"\"),0)","v":""},{"$f":"IFERROR(IF(AND($T31>=$R$24,$T31<=$R$25),(GETPIVOTDATA(\"Value\",Pivots!$A$6,\"Month\",$T31,\"Delay reason\",W$16)),\"\"),0)","v":""},{"$f":"IFERROR(IF(AND($T31>=$R$24,$T31<=$R$25),(GETPIVOTDATA(\"Value\",Pivots!$A$6,\"Month\",$T31,\"Delay reason\",X$16)),\"\"),0)","v":""},{"$f":"IFERROR(IF(AND($T31>=$R$24,$T31<=$R$25),(GETPIVOTDATA(\"Value\",Pivots!$A$6,\"Month\",$T31,\"Delay reason\",Y$16)),\"\"),0)","v":""},{"$f":"IFERROR(IF(AND($T31>=$R$24,$T31<=$R$25),(GETPIVOTDATA(\"Value\",Pivots!$A$6,\"Month\",$T31,\"Delay reason\",Z$16)),\"\"),0)","v":""},{"$f":"IFERROR(IF(AND($T31>=$R$24,$T31<=$R$25),(GETPIVOTDATA(\"Value\",Pivots!$A$6,\"Month\",$T31,\"Delay reason\",AA$16)),\"\"),0)","v":""},{"$f":"IFERROR(IF(AND($T31>=$R$24,$T31<=$R$25),(GETPIVOTDATA(\"Value\",Pivots!$A$6,\"Month\",$T31,\"Delay reason\",AB$16)),\"\"),0)","v":""},{"$f":"IFERROR(IF(AND($T31>=$R$24,$T31<=$R$25),(GETPIVOTDATA(\"Value\",Pivots!$A$6,\"Month\",$T31,\"Delay reason\",AC$16)),\"\"),0)","v":""},{"$f":"IFERROR(IF(AND($T31>=$R$24,$T31<=$R$25),(GETPIVOTDATA(\"Value\",Pivots!$A$6,\"Month\",$T31,\"Delay reason\",AD$16)),\"\"),0)","v":""},{"$f":"IFERROR(IF(AND($T31>=$R$24,$T31<=$R$25),(GETPIVOTDATA(\"Value\",Pivots!$A$6,\"Month\",$T31,\"Delay reason\",AE$16)),\"\"),0)","v":""},{"$f":"IFERROR(IF(AND($T31>=$R$24,$T31<=$R$25),(GETPIVOTDATA(\"Value\",Pivots!$A$6,\"Month\",$T31,\"Delay reason\",AF$16)),\"\"),0)","v":""},0]
[null,"Month",null,null,null,"Summed days by action","equal rank","Adjusted score","Final Rank","Ranked Actions","ranked delay",null,null,"Cuml total","Culm %",null,null,null,16,"2019-05-01","(All)",{"$f":"IFERROR(IF(AND($T32>=$R$24,$T32<=$R$25),(GETPIVOTDATA(\"Value\",Pivots!$A$6,\"Month\",$T32,\"Delay reason\",V$16)),\"\"),0)","v":""},{"$f":"IFERROR(IF(AND($T32>=$R$24,$T32<=$R$25),(GETPIVOTDATA(\"Value\",Pivots!$A$6,\"Month\",$T32,\"Delay reason\",W$16)),\"\"),0)","v":""},{"$f":"IFERROR(IF(AND($T32>=$R$24,$T32<=$R$25),(GETPIVOTDATA(\"Value\",Pivots!$A$6,\"Month\",$T32,\"Delay reason\",X$16)),\"\"),0)","v":""},{"$f":"IFERROR(IF(AND($T32>=$R$24,$T32<=$R$25),(GETPIVOTDATA(\"Value\",Pivots!$A$6,\"Month\",$T32,\"Delay reason\",Y$16)),\"\"),0)","v":""},{"$f":"IFERROR(IF(AND($T32>=$R$24,$T32<=$R$25),(GETPIVOTDATA(\"Value\",Pivots!$A$6,\"Month\",$T32,\"Delay reason\",Z$16)),\"\"),0)","v":""},{"$f":"IFERROR(IF(AND($T32>=$R$24,$T32<=$R$25),(GETPIVOTDATA(\"Value\",Pivots!$A$6,\"Month\",$T32,\"Delay reason\",AA$16)),\"\"),0)","v":""},{"$f":"IFERROR(IF(AND($T32>=$R$24,$T32<=$R$25),(GETPIVOTDATA(\"Value\",Pivots!$A$6,\"Month\",$T32,\"Delay reason\",AB$16)),\"\"),0)","v":""},{"$f":"IFERROR(IF(AND($T32>=$R$24,$T32<=$R$25),(GETPIVOTDATA(\"Value\",Pivots!$A$6,\"Month\",$T32,\"Delay reason\",AC$16)),\"\"),0)","v":""},{"$f":"IFERROR(IF(AND($T32>=$R$24,$T32<=$R$25),(GETPIVOTDATA(\"Value\",Pivots!$A$6,\"Month\",$T32,\"Delay reason\",AD$16)),\"\"),0)","v":""},{"$f":"IFERROR(IF(AND($T32>=$R$24,$T32<=$R$25),(GETPIVOTDATA(\"Value\",Pivots!$A$6,\"Month\",$T32,\"Delay reason\",AE$16)),\"\"),0)","v":""},{"$f":"IFERROR(IF(AND($T32>=$R$24,$T32<=$R$25),(GETPIVOTDATA(\"Value\",Pivots!$A$6,\"Month\",$T32,\"Delay reason\",AF$16)),\"\"),0)","v":""},0]
[null,1,"A) Awaiting completion of assessment",{"$f":"HLOOKUP(C33,$V$16:$AF$42,27,0)","v":115600},null,1,{"$f":"COUNTIF($D$33:$D$43,$D33)","v":1},{"$f":"IF(G33>1,D33+ROW()*0.001,D33)","v":115600},{"$f":"RANK(H33,H$33:H$43)","v":4},{"$f":"INDEX($C$33:$C$43,MATCH($F33,$I$33:$I$43,0))","v":"E) Awaiting care package in own home"},{"$f":"INDEX($D$33:$D$43,MATCH($F33,$I$33:$I$43,0))","v":192356},null,null,{"$f":"K33","v":192356},{"$f":"N33/$N$43","v":0.21086187032536502},null,"Maximum",{"$f":"MAX(D33:D43)","v":192356},17,"2019-06-01","(All)",{"$f":"IFERROR(IF(AND($T33>=$R$24,$T33<=$R$25),(GETPIVOTDATA(\"Value\",Pivots!$A$6,\"Month\",$T33,\"Delay reason\",V$16)),\"\"),0)","v":""},{"$f":"IFERROR(IF(AND($T33>=$R$24,$T33<=$R$25),(GETPIVOTDATA(\"Value\",Pivots!$A$6,\"Month\",$T33,\"Delay reason\",W$16)),\"\"),0)","v":""},{"$f":"IFERROR(IF(AND($T33>=$R$24,$T33<=$R$25),(GETPIVOTDATA(\"Value\",Pivots!$A$6,\"Month\",$T33,\"Delay reason\",X$16)),\"\"),0)","v":""},{"$f":"IFERROR(IF(AND($T33>=$R$24,$T33<=$R$25),(GETPIVOTDATA(\"Value\",Pivots!$A$6,\"Month\",$T33,\"Delay reason\",Y$16)),\"\"),0)","v":""},{"$f":"IFERROR(IF(AND($T33>=$R$24,$T33<=$R$25),(GETPIVOTDATA(\"Value\",Pivots!$A$6,\"Month\",$T33,\"Delay reason\",Z$16)),\"\"),0)","v":""},{"$f":"IFERROR(IF(AND($T33>=$R$24,$T33<=$R$25),(GETPIVOTDATA(\"Value\",Pivots!$A$6,\"Month\",$T33,\"Delay reason\",AA$16)),\"\"),0)","v":""},{"$f":"IFERROR(IF(AND($T33>=$R$24,$T33<=$R$25),(GETPIVOTDATA(\"Value\",Pivots!$A$6,\"Month\",$T33,\"Delay reason\",AB$16)),\"\"),0)","v":""},{"$f":"IFERROR(IF(AND($T33>=$R$24,$T33<=$R$25),(GETPIVOTDATA(\"Value\",Pivots!$A$6,\"Month\",$T33,\"Delay reason\",AC$16)),\"\"),0)","v":""},{"$f":"IFERROR(IF(AND($T33>=$R$24,$T33<=$R$25),(GETPIVOTDATA(\"Value\",Pivots!$A$6,\"Month\",$T33,\"Delay reason\",AD$16)),\"\"),0)","v":""},{"$f":"IFERROR(IF(AND($T33>=$R$24,$T33<=$R$25),(GETPIVOTDATA(\"Value\",Pivots!$A$6,\"Month\",$T33,\"Delay reason\",AE$16)),\"\"),0)","v":""},{"$f":"IFERROR(IF(AND($T33>=$R$24,$T33<=$R$25),(GETPIVOTDATA(\"Value\",Pivots!$A$6,\"Month\",$T33,\"Delay reason\",AF$16)),\"\"),0)","v":""},0]
[null,2,"B) Awaiting public funding",{"$f":"HLOOKUP(C34,$V$16:$AF$42,27,0)","v":24943},null,2,{"$f":"COUNTIF($D$33:$D$43,$D34)","v":1},{"$f":"IF(G34>1,D34+ROW()*0.001,D34)","v":24943},{"$f":"RANK(H34,H$33:H$43)","v":8},{"$f":"INDEX($C$33:$C$43,MATCH($F34,$I$33:$I$43,0))","v":"C) Awaiting further non-acute NHS care (including intermediate care, rehabilitation services etc)"},{"$f":"INDEX($D$33:$D$43,MATCH($F34,$I$33:$I$43,0))","v":160199},null,null,{"$f":"N33+K34","v":352555},{"$f":"N34/$N$43","v":0.3864730327754739},null,"Max Y axis",{"$f":"ROUNDUP(R33/10000,0)*10000","v":200000},18,"2019-07-01","(All)",{"$f":"IFERROR(IF(AND($T34>=$R$24,$T34<=$R$25),(GETPIVOTDATA(\"Value\",Pivots!$A$6,\"Month\",$T34,\"Delay reason\",V$16)),\"\"),0)","v":""},{"$f":"IFERROR(IF(AND($T34>=$R$24,$T34<=$R$25),(GETPIVOTDATA(\"Value\",Pivots!$A$6,\"Month\",$T34,\"Delay reason\",W$16)),\"\"),0)","v":""},{"$f":"IFERROR(IF(AND($T34>=$R$24,$T34<=$R$25),(GETPIVOTDATA(\"Value\",Pivots!$A$6,\"Month\",$T34,\"Delay reason\",X$16)),\"\"),0)","v":""},{"$f":"IFERROR(IF(AND($T34>=$R$24,$T34<=$R$25),(GETPIVOTDATA(\"Value\",Pivots!$A$6,\"Month\",$T34,\"Delay reason\",Y$16)),\"\"),0)","v":""},{"$f":"IFERROR(IF(AND($T34>=$R$24,$T34<=$R$25),(GETPIVOTDATA(\"Value\",Pivots!$A$6,\"Month\",$T34,\"Delay reason\",Z$16)),\"\"),0)","v":""},{"$f":"IFERROR(IF(AND($T34>=$R$24,$T34<=$R$25),(GETPIVOTDATA(\"Value\",Pivots!$A$6,\"Month\",$T34,\"Delay reason\",AA$16)),\"\"),0)","v":""},{"$f":"IFERROR(IF(AND($T34>=$R$24,$T34<=$R$25),(GETPIVOTDATA(\"Value\",Pivots!$A$6,\"Month\",$T34,\"Delay reason\",AB$16)),\"\"),0)","v":""},{"$f":"IFERROR(IF(AND($T34>=$R$24,$T34<=$R$25),(GETPIVOTDATA(\"Value\",Pivots!$A$6,\"Month\",$T34,\"Delay reason\",AC$16)),\"\"),0)","v":""},{"$f":"IFERROR(IF(AND($T34>=$R$24,$T34<=$R$25),(GETPIVOTDATA(\"Value\",Pivots!$A$6,\"Month\",$T34,\"Delay reason\",AD$16)),\"\"),0)","v":""},{"$f":"IFERROR(IF(AND($T34>=$R$24,$T34<=$R$25),(GETPIVOTDATA(\"Value\",Pivots!$A$6,\"Month\",$T34,\"Delay reason\",AE$16)),\"\"),0)","v":""},{"$f":"IFERROR(IF(AND($T34>=$R$24,$T34<=$R$25),(GETPIVOTDATA(\"Value\",Pivots!$A$6,\"Month\",$T34,\"Delay reason\",AF$16)),\"\"),0)","v":""},0]
[null,3,"C) Awaiting further non-acute NHS care (including intermediate care, rehabilitation services etc)",160199,null,3,1,160199,{"$f":"RANK(H35,H$33:H$43)","v":2},"Dii) Awaiting nursing home placement or availability",120966,null,null,{"$f":"N34+K35","v":473521},0.51907673115648678,null,"interval",{"$f":"IF(MOD(R34/1000,5)=0,R34/5,IF(MOD(R34/1000,4)=0,R34/4,IF(MOD(R34/1000,6)=0,R34/6,IF(MOD(R34/1000,3)=0,R34/3,ROUNDUP(R34/1000/5,0)*1000))))","v":40000},19,"2019-08-01","(All)",{"$f":"IFERROR(IF(AND($T35>=$R$24,$T35<=$R$25),(GETPIVOTDATA(\"Value\",Pivots!$A$6,\"Month\",$T35,\"Delay reason\",V$16)),\"\"),0)","v":""},{"$f":"IFERROR(IF(AND($T35>=$R$24,$T35<=$R$25),(GETPIVOTDATA(\"Value\",Pivots!$A$6,\"Month\",$T35,\"Delay reason\",W$16)),\"\"),0)","v":""},{"$f":"IFERROR(IF(AND($T35>=$R$24,$T35<=$R$25),(GETPIVOTDATA(\"Value\",Pivots!$A$6,\"Month\",$T35,\"Delay reason\",X$16)),\"\"),0)","v":""},{"$f":"IFERROR(IF(AND($T35>=$R$24,$T35<=$R$25),(GETPIVOTDATA(\"Value\",Pivots!$A$6,\"Month\",$T35,\"Delay reason\",Y$16)),\"\"),0)","v":""},{"$f":"IFERROR(IF(AND($T35>=$R$24,$T35<=$R$25),(GETPIVOTDATA(\"Value\",Pivots!$A$6,\"Month\",$T35,\"Delay reason\",Z$16)),\"\"),0)","v":""},{"$f":"IFERROR(IF(AND($T35>=$R$24,$T35<=$R$25),(GETPIVOTDATA(\"Value\",Pivots!$A$6,\"Month\",$T35,\"Delay reason\",AA$16)),\"\"),0)","v":""},{"$f":"IFERROR(IF(AND($T35>=$R$24,$T35<=$R$25),(GETPIVOTDATA(\"Value\",Pivots!$A$6,\"Month\",$T35,\"Delay reason\",AB$16)),\"\"),0)","v":""},{"$f":"IFERROR(IF(AND($T35>=$R$24,$T35<=$R$25),(GETPIVOTDATA(\"Value\",Pivots!$A$6,\"Month\",$T35,\"Delay reason\",AC$16)),\"\"),0)","v":""},{"$f":"IFERROR(IF(AND($T35>=$R$24,$T35<=$R$25),(GETPIVOTDATA(\"Value\",Pivots!$A$6,\"Month\",$T35,\"Delay reason\",AD$16)),\"\"),0)","v":""},{"$f":"IFERROR(IF(AND($T35>=$R$24,$T35<=$R$25),(GETPIVOTDATA(\"Value\",Pivots!$A$6,\"Month\",$T35,\"Delay reason\",AE$16)),\"\"),0)","v":""},{"$f":"IFERROR(IF(AND($T35>=$R$24,$T35<=$R$25),(GETPIVOTDATA(\"Value\",Pivots!$A$6,\"Month\",$T35,\"Delay reason\",AF$16)),\"\"),0)","v":""},0]
[null,4,"Di) Awaiting residential home placement or availability",108638,null,4,1,108638,5,"A) Awaiting completion of assessment",115600,null,null,589121,0.64579818621695895,null,null,null,20,"2019-09-01","(All)",{"$f":"IFERROR(IF(AND($T36>=$R$24,$T36<=$R$25),(GETPIVOTDATA(\"Value\",Pivots!$A$6,\"Month\",$T36,\"Delay reason\",V$16)),\"\"),0)","v":19611},{"$f":"IFERROR(IF(AND($T36>=$R$24,$T36<=$R$25),(GETPIVOTDATA(\"Value\",Pivots!$A$6,\"Month\",$T36,\"Delay reason\",W$16)),\"\"),0)","v":4128},{"$f":"IFERROR(IF(AND($T36>=$R$24,$T36<=$R$25),(GETPIVOTDATA(\"Value\",Pivots!$A$6,\"Month\",$T36,\"Delay reason\",X$16)),\"\"),0)","v":24587},{"$f":"IFERROR(IF(AND($T36>=$R$24,$T36<=$R$25),(GETPIVOTDATA(\"Value\",Pivots!$A$6,\"Month\",$T36,\"Delay reason\",Y$16)),\"\"),0)","v":17524},{"$f":"IFERROR(IF(AND($T36>=$R$24,$T36<=$R$25),(GETPIVOTDATA(\"Value\",Pivots!$A$6,\"Month\",$T36,\"Delay reason\",Z$16)),\"\"),0)","v":19644},{"$f":"IFERROR(IF(AND($T36>=$R$24,$T36<=$R$25),(GETPIVOTDATA(\"Value\",Pivots!$A$6,\"Month\",$T36,\"Delay reason\",AA$16)),\"\"),0)","v":32025},{"$f":"IFERROR(IF(AND($T36>=$R$24,$T36<=$R$25),(GETPIVOTDATA(\"Value\",Pivots!$A$6,\"Month\",$T36,\"Delay reason\",AB$16)),\"\"),0)","v":4171},{"$f":"IFERROR(IF(AND($T36>=$R$24,$T36<=$R$25),(GETPIVOTDATA(\"Value\",Pivots!$A$6,\"Month\",$T36,\"Delay reason\",AC$16)),\"\"),0)","v":18613},{"$f":"IFERROR(IF(AND($T36>=$R$24,$T36<=$R$25),(GETPIVOTDATA(\"Value\",Pivots!$A$6,\"Month\",$T36,\"Delay reason\",AD$16)),\"\"),0)","v":868},{"$f":"IFERROR(IF(AND($T36>=$R$24,$T36<=$R$25),(GETPIVOTDATA(\"Value\",Pivots!$A$6,\"Month\",$T36,\"Delay reason\",AE$16)),\"\"),0)","v":6222},{"$f":"IFERROR(IF(AND($T36>=$R$24,$T36<=$R$25),(GETPIVOTDATA(\"Value\",Pivots!$A$6,\"Month\",$T36,\"Delay reason\",AF$16)),\"\"),0)","v":1991},11]
[null,5,"Dii) Awaiting nursing home placement or availability",120966,null,5,1,120966,3,"Di) Awaiting residential home placement or availability",108638,null,null,697759,0.7648878526084778,null,null,null,21,"2019-10-01","(All)",{"$f":"IFERROR(IF(AND($T37>=$R$24,$T37<=$R$25),(GETPIVOTDATA(\"Value\",Pivots!$A$6,\"Month\",$T37,\"Delay reason\",V$16)),\"\"),0)","v":18437},{"$f":"IFERROR(IF(AND($T37>=$R$24,$T37<=$R$25),(GETPIVOTDATA(\"Value\",Pivots!$A$6,\"Month\",$T37,\"Delay reason\",W$16)),\"\"),0)","v":4199},{"$f":"IFERROR(IF(AND($T37>=$R$24,$T37<=$R$25),(GETPIVOTDATA(\"Value\",Pivots!$A$6,\"Month\",$T37,\"Delay reason\",X$16)),\"\"),0)","v":26023},{"$f":"IFERROR(IF(AND($T37>=$R$24,$T37<=$R$25),(GETPIVOTDATA(\"Value\",Pivots!$A$6,\"Month\",$T37,\"Delay reason\",Y$16)),\"\"),0)","v":18371},{"$f":"IFERROR(IF(AND($T37>=$R$24,$T37<=$R$25),(GETPIVOTDATA(\"Value\",Pivots!$A$6,\"Month\",$T37,\"Delay reason\",Z$16)),\"\"),0)","v":21881},{"$f":"IFERROR(IF(AND($T37>=$R$24,$T37<=$R$25),(GETPIVOTDATA(\"Value\",Pivots!$A$6,\"Month\",$T37,\"Delay reason\",AA$16)),\"\"),0)","v":31643},{"$f":"IFERROR(IF(AND($T37>=$R$24,$T37<=$R$25),(GETPIVOTDATA(\"Value\",Pivots!$A$6,\"Month\",$T37,\"Delay reason\",AB$16)),\"\"),0)","v":4557},{"$f":"IFERROR(IF(AND($T37>=$R$24,$T37<=$R$25),(GETPIVOTDATA(\"Value\",Pivots!$A$6,\"Month\",$T37,\"Delay reason\",AC$16)),\"\"),0)","v":17896},{"$f":"IFERROR(IF(AND($T37>=$R$24,$T37<=$R$25),(GETPIVOTDATA(\"Value\",Pivots!$A$6,\"Month\",$T37,\"Delay reason\",AD$16)),\"\"),0)","v":1174},{"$f":"IFERROR(IF(AND($T37>=$R$24,$T37<=$R$25),(GETPIVOTDATA(\"Value\",Pivots!$A$6,\"Month\",$T37,\"Delay reason\",AE$16)),\"\"),0)","v":6641},{"$f":"IFERROR(IF(AND($T37>=$R$24,$T37<=$R$25),(GETPIVOTDATA(\"Value\",Pivots!$A$6,\"Month\",$T37,\"Delay reason\",AF$16)),\"\"),0)","v":1700},11]
[null,6,"E) Awaiting care package in own home",192356,null,6,1,192356,{"$f":"RANK(H38,H$33:H$43)","v":1},"G) Patient or family choice",103619,null,null,801378,0.87847565928590921,null,null,null,22,"2019-11-01","(All)",{"$f":"IFERROR(IF(AND($T38>=$R$24,$T38<=$R$25),(GETPIVOTDATA(\"Value\",Pivots!$A$6,\"Month\",$T38,\"Delay reason\",V$16)),\"\"),0)","v":18022},{"$f":"IFERROR(IF(AND($T38>=$R$24,$T38<=$R$25),(GETPIVOTDATA(\"Value\",Pivots!$A$6,\"Month\",$T38,\"Delay reason\",W$16)),\"\"),0)","v":4517},{"$f":"IFERROR(IF(AND($T38>=$R$24,$T38<=$R$25),(GETPIVOTDATA(\"Value\",Pivots!$A$6,\"Month\",$T38,\"Delay reason\",X$16)),\"\"),0)","v":25343},{"$f":"IFERROR(IF(AND($T38>=$R$24,$T38<=$R$25),(GETPIVOTDATA(\"Value\",Pivots!$A$6,\"Month\",$T38,\"Delay reason\",Y$16)),\"\"),0)","v":17214},{"$f":"IFERROR(IF(AND($T38>=$R$24,$T38<=$R$25),(GETPIVOTDATA(\"Value\",Pivots!$A$6,\"Month\",$T38,\"Delay reason\",Z$16)),\"\"),0)","v":20004},{"$f":"IFERROR(IF(AND($T38>=$R$24,$T38<=$R$25),(GETPIVOTDATA(\"Value\",Pivots!$A$6,\"Month\",$T38,\"Delay reason\",AA$16)),\"\"),0)","v":30375},{"$f":"IFERROR(IF(AND($T38>=$R$24,$T38<=$R$25),(GETPIVOTDATA(\"Value\",Pivots!$A$6,\"Month\",$T38,\"Delay reason\",AB$16)),\"\"),0)","v":4033},{"$f":"IFERROR(IF(AND($T38>=$R$24,$T38<=$R$25),(GETPIVOTDATA(\"Value\",Pivots!$A$6,\"Month\",$T38,\"Delay reason\",AC$16)),\"\"),0)","v":16536},{"$f":"IFERROR(IF(AND($T38>=$R$24,$T38<=$R$25),(GETPIVOTDATA(\"Value\",Pivots!$A$6,\"Month\",$T38,\"Delay reason\",AD$16)),\"\"),0)","v":1299},{"$f":"IFERROR(IF(AND($T38>=$R$24,$T38<=$R$25),(GETPIVOTDATA(\"Value\",Pivots!$A$6,\"Month\",$T38,\"Delay reason\",AE$16)),\"\"),0)","v":6410},{"$f":"IFERROR(IF(AND($T38>=$R$24,$T38<=$R$25),(GETPIVOTDATA(\"Value\",Pivots!$A$6,\"Month\",$T38,\"Delay reason\",AF$16)),\"\"),0)","v":2123},11]
[null,7,"F) Awaiting community equipment and adaptations",24754,null,7,1,24754,9,"I) Housing – patients not covered by NHS Care Act",42074,null,null,843452,0.92459744561994306,null,null,null,23,"2019-12-01","(All)",{"$f":"IFERROR(IF(AND($T39>=$R$24,$T39<=$R$25),(GETPIVOTDATA(\"Value\",Pivots!$A$6,\"Month\",$T39,\"Delay reason\",V$16)),\"\"),0)","v":18399},{"$f":"IFERROR(IF(AND($T39>=$R$24,$T39<=$R$25),(GETPIVOTDATA(\"Value\",Pivots!$A$6,\"Month\",$T39,\"Delay reason\",W$16)),\"\"),0)","v":3753},{"$f":"IFERROR(IF(AND($T39>=$R$24,$T39<=$R$25),(GETPIVOTDATA(\"Value\",Pivots!$A$6,\"Month\",$T39,\"Delay reason\",X$16)),\"\"),0)","v":25704},{"$f":"IFERROR(IF(AND($T39>=$R$24,$T39<=$R$25),(GETPIVOTDATA(\"Value\",Pivots!$A$6,\"Month\",$T39,\"Delay reason\",Y$16)),\"\"),0)","v":18374},{"$f":"IFERROR(IF(AND($T39>=$R$24,$T39<=$R$25),(GETPIVOTDATA(\"Value\",Pivots!$A$6,\"Month\",$T39,\"Delay reason\",Z$16)),\"\"),0)","v":19344},{"$f":"IFERROR(IF(AND($T39>=$R$24,$T39<=$R$25),(GETPIVOTDATA(\"Value\",Pivots!$A$6,\"Month\",$T39,\"Delay reason\",AA$16)),\"\"),0)","v":31393},{"$f":"IFERROR(IF(AND($T39>=$R$24,$T39<=$R$25),(GETPIVOTDATA(\"Value\",Pivots!$A$6,\"Month\",$T39,\"Delay reason\",AB$16)),\"\"),0)","v":3925},{"$f":"IFERROR(IF(AND($T39>=$R$24,$T39<=$R$25),(GETPIVOTDATA(\"Value\",Pivots!$A$6,\"Month\",$T39,\"Delay reason\",AC$16)),\"\"),0)","v":16654},{"$f":"IFERROR(IF(AND($T39>=$R$24,$T39<=$R$25),(GETPIVOTDATA(\"Value\",Pivots!$A$6,\"Month\",$T39,\"Delay reason\",AD$16)),\"\"),0)","v":1235},{"$f":"IFERROR(IF(AND($T39>=$R$24,$T39<=$R$25),(GETPIVOTDATA(\"Value\",Pivots!$A$6,\"Month\",$T39,\"Delay reason\",AE$16)),\"\"),0)","v":7078},{"$f":"IFERROR(IF(AND($T39>=$R$24,$T39<=$R$25),(GETPIVOTDATA(\"Value\",Pivots!$A$6,\"Month\",$T39,\"Delay reason\",AF$16)),\"\"),0)","v":2242},11]
[null,8,"G) Patient or family choice",103619,null,8,1,103619,6,"B) Awaiting public funding",24943,null,null,868395,0.95194012082386481,null,null,null,24,"2020-01-01","(All)",{"$f":"IFERROR(IF(AND($T40>=$R$24,$T40<=$R$25),(GETPIVOTDATA(\"Value\",Pivots!$A$6,\"Month\",$T40,\"Delay reason\",V$16)),\"\"),0)","v":20917},{"$f":"IFERROR(IF(AND($T40>=$R$24,$T40<=$R$25),(GETPIVOTDATA(\"Value\",Pivots!$A$6,\"Month\",$T40,\"Delay reason\",W$16)),\"\"),0)","v":4228},{"$f":"IFERROR(IF(AND($T40>=$R$24,$T40<=$R$25),(GETPIVOTDATA(\"Value\",Pivots!$A$6,\"Month\",$T40,\"Delay reason\",X$16)),\"\"),0)","v":29825},{"$f":"IFERROR(IF(AND($T40>=$R$24,$T40<=$R$25),(GETPIVOTDATA(\"Value\",Pivots!$A$6,\"Month\",$T40,\"Delay reason\",Y$16)),\"\"),0)","v":19327},{"$f":"IFERROR(IF(AND($T40>=$R$24,$T40<=$R$25),(GETPIVOTDATA(\"Value\",Pivots!$A$6,\"Month\",$T40,\"Delay reason\",Z$16)),\"\"),0)","v":19641},{"$f":"IFERROR(IF(AND($T40>=$R$24,$T40<=$R$25),(GETPIVOTDATA(\"Value\",Pivots!$A$6,\"Month\",$T40,\"Delay reason\",AA$16)),\"\"),0)","v":34456},{"$f":"IFERROR(IF(AND($T40>=$R$24,$T40<=$R$25),(GETPIVOTDATA(\"Value\",Pivots!$A$6,\"Month\",$T40,\"Delay reason\",AB$16)),\"\"),0)","v":4091},{"$f":"IFERROR(IF(AND($T40>=$R$24,$T40<=$R$25),(GETPIVOTDATA(\"Value\",Pivots!$A$6,\"Month\",$T40,\"Delay reason\",AC$16)),\"\"),0)","v":17052},{"$f":"IFERROR(IF(AND($T40>=$R$24,$T40<=$R$25),(GETPIVOTDATA(\"Value\",Pivots!$A$6,\"Month\",$T40,\"Delay reason\",AD$16)),\"\"),0)","v":1191},{"$f":"IFERROR(IF(AND($T40>=$R$24,$T40<=$R$25),(GETPIVOTDATA(\"Value\",Pivots!$A$6,\"Month\",$T40,\"Delay reason\",AE$16)),\"\"),0)","v":7696},{"$f":"IFERROR(IF(AND($T40>=$R$24,$T40<=$R$25),(GETPIVOTDATA(\"Value\",Pivots!$A$6,\"Month\",$T40,\"Delay reason\",AF$16)),\"\"),0)","v":2213},11]
[null,9,"H) Disputes",6811,null,9,1,6811,11,"F) Awaiting community equipment and adaptations",24754,null,null,893149,0.97907561302600088,null,null,null,25,"2020-02-01",{"$f":"$C$11","v":"(All)"},{"$f":"IFERROR(IF(AND($T41>=$R$24,$T41<=$R$25),(GETPIVOTDATA(\"Value\",Pivots!$A$6,\"Month\",$T41,\"Delay reason\",V$16)),\"\"),0)","v":20214},{"$f":"IFERROR(IF(AND($T41>=$R$24,$T41<=$R$25),(GETPIVOTDATA(\"Value\",Pivots!$A$6,\"Month\",$T41,\"Delay reason\",W$16)),\"\"),0)","v":4118},{"$f":"IFERROR(IF(AND($T41>=$R$24,$T41<=$R$25),(GETPIVOTDATA(\"Value\",Pivots!$A$6,\"Month\",$T41,\"Delay reason\",X$16)),\"\"),0)","v":28717},{"$f":"IFERROR(IF(AND($T41>=$R$24,$T41<=$R$25),(GETPIVOTDATA(\"Value\",Pivots!$A$6,\"Month\",$T41,\"Delay reason\",Y$16)),\"\"),0)","v":17828},{"$f":"IFERROR(IF(AND($T41>=$R$24,$T41<=$R$25),(GETPIVOTDATA(\"Value\",Pivots!$A$6,\"Month\",$T41,\"Delay reason\",Z$16)),\"\"),0)","v":20452},{"$f":"IFERROR(IF(AND($T41>=$R$24,$T41<=$R$25),(GETPIVOTDATA(\"Value\",Pivots!$A$6,\"Month\",$T41,\"Delay reason\",AA$16)),\"\"),0)","v":32464},{"$f":"IFERROR(IF(AND($T41>=$R$24,$T41<=$R$25),(GETPIVOTDATA(\"Value\",Pivots!$A$6,\"Month\",$T41,\"Delay reason\",AB$16)),\"\"),0)","v":3977},{"$f":"IFERROR(IF(AND($T41>=$R$24,$T41<=$R$25),(GETPIVOTDATA(\"Value\",Pivots!$A$6,\"Month\",$T41,\"Delay reason\",AC$16)),\"\"),0)","v":16868},{"$f":"IFERROR(IF(AND($T41>=$R$24,$T41<=$R$25),(GETPIVOTDATA(\"Value\",Pivots!$A$6,\"Month\",$T41,\"Delay reason\",AD$16)),\"\"),0)","v":1044},{"$f":"IFERROR(IF(AND($T41>=$R$24,$T41<=$R$25),(GETPIVOTDATA(\"Value\",Pivots!$A$6,\"Month\",$T41,\"Delay reason\",AE$16)),\"\"),0)","v":8027},{"$f":"IFERROR(IF(AND($T41>=$R$24,$T41<=$R$25),(GETPIVOTDATA(\"Value\",Pivots!$A$6,\"Month\",$T41,\"Delay reason\",AF$16)),\"\"),0)","v":2008},11]
[null,10,"I) Housing – patients not covered by NHS Care Act",42074,null,10,1,42074,7,"O) Other",12277,null,null,905426,0.99253373849120352,null,null,null,"Total",null,null,{"$f":"SUM(V17:V41)","v":115600},{"$f":"SUM(W17:W41)","v":24943},{"$f":"SUM(X17:X41)","v":160199},{"$f":"SUM(Y17:Y41)","v":108638},120966,192356,24754,103619,6811,{"$f":"SUM(AE17:AE41)","v":42074},{"$f":"SUM(AF17:AF41)","v":12277},11]
[null,11,"O) Other",12277,null,11,1,12277,10,"H) Disputes",6811,null,null,{"$f":"N42+K43","v":912237},1]
[]
[]
[null,null,null,"Count IF data point is zero",null,null,null,null,null,null,null,null,null,null,null,null,null,null,null,null,null,null,"RULES"]
[null,{"$f":"C19","v":"E) Awaiting care package in own home"},null,{"$f":"COUNTIF(D50:D74,0)","v":0}]
[null,1,{"$f":"ROW()","v":48},null,null,null,null,"Upper","Lower",null,null,null,null,"Date","Difference",null,"Sigma",null,null,null,null,null,"> 3","< 3 ",null,null,"7 points above/below mean",null,null,null,null,null,null,null,"Trend up/down",null,null,null,null,null,null,null,"chart 1"]
[null,"ID (Week no.)","Plot data","Data",null,null,"Mean","Control limits ","control limit (-3)",null,null,null,null,null,"For. Roll avg","Cumul. Moving Avg.","2.66* MR","3.27*MR",null,null,null,null,"Count","Count","Above 3 sigma","Below 3 sigma","7 points > mean","Count of 7point ","7 points above mean",null,"7 points <mean","Count of 7 point ","6 points below mean",null,"Trend up",null,null,null,"Trend Down",null,null,null,"Concern","Improvement"]
[1,{"$f":"$D$8","v":"2018-02-01"},{"$f":"IFERROR(IF(GETPIVOTDATA(\"Value\",Pivots!$A$6,\"Month\",$B50,\"Delay reason\",$C$19)=0,\"\",GETPIVOTDATA(\"Value\",Pivots!$A$6,\"Month\",$B50,\"Delay reason\",$C$19)),NA())","v":30876},{"$f":"IFERROR(IF(C50=\"\",0,C50),\"\")","v":30876},null,null,{"$f":"AVERAGE($D$50:$D$74)","v":29837.279999999999},{"$f":"IF($D$47>5,NA(),IF(D50=\"\",H49,G50+Q50))","v":34333.345000000001},{"$f":"IF($D$47>5,NA(),IF(D50=\"\",I49,G50-Q50))","v":25341.214999999997},null,null,null,null,{"$f":"B50","v":"2018-02-01"},null,{"$f":"IF(O50=\"\",P49,AVERAGE(IF($O$50:O$74<>\"\",$O$50:O$74)))","v":"Cumul. Moving Avg."},{"$f":"Q51","v":4496.0650000000005},{"$f":"R51","v":5527.1175000000003},null,null,null,null,{"$f":"IF($D$47>5,NA(),IF(D50>H50,MAX(W$49:$W49)+1,0))","v":0},{"$f":"IF($D$47>5,NA(),IF(D50<I50,MAX(X$49:$X49)+1,0))","v":0},{"$f":"IF(W50>0,C50,NA())","v":{"$error":"#N/A"}},{"$f":"IF(X50>0,D50,NA())","v":{"$error":"#N/A"}},{"$f":"IFERROR(IF($D$47>5,NA(), IF(D50>G50,1,0)),0)","v":1},{"$f":"IFERROR(IF(AND(AB49=1,AA50=1),1,IF(SUM(AA50:AA56)>=7,1,0)),NA())","v":0},{"$f":"IF(AB50=0,NA(),C50)","v":{"$error":"#N/A"}},null,{"$f":"IFERROR(IF($D$47>5,NA(), IF(D50<G50,1,0)),0)","v":0},{"$f":"IFERROR(IF(AND(AF49=1,AE50=1),1,IF(SUM(AE50:AE56)>=7,1,0)),NA())","v":0},{"$f":"IF(AF50=0,NA(),C50)","v":{"$error":"#N/A"}},null,{"$f":"IF($D$47>5,NA(),IF(D50>D49,1,0))","v":0},{"$f":"IFERROR(IF(AND(AJ49=1,AI50=1),1,IF(SUM(AI50:AI56)>=7,1,0)),NA())","v":0},{"$f":"IF(AJ50=0,NA(),C50)","v":{"$error":"#N/A"}},null,{"$f":"IF($D$47>5,NA(),IF(D50<D49,1,0))","v":1},{"$f":"IFERROR(IF(AND(AN49=1,AM50=1),1,IF(SUM(AM50:AM56)>=7,1,0)),NA())","v":0},{"$f":"IF(AN50=0,NA(),C50)","v":{"$error":"#N/A"}},null,{"$f":"IF(OR(W50>0,AB50>0,AJ50>0),C50,NA())","v":{"$error":"#N/A"}},{"$f":"IF(OR(X50>0,AF50>0,AN50>0),D50,NA())","v":{"$error":"#N/A"}}]
[2,{"$f":"IF(DAY(B50+31)=1,B50+31,B50+31-DAY(B50+31)+1)","v":"2018-03-01"},{"$f":"IFERROR(IF(GETPIVOTDATA(\"Value\",Pivots!$A$6,\"Month\",$B51,\"Delay reason\",$C$19)=0,\"\",GETPIVOTDATA(\"Value\",Pivots!$A$6,\"Month\",$B51,\"Delay reason\",$C$19)),NA())","v":33504},{"$f":"IFERROR(IF(C51=\"\",0,C51),\"\")","v":33504},null,null,{"$f":"AVERAGE($D$50:$D$74)","v":29837.279999999999},{"$f":"IF($D$47>5,NA(),IF(D51=\"\",H50,G51+Q51))","v":34333.345000000001},{"$f":"IF($D$47>5,NA(),IF(D51=\"\",I50,G51-Q51))","v":25341.214999999997},null,null,null,null,{"$f":"B51","v":"2018-03-01"},{"$f":"IF(D50=\"\",\"\",IF(D51=\"\",\"\",ABS(D50-D51)))","v":2628},{"$f":"IF(O51=\"\",P50,AVERAGE(IF($O$50:O$74<>\"\",$O$50:O$74)))","v":1690.25},{"$f":"IF(ISERROR((P51*2.66)),Q52,(P51*2.66))","v":4496.0650000000005},{"$f":"$P51*3.27","v":5527.1175000000003},null,null,null,null,{"$f":"IF($D$47>5,NA(),IF(D51>H51,MAX(W$49:$W50)+1,0))","v":0},{"$f":"IF($D$47>5,NA(),IF(D51<I51,MAX(X$49:$X50)+1,0))","v":0},{"$f":"IF(W51>0,C51,NA())","v":{"$error":"#N/A"}},{"$f":"IF(X51>0,D51,NA())","v":{"$error":"#N/A"}},{"$f":"IFERROR(IF($D$47>5,NA(), IF(D51>G51,1,0)),0)","v":1},{"$f":"IFERROR(IF(AND(AB50=1,AA51=1),1,IF(SUM(AA51:AA57)>=7,1,0)),NA())","v":0},{"$f":"IF(AB51=0,NA(),C51)","v":{"$error":"#N/A"}},null,{"$f":"IFERROR(IF($D$47>5,NA(), IF(D51<G51,1,0)),0)","v":0},{"$f":"IFERROR(IF(AND(AF50=1,AE51=1),1,IF(SUM(AE51:AE57)>=7,1,0)),NA())","v":0},{"$f":"IF(AF51=0,NA(),C51)","v":{"$error":"#N/A"}},null,{"$f":"IF($D$47>5,NA(),IF(D51>D50,1,0))","v":1},{"$f":"IFERROR(IF(AND(AJ50=1,AI51=1),1,IF(SUM(AI51:AI57)>=7,1,0)),NA())","v":0},{"$f":"IF(AJ51=0,NA(),C51)","v":{"$error":"#N/A"}},null,{"$f":"IF($D$47>5,NA(),IF(D51<D50,1,0))","v":0},{"$f":"IFERROR(IF(AND(AN50=1,AM51=1),1,IF(SUM(AM51:AM57)>=7,1,0)),NA())","v":0},{"$f":"IF(AN51=0,NA(),C51)","v":{"$error":"#N/A"}},null,{"$f":"IF(OR(W51>0,AB51>0,AJ51>0),C51,NA())","v":{"$error":"#N/A"}},{"$f":"IF(OR(X51>0,AF51>0,AN51>0),D51,NA())","v":{"$error":"#N/A"}}]
[3,{"$f":"IF(DAY(B51+31)=1,B51+31,B51+31-DAY(B51+31)+1)","v":"2018-04-01"},{"$f":"IFERROR(IF(GETPIVOTDATA(\"Value\",Pivots!$A$6,\"Month\",$B52,\"Delay reason\",$C$19)=0,\"\",GETPIVOTDATA(\"Value\",Pivots!$A$6,\"Month\",$B52,\"Delay reason\",$C$19)),NA())","v":29458},29458,null,null,{"$f":"AVERAGE($D$50:$D$74)","v":29837.279999999999},{"$f":"IF($D$47>5,NA(),IF(D52=\"\",H51,G52+Q52))","v":34333.345000000001},{"$f":"IF($D$47>5,NA(),IF(D52=\"\",I51,G52-Q52))","v":25341.214999999997},null,null,null,null,"2018-04-01",{"$f":"IF(D51=\"\",\"\",IF(D52=\"\",\"\",ABS(D51-D52)))","v":4046},{"$f":"IF(O52=\"\",P51,AVERAGE(IF($O$50:O$74<>\"\",$O$50:O$74)))","v":1690.25},{"$f":"IF(ISERROR((P52*2.66)),Q53,(P52*2.66))","v":4496.0650000000005},{"$f":"$P52*3.27","v":5527.1175000000003},null,null,null,null,{"$f":"IF($D$47>5,NA(),IF(D52>H52,MAX(W$49:$W51)+1,0))","v":0},{"$f":"IF($D$47>5,NA(),IF(D52<I52,MAX(X$49:$X51)+1,0))","v":0},{"$error":"#N/A"},{"$error":"#N/A"},0,0,{"$error":"#N/A"},null,1,0,{"$error":"#N/A"},null,0,{"$f":"IFERROR(IF(AND(AJ51=1,AI52=1),1,IF(SUM(AI52:AI58)>=7,1,0)),NA())","v":0},{"$f":"IF(AJ52=0,NA(),C52)","v":{"$error":"#N/A"}},null,1,0,{"$f":"IF(AN52=0,NA(),C52)","v":{"$error":"#N/A"}},null,{"$error":"#N/A"},{"$error":"#N/A"}]
[4,"2018-05-01",{"$f":"IFERROR(IF(GETPIVOTDATA(\"Value\",Pivots!$A$6,\"Month\",$B53,\"Delay reason\",$C$19)=0,\"\",GETPIVOTDATA(\"Value\",Pivots!$A$6,\"Month\",$B53,\"Delay reason\",$C$19)),NA())","v":27442},27442,null,null,29837.279999999999,34333.345000000001,25341.214999999997,null,null,null,null,"2018-05-01",2016,{"$f":"IF(O53=\"\",P52,AVERAGE(IF($O$50:O$74<>\"\",$O$50:O$74)))","v":1690.25},{"$f":"IF(ISERROR((P53*2.66)),Q54,(P53*2.66))","v":4496.0650000000005},5527.1175000000003,null,null,null,null,{"$f":"IF($D$47>5,NA(),IF(D53>H53,MAX(W$49:$W52)+1,0))","v":0},{"$f":"IF($D$47>5,NA(),IF(D53<I53,MAX(X$49:$X52)+1,0))","v":0},{"$error":"#N/A"},{"$error":"#N/A"},0,0,{"$error":"#N/A"},null,1,0,{"$error":"#N/A"},null,0,0,{"$error":"#N/A"},null,1,0,{"$error":"#N/A"},null,{"$error":"#N/A"},{"$error":"#N/A"}]
[5,"2018-06-01",{"$f":"IFERROR(IF(GETPIVOTDATA(\"Value\",Pivots!$A$6,\"Month\",$B54,\"Delay reason\",$C$19)=0,\"\",GETPIVOTDATA(\"Value\",Pivots!$A$6,\"Month\",$B54,\"Delay reason\",$C$19)),NA())","v":27978},27978,null,null,29837.279999999999,34333.345000000001,25341.214999999997,null,null,null,null,"2018-06-01",536,{"$f":"IF(O54=\"\",P53,AVERAGE(IF($O$50:O$74<>\"\",$O$50:O$74)))","v":1690.25},4496.0650000000005,5527.1175000000003,null,null,null,null,{"$f":"IF($D$47>5,NA(),IF(D54>H54,MAX(W$49:$W53)+1,0))","v":0},{"$f":"IF($D$47>5,NA(),IF(D54<I54,MAX(X$49:$X53)+1,0))","v":0},{"$error":"#N/A"},{"$error":"#N/A"},0,0,{"$error":"#N/A"},null,1,0,{"$error":"#N/A"},null,1,0,{"$error":"#N/A"},null,0,0,{"$error":"#N/A"},null,{"$error":"#N/A"},{"$error":"#N/A"}]
[6,"2018-07-01",{"$f":"IFERROR(IF(GETPIVOTDATA(\"Value\",Pivots!$A$6,\"Month\",$B55,\"Delay reason\",$C$19)=0,\"\",GETPIVOTDATA(\"Value\",Pivots!$A$6,\"Month\",$B55,\"Delay reason\",$C$19)),NA())","v":30570},30570,null,null,29837.279999999999,34333.345000000001,25341.214999999997,null,null,null,null,"2018-07-01",2592,{"$f":"IF(O55=\"\",P54,AVERAGE(IF($O$50:O$74<>\"\",$O$50:O$74)))","v":1690.25},4496.0650000000005,5527.1175000000003,null,null,null,null,{"$f":"IF($D$47>5,NA(),IF(D55>H55,MAX(W$49:$W54)+1,0))","v":0},{"$f":"IF($D$47>5,NA(),IF(D55<I55,MAX(X$49:$X54)+1,0))","v":0},{"$error":"#N/A"},{"$error":"#N/A"},1,0,{"$error":"#N/A"},null,0,0,{"$error":"#N/A"},null,1,0,{"$error":"#N/A"},null,0,0,{"$error":"#N/A"},null,{"$error":"#N/A"},{"$error":"#N/A"}]
[7,"2018-08-01",{"$f":"IFERROR(IF(GETPIVOTDATA(\"Value\",Pivots!$A$6,\"Month\",$B56,\"Delay reason\",$C$19)=0,\"\",GETPIVOTDATA(\"Value\",Pivots!$A$6,\"Month\",$B56,\"Delay reason\",$C$19)),NA())","v":31577},31577,null,null,29837.279999999999,34333.345000000001,25341.214999999997,null,null,null,null,"2018-08-01",1007,{"$f":"IF(O56=\"\",P55,AVERAGE(IF($O$50:O$74<>\"\",$O$50:O$74)))","v":1690.25},4496.0650000000005,5527.1175000000003,null,null,null,null,{"$f":"IF($D$47>5,NA(),IF(D56>H56,MAX(W$49:$W55)+1,0))","v":0},{"$f":"IF($D$47>5,NA(),IF(D56<I56,MAX(X$49:$X55)+1,0))","v":0},{"$error":"#N/A"},{"$error":"#N/A"},1,0,{"$error":"#N/A"},null,0,0,{"$error":"#N/A"},null,1,0,{"$error":"#N/A"},null,0,0,{"$error":"#N/A"},null,{"$error":"#N/A"},{"$error":"#N/A"}]
[8,"2018-09-01",{"$f":"IFERROR(IF(GETPIVOTDATA(\"Value\",Pivots!$A$6,\"Month\",$B57,\"Delay reason\",$C$19)=0,\"\",GETPIVOTDATA(\"Value\",Pivots!$A$6,\"Month\",$B57,\"Delay reason\",$C$19)),NA())","v":31080},31080,null,null,29837.279999999999,34333.345000000001,25341.214999999997,null,null,null,null,"2018-09-01",497,{"$f":"IF(O57=\"\",P56,AVERAGE(IF($O$50:O$74<>\"\",$O$50:O$74)))","v":1690.25},4496.0650000000005,5527.1175000000003,null,null,null,null,{"$f":"IF($D$47>5,NA(),IF(D57>H57,MAX(W$49:$W56)+1,0))","v":0},{"$f":"IF($D$47>5,NA(),IF(D57<I57,MAX(X$49:$X56)+1,0))","v":0},{"$error":"#N/A"},{"$error":"#N/A"},1,0,{"$error":"#N/A"},null,0,0,{"$error":"#N/A"},null,0,0,{"$error":"#N/A"},null,1,0,{"$error":"#N/A"},null,{"$error":"#N/A"},{"$error":"#N/A"}]
[9,"2018-10-01",{"$f":"IFERROR(IF(GETPIVOTDATA(\"Value\",Pivots!$A$6,\"Month\",$B58,\"Delay reason\",$C$19)=0,\"\",GETPIVOTDATA(\"Value\",Pivots!$A$6,\"Month\",$B58,\"Delay reason\",$C$19)),NA())","v":30807},30807,null,null,29837.279999999999,34333.345000000001,25341.214999999997,null,null,null,null,"2018-10-01",273,{"$f":"IF(O58=\"\",P57,AVERAGE(IF($O$50:O$74<>\"\",$O$50:O$74)))","v":1690.25},4496.0650000000005,5527.1175000000003,null,null,null,null,{"$f":"IF($D$47>5,NA(),IF(D58>H58,MAX(W$49:$W57)+1,0))","v":0},{"$f":"IF($D$47>5,NA(),IF(D58<I58,MAX(X$49:$X57)+1,0))","v":0},{"$error":"#N/A"},{"$error":"#N/A"},1,0,{"$error":"#N/A"},null,0,0,{"$error":"#N/A"},null,0,0,{"$error":"#N/A"},null,1,0,{"$error":"#N/A"},null,{"$error":"#N/A"},{"$error":"#N/A"}]
[10,"2018-11-01",{"$f":"IFERROR(IF(GETPIVOTDATA(\"Value\",Pivots!$A$6,\"Month\",$B59,\"Delay reason\",$C$19)=0,\"\",GETPIVOTDATA(\"Value\",Pivots!$A$6,\"Month\",$B59,\"Delay reason\",$C$19)),NA())","v":28822},28822,null,null,29837.279999999999,34333.345000000001,25341.214999999997,null,null,null,null,"2018-11-01",1985,{"$f":"IF(O59=\"\",P58,AVERAGE(IF($O$50:O$74<>\"\",$O$50:O$74)))","v":1690.25},4496.0650000000005,5527.1175000000003,null,null,null,null,{"$f":"IF($D$47>5,NA(),IF(D59>H59,MAX(W$49:$W58)+1,0))","v":0},{"$f":"IF($D$47>5,NA(),IF(D59<I59,MAX(X$49:$X58)+1,0))","v":0},{"$error":"#N/A"},{"$error":"#N/A"},0,0,{"$error":"#N/A"},null,1,1,28822,null,0,0,{"$error":"#N/A"},null,1,0,{"$error":"#N/A"},null,{"$error":"#N/A"},28822]
[11,"2018-12-01",{"$f":"IFERROR(IF(GETPIVOTDATA(\"Value\",Pivots!$A$6,\"Month\",$B60,\"Delay reason\",$C$19)=0,\"\",GETPIVOTDATA(\"Value\",Pivots!$A$6,\"Month\",$B60,\"Delay reason\",$C$19)),NA())","v":27550},27550,null,null,29837.279999999999,34333.345000000001,25341.214999999997,null,null,null,null,"2018-12-01",1272,{"$f":"IF(O60=\"\",P59,AVERAGE(IF($O$50:O$74<>\"\",$O$50:O$74)))","v":1690.25},4496.0650000000005,5527.1175000000003,null,null,null,null,{"$f":"IF($D$47>5,NA(),IF(D60>H60,MAX(W$49:$W59)+1,0))","v":0},{"$f":"IF($D$47>5,NA(),IF(D60<I60,MAX(X$49:$X59)+1,0))","v":0},{"$error":"#N/A"},{"$error":"#N/A"},0,0,{"$error":"#N/A"},null,1,1,27550,null,0,0,{"$error":"#N/A"},null,1,0,{"$error":"#N/A"},null,{"$error":"#N/A"},27550]
[12,"2019-01-01",{"$f":"IFERROR(IF(GETPIVOTDATA(\"Value\",Pivots!$A$6,\"Month\",$B61,\"Delay reason\",$C$19)=0,\"\",GETPIVOTDATA(\"Value\",Pivots!$A$6,\"Month\",$B61,\"Delay reason\",$C$19)),NA())","v":27733},27733,null,null,29837.279999999999,34333.345000000001,25341.214999999997,null,null,null,null,"2019-01-01",183,{"$f":"IF(O61=\"\",P60,AVERAGE(IF($O$50:O$74<>\"\",$O$50:O$74)))","v":1690.25},4496.0650000000005,5527.1175000000003,null,null,null,null,{"$f":"IF($D$47>5,NA(),IF(D61>H61,MAX(W$49:$W60)+1,0))","v":0},{"$f":"IF($D$47>5,NA(),IF(D61<I61,MAX(X$49:$X60)+1,0))","v":0},{"$error":"#N/A"},{"$error":"#N/A"},0,0,{"$error":"#N/A"},null,1,1,27733,null,1,0,{"$error":"#N/A"},null,0,0,{"$error":"#N/A"},null,{"$error":"#N/A"},27733]
[13,"2019-02-01",{"$f":"IFERROR(IF(GETPIVOTDATA(\"Value\",Pivots!$A$6,\"Month\",$B62,\"Delay reason\",$C$19)=0,\"\",GETPIVOTDATA(\"Value\",Pivots!$A$6,\"Month\",$B62,\"Delay reason\",$C$19)),NA())","v":25350},25350,null,null,29837.279999999999,34333.345000000001,25341.214999999997,null,null,null,null,"2019-02-01",2383,{"$f":"IF(O62=\"\",P61,AVERAGE(IF($O$50:O$74<>\"\",$O$50:O$74)))","v":1690.25},4496.0650000000005,5527.1175000000003,null,null,null,null,{"$f":"IF($D$47>5,NA(),IF(D62>H62,MAX(W$49:$W61)+1,0))","v":0},{"$f":"IF($D$47>5,NA(),IF(D62<I62,MAX(X$49:$X61)+1,0))","v":0},{"$error":"#N/A"},{"$error":"#N/A"},0,0,{"$error":"#N/A"},null,1,1,25350,null,0,0,{"$error":"#N/A"},null,1,0,{"$error":"#N/A"},null,{"$error":"#N/A"},25350]
[14,"2019-03-01",{"$f":"IFERROR(IF(GETPIVOTDATA(\"Value\",Pivots!$A$6,\"Month\",$B63,\"Delay reason\",$C$19)=0,\"\",GETPIVOTDATA(\"Value\",Pivots!$A$6,\"Month\",$B63,\"Delay reason\",$C$19)),NA())","v":28208},28208,null,null,29837.279999999999,34333.345000000001,25341.214999999997,null,null,null,null,"2019-03-01",2858,{"$f":"IF(O63=\"\",P62,AVERAGE(IF($O$50:O$74<>\"\",$O$50:O$74)))","v":1690.25},4496.0650000000005,5527.1175000000003,null,null,null,null,{"$f":"IF($D$47>5,NA(),IF(D63>H63,MAX(W$49:$W62)+1,0))","v":0},{"$f":"IF($D$47>5,NA(),IF(D63<I63,MAX(X$49:$X62)+1,0))","v":0},{"$error":"#N/A"},{"$error":"#N/A"},0,0,{"$error":"#N/A"},null,1,1,28208,null,1,0,{"$error":"#N/A"},null,0,0,{"$error":"#N/A"},null,{"$error":"#N/A"},28208]
[15,"2019-04-01",{"$f":"IFERROR(IF(GETPIVOTDATA(\"Value\",Pivots!$A$6,\"Month\",$B64,\"Delay reason\",$C$19)=0,\"\",GETPIVOTDATA(\"Value\",Pivots!$A$6,\"Month\",$B64,\"Delay reason\",$C$19)),NA())","v":25051},25051,null,null,29837.279999999999,34333.345000000001,25341.214999999997,null,null,null,null,"2019-04-01",3157,{"$f":"IF(O64=\"\",P63,AVERAGE(IF($O$50:O$74<>\"\",$O$50:O$74)))","v":1690.25},4496.0650000000005,5527.1175000000003,null,null,null,null,{"$f":"IF($D$47>5,NA(),IF(D64>H64,MAX(W$49:$W63)+1,0))","v":0},{"$f":"IF($D$47>5,NA(),IF(D64<I64,MAX(X$49:$X63)+1,0))","v":1},{"$error":"#N/A"},25051,0,0,{"$error":"#N/A"},null,1,1,25051,null,0,0,{"$error":"#N/A"},null,1,0,{"$error":"#N/A"},null,{"$error":"#N/A"},25051]
[16,"2019-05-01",{"$f":"IFERROR(IF(GETPIVOTDATA(\"Value\",Pivots!$A$6,\"Month\",$B65,\"Delay reason\",$C$19)=0,\"\",GETPIVOTDATA(\"Value\",Pivots!$A$6,\"Month\",$B65,\"Delay reason\",$C$19)),NA())","v":27789},27789,null,null,29837.279999999999,34333.345000000001,25341.214999999997,null,null,null,null,"2019-05-01",2738,{"$f":"IF(O65=\"\",P64,AVERAGE(IF($O$50:O$74<>\"\",$O$50:O$74)))","v":1690.25},4496.0650000000005,5527.1175000000003,null,null,null,null,{"$f":"IF($D$47>5,NA(),IF(D65>H65,MAX(W$49:$W64)+1,0))","v":0},{"$f":"IF($D$47>5,NA(),IF(D65<I65,MAX(X$49:$X64)+1,0))","v":0},{"$error":"#N/A"},{"$error":"#N/A"},0,0,{"$error":"#N/A"},null,1,1,27789,null,1,0,{"$error":"#N/A"},null,0,0,{"$error":"#N/A"},null,{"$error":"#N/A"},27789]
[17,"2019-06-01",{"$f":"IFERROR(IF(GETPIVOTDATA(\"Value\",Pivots!$A$6,\"Month\",$B66,\"Delay reason\",$C$19)=0,\"\",GETPIVOTDATA(\"Value\",Pivots!$A$6,\"Month\",$B66,\"Delay reason\",$C$19)),NA())","v":27719},27719,null,null,29837.279999999999,34333.345000000001,25341.214999999997,null,null,null,null,"2019-06-01",70,{"$f":"IF(O66=\"\",P65,AVERAGE(IF($O$50:O$74<>\"\",$O$50:O$74)))","v":1690.25},4496.0650000000005,5527.1175000000003,null,null,null,null,{"$f":"IF($D$47>5,NA(),IF(D66>H66,MAX(W$49:$W65)+1,0))","v":0},{"$f":"IF($D$47>5,NA(),IF(D66<I66,MAX(X$49:$X65)+1,0))","v":0},{"$error":"#N/A"},{"$error":"#N/A"},0,0,{"$error":"#N/A"},null,1,1,27719,null,0,0,{"$error":"#N/A"},null,1,0,{"$error":"#N/A"},null,{"$error":"#N/A"},27719]
[18,"2019-07-01",{"$f":"IFERROR(IF(GETPIVOTDATA(\"Value\",Pivots!$A$6,\"Month\",$B67,\"Delay reason\",$C$19)=0,\"\",GETPIVOTDATA(\"Value\",Pivots!$A$6,\"Month\",$B67,\"Delay reason\",$C$19)),NA())","v":29889},29889,null,null,29837.279999999999,34333.345000000001,25341.214999999997,null,null,null,null,"2019-07-01",2170,{"$f":"IF(O67=\"\",P66,AVERAGE(IF($O$50:O$74<>\"\",$O$50:O$74)))","v":1690.25},4496.0650000000005,5527.1175000000003,null,null,null,null,{"$f":"IF($D$47>5,NA(),IF(D67>H67,MAX(W$49:$W66)+1,0))","v":0},{"$f":"IF($D$47>5,NA(),IF(D67<I67,MAX(X$49:$X66)+1,0))","v":0},{"$error":"#N/A"},{"$error":"#N/A"},1,1,29889,null,0,0,{"$error":"#N/A"},null,1,0,{"$error":"#N/A"},null,0,0,{"$error":"#N/A"},null,29889,{"$error":"#N/A"}]
[19,"2019-08-01",{"$f":"IFERROR(IF(GETPIVOTDATA(\"Value\",Pivots!$A$6,\"Month\",$B68,\"Delay reason\",$C$19)=0,\"\",GETPIVOTDATA(\"Value\",Pivots!$A$6,\"Month\",$B68,\"Delay reason\",$C$19)),NA())","v":32173},32173,null,null,29837.279999999999,34333.345000000001,25341.214999999997,null,null,null,null,"2019-08-01",2284,{"$f":"IF(O68=\"\",P67,AVERAGE(IF($O$50:O$74<>\"\",$O$50:O$74)))","v":1690.25},4496.0650000000005,5527.1175000000003,null,null,null,null,{"$f":"IF($D$47>5,NA(),IF(D68>H68,MAX(W$49:$W67)+1,0))","v":0},{"$f":"IF($D$47>5,NA(),IF(D68<I68,MAX(X$49:$X67)+1,0))","v":0},{"$error":"#N/A"},{"$error":"#N/A"},1,1,32173,null,0,0,{"$error":"#N/A"},null,1,0,{"$error":"#N/A"},null,0,0,{"$error":"#N/A"},null,32173,{"$error":"#N/A"}]
[20,"2019-09-01",{"$f":"IFERROR(IF(GETPIVOTDATA(\"Value\",Pivots!$A$6,\"Month\",$B69,\"Delay reason\",$C$19)=0,\"\",GETPIVOTDATA(\"Value\",Pivots!$A$6,\"Month\",$B69,\"Delay reason\",$C$19)),NA())","v":32025},32025,null,null,29837.279999999999,34333.345000000001,25341.214999999997,null,null,null,null,"2019-09-01",148,{"$f":"IF(O69=\"\",P68,AVERAGE(IF($O$50:O$74<>\"\",$O$50:O$74)))","v":1690.25},4496.0650000000005,5527.1175000000003,null,null,null,null,{"$f":"IF($D$47>5,NA(),IF(D69>H69,MAX(W$49:$W68)+1,0))","v":0},{"$f":"IF($D$47>5,NA(),IF(D69<I69,MAX(X$49:$X68)+1,0))","v":0},{"$error":"#N/A"},{"$error":"#N/A"},1,1,32025,null,0,0,{"$error":"#N/A"},null,0,0,{"$error":"#N/A"},null,1,{"$f":"IFERROR(IF(AND(AN68=1,AM69=1),1,IF(SUM(AM69:AM74)>=7,1,0)),NA())","v":0},{"$error":"#N/A"},null,32025,{"$error":"#N/A"}]
[21,"2019-10-01",{"$f":"IFERROR(IF(GETPIVOTDATA(\"Value\",Pivots!$A$6,\"Month\",$B70,\"Delay reason\",$C$19)=0,\"\",GETPIVOTDATA(\"Value\",Pivots!$A$6,\"Month\",$B70,\"Delay reason\",$C$19)),NA())","v":31643},31643,null,null,29837.279999999999,34333.345000000001,25341.214999999997,null,null,null,null,"2019-10-01",382,{"$f":"IF(O70=\"\",P69,AVERAGE(IF($O$50:O$74<>\"\",$O$50:O$74)))","v":1690.25},4496.0650000000005,5527.1175000000003,null,null,null,null,{"$f":"IF($D$47>5,NA(),IF(D70>H70,MAX(W$49:$W69)+1,0))","v":0},{"$f":"IF($D$47>5,NA(),IF(D70<I70,MAX(X$49:$X69)+1,0))","v":0},{"$error":"#N/A"},{"$error":"#N/A"},1,1,31643,null,0,0,{"$error":"#N/A"},null,0,{"$f":"IFERROR(IF(AND(AJ69=1,AI70=1),1,IF(SUM(AI70:AI74)>=7,1,0)),NA())","v":0},{"$error":"#N/A"},null,1,{"$f":"IFERROR(IF(AND(AN69=1,AM70=1),1,IF(SUM(AM70:AM74)>=7,1,0)),NA())","v":0},{"$error":"#N/A"},null,31643,{"$error":"#N/A"}]
[22,"2019-11-01",{"$f":"IFERROR(IF(GETPIVOTDATA(\"Value\",Pivots!$A$6,\"Month\",$B71,\"Delay reason\",$C$19)=0,\"\",GETPIVOTDATA(\"Value\",Pivots!$A$6,\"Month\",$B71,\"Delay reason\",$C$19)),NA())","v":30375},30375,null,null,{"$f":"AVERAGE($D$50:$D$74)","v":29837.279999999999},34333.345000000001,25341.214999999997,null,null,null,null,"2019-11-01",1268,{"$f":"IF(O71=\"\",P70,AVERAGE(IF($O$50:O$74<>\"\",$O$50:O$74)))","v":1690.25},4496.0650000000005,5527.1175000000003,null,null,null,null,{"$f":"IF($D$47>5,NA(),IF(D71>H71,MAX(W$49:$W70)+1,0))","v":0},{"$f":"IF($D$47>5,NA(),IF(D71<I71,MAX(X$49:$X70)+1,0))","v":0},{"$error":"#N/A"},{"$error":"#N/A"},1,{"$f":"IFERROR(IF(AND(AB70=1,AA71=1),1,IF(SUM(AA71:AA74)>=7,1,0)),NA())","v":1},{"$f":"IF(AB71=0,NA(),C71)","v":30375},null,0,{"$f":"IFERROR(IF(AND(AF70=1,AE71=1),1,IF(SUM(AE71:AE74)>=7,1,0)),NA())","v":0},{"$f":"IF(AF71=0,NA(),C71)","v":{"$error":"#N/A"}},null,0,{"$f":"IFERROR(IF(AND(AJ70=1,AI71=1),1,IF(SUM(AI71:AI74)>=7,1,0)),NA())","v":0},{"$error":"#N/A"},null,1,{"$f":"IFERROR(IF(AND(AN70=1,AM71=1),1,IF(SUM(AM71:AM74)>=7,1,0)),NA())","v":0},{"$error":"#N/A"},null,30375,{"$error":"#N/A"}]
[23,"2019-12-01",{"$f":"IFERROR(IF(GETPIVOTDATA(\"Value\",Pivots!$A$6,\"Month\",$B72,\"Delay reason\",$C$19)=0,\"\",GETPIVOTDATA(\"Value\",Pivots!$A$6,\"Month\",$B72,\"Delay reason\",$C$19)),NA())","v":31393},31393,null,null,{"$f":"AVERAGE($D$50:$D$74)","v":29837.279999999999},34333.345000000001,25341.214999999997,null,null,null,null,"2019-12-01",1018,{"$f":"IF(O72=\"\",P71,AVERAGE(IF($O$50:O$74<>\"\",$O$50:O$74)))","v":1690.25},4496.0650000000005,5527.1175000000003,null,null,null,null,{"$f":"IF($D$47>5,NA(),IF(D72>H72,MAX(W$49:$W71)+1,0))","v":0},{"$f":"IF($D$47>5,NA(),IF(D72<I72,MAX(X$49:$X71)+1,0))","v":0},{"$error":"#N/A"},{"$error":"#N/A"},1,{"$f":"IFERROR(IF(AND(AB71=1,AA72=1),1,IF(SUM(AA72:AA74)>=7,1,0)),NA())","v":1},31393,null,0,{"$f":"IFERROR(IF(AND(AF71=1,AE72=1),1,IF(SUM(AE72:AE74)>=7,1,0)),NA())","v":0},{"$error":"#N/A"},null,1,0,{"$error":"#N/A"},null,0,{"$f":"IFERROR(IF(AND(AN71=1,AM72=1),1,IF(SUM(AM72:AM74)>=7,1,0)),NA())","v":0},{"$error":"#N/A"},null,31393,{"$error":"#N/A"}]
[24,"2020-01-01",{"$f":"IFERROR(IF(GETPIVOTDATA(\"Value\",Pivots!$A$6,\"Month\",$B73,\"Delay reason\",$C$19)=0,\"\",GETPIVOTDATA(\"Value\",Pivots!$A$6,\"Month\",$B73,\"Delay reason\",$C$19)),NA())","v":34456},34456,null,null,29837.279999999999,34333.345000000001,25341.214999999997,null,null,null,null,"2020-01-01",3063,{"$f":"IF(O73=\"\",P72,AVERAGE(IF($O$50:O$74<>\"\",$O$50:O$74)))","v":1690.25},4496.0650000000005,5527.1175000000003,null,null,null,null,{"$f":"IF($D$47>5,NA(),IF(D73>H73,MAX(W$49:$W72)+1,0))","v":1},{"$f":"IF($D$47>5,NA(),IF(D73<I73,MAX(X$49:$X72)+1,0))","v":0},34456,{"$error":"#N/A"},1,1,34456,null,0,{"$f":"IFERROR(IF(AND(AF72=1,AE73=1),1,IF(SUM(AE73:AE74)>=7,1,0)),NA())","v":0},{"$error":"#N/A"},null,1,{"$f":"IFERROR(IF(AND(AJ72=1,AI73=1),1,IF(SUM(AI73:AI74)>=7,1,0)),NA())","v":0},{"$error":"#N/A"},null,0,0,{"$error":"#N/A"},null,34456,{"$error":"#N/A"}]
[25,"2020-02-01",{"$f":"IFERROR(IF(GETPIVOTDATA(\"Value\",Pivots!$A$6,\"Month\",$B74,\"Delay reason\",$C$19)=0,\"\",GETPIVOTDATA(\"Value\",Pivots!$A$6,\"Month\",$B74,\"Delay reason\",$C$19)),NA())","v":32464},32464,null,null,29837.279999999999,34333.345000000001,25341.214999999997,null,null,null,null,"2020-02-01",1992,{"$f":"IF(O74=\"\",P73,AVERAGE(IF($O$50:O$74<>\"\",$O$50:O$74)))","v":1690.25},{"$f":"IF(ISERROR((P74*2.66)),Q75,(P74*2.66))","v":4496.0650000000005},5527.1175000000003,null,null,null,null,{"$f":"IF($D$47>5,NA(),IF(D74>H74,MAX(W$49:$W73)+1,0))","v":0},{"$f":"IF($D$47>5,NA(),IF(D74<I74,MAX(X$49:$X73)+1,0))","v":0},{"$error":"#N/A"},{"$error":"#N/A"},1,{"$f":"IFERROR(IF(AND(AB73=1,AA74=1),1,IF(SUM(AA74)>=7,1,0)),NA())","v":1},32464,null,0,{"$f":"IFERROR(IF(AND(AF73=1,AE74=1),1,IF(SUM(AE74)>=7,1,0)),NA())","v":0},{"$error":"#N/A"},null,{"$f":"IF($D$47>5,NA(),IF(D74>D73,1,0))","v":0},{"$f":"IFERROR(IF(AND(AJ73=1,AI74=1),1,IF(SUM(AI74)>=7,1,0)),NA())","v":0},{"$error":"#N/A"},null,{"$f":"IF($D$47>5,NA(),IF(D74<D73,1,0))","v":1},{"$f":"IFERROR(IF(AND(AN73=1,AM74=1),1,IF(SUM(AM74)>=7,1,0)),NA())","v":0},{"$error":"#N/A"},null,32464,{"$error":"#N/A"}]
[null,null,null,"Count IF data point is zero"]
[null,{"$f":"C20","v":"C) Awaiting further non-acute NHS care (including intermediate care, rehabilitation services etc)"},null,{"$f":"COUNTIF(D79:D103,0)","v":0}]
[null,2,{"$f":"ROW()","v":77},null,null,null,null,"Upper","Lower",null,null,null,null,"Date","Difference",null,"Sigma",null,null,null,null,null,"> 3","< 3 ",null,null,"7 points above/below mean",null,null,null,null,null,null,null,"Trend up/down",null,null,null,null,null,null,null,"chart 2"]
[null,"ID (Week no.)","Plot data","Data",null,null,"Mean","Control limits ","control limit (-3)",null,null,null,null,null,"For. Roll avg","Cumul. Moving Avg.","2.66* MR","3.27*MR",null,null,null,null,"Count","Count","Above 3 sigma","Below 3 sigma","7 points > mean","Count of 7point ","7 points above mean",null,"7 points <mean","Count of 7 point ","6 points below mean",null,"Trend up",null,null,null,"Trend Down",null,null,null,"Concern","Improvement"]
[null,{"$f":"D8","v":"2018-02-01"},{"$f":"IFERROR(IF(GETPIVOTDATA(\"Value\",Pivots!$A$6,\"Month\",$B79,\"Delay reason\",$C$20)=0,\"\",GETPIVOTDATA(\"Value\",Pivots!$A$6,\"Month\",$B79,\"Delay reason\",$C$20)),NA())","v":24647},{"$f":"IFERROR(IF(C79=\"\",0,C79),\"\")","v":24647},null,null,{"$f":"AVERAGE($D$79:$D$103)","v":25073.360000000001},{"$f":"IF($D$76>5,NA(),IF(D79=\"\",H78,G79+Q79))","v":28788.271666666667},{"$f":"IF($D$76>5,NA(),IF(D79=\"\",I78,G79-Q79))","v":21358.448333333334},null,null,null,null,{"$f":"B79","v":"2018-02-01"},null,{"$f":"IF(O79=\"\",P78,AVERAGE(IF($O$79:$O$103<>\"\",$O$79:$O$103)))","v":"Cumul. Moving Avg."},{"$f":"Q80","v":3714.9116666666669},{"$f":"R80","v":4566.8274999999994},null,null,null,null,{"$f":"IF($D$76>5,NA(),IF(D79>H79,MAX(W$78:$W78)+1,0))","v":0},{"$f":"IF($D$76>5,NA(),IF(D79<I79,MAX(W$78:$W79)+1,0))","v":0},{"$f":"IF(W79>0,C79,NA())","v":{"$error":"#N/A"}},{"$f":"IF(X79>0,D79,NA())","v":{"$error":"#N/A"}},{"$f":"IFERROR(IF($D$76>5,NA(), IF(D79>G79,1,0)),0)","v":0},{"$f":"IFERROR(IF(AND(AB78=1,AA79=1),1,IF(SUM(AA79:AA85)>=7,1,0)),NA())","v":0},{"$f":"IF(AB79=0,NA(),C79)","v":{"$error":"#N/A"}},null,{"$f":"IFERROR(IF($D$76>5,NA(), IF(D79<G79,1,0)),0)","v":1},{"$f":"IFERROR(IF(AND(AF78=1,AE79=1),1,IF(SUM(AE79:AE85)>=7,1,0)),NA())","v":0},{"$f":"IF(AF79=0,NA(),C79)","v":{"$error":"#N/A"}},null,{"$f":"IF($D$76>5,NA(),IF(D79>D78,1,0))","v":0},{"$f":"IFERROR(IF(AND(AJ78=1,AI79=1),1,IF(SUM(AI79:AI85)>=7,1,0)),NA())","v":0},{"$f":"IF(AJ79=0,NA(),C79)","v":{"$error":"#N/A"}},null,{"$f":"IF($D$76>5,NA(),IF(D79<D78,1,0))","v":1},{"$f":"IFERROR(IF(AND(AN78=1,AM79=1),1,IF(SUM(AM79:AM85)>=7,1,0)),NA())","v":0},{"$f":"IF(AN79=0,NA(),C79)","v":{"$error":"#N/A"}},null,{"$f":"IF(OR(W79>0,AB79>0,AJ79>0),C79,NA())","v":{"$error":"#N/A"}},{"$f":"IF(OR(X79>0,AF79>0,AN79>0),D79,NA())","v":{"$error":"#N/A"}}]
[null,{"$f":"IF(DAY(B79+31)=1,B79+31,B79+31-DAY(B79+31)+1)","v":"2018-03-01"},{"$f":"IFERROR(IF(GETPIVOTDATA(\"Value\",Pivots!$A$6,\"Month\",$B80,\"Delay reason\",$C$20)=0,\"\",GETPIVOTDATA(\"Value\",Pivots!$A$6,\"Month\",$B80,\"Delay reason\",$C$20)),NA())","v":29316},{"$f":"IFERROR(IF(C80=\"\",0,C80),\"\")","v":29316},null,null,{"$f":"AVERAGE($D$79:$D$103)","v":25073.360000000001},{"$f":"IF($D$76>5,NA(),IF(D80=\"\",H79,G80+Q80))","v":28788.271666666667},{"$f":"IF($D$76>5,NA(),IF(D80=\"\",I79,G80-Q80))","v":21358.448333333334},null,null,null,null,{"$f":"B80","v":"2018-03-01"},{"$f":"IF(D79=\"\",\"\",IF(D80=\"\",\"\",ABS(D79-D80)))","v":4669},1396.5833333333333,{"$f":"IF(ISERROR((P80*2.66)),Q81,(P80*2.66))","v":3714.9116666666669},{"$f":"$P80*3.27","v":4566.8274999999994},null,null,null,null,{"$f":"IF($D$76>5,NA(),IF(D80>H80,MAX(W$78:$W79)+1,0))","v":1},{"$f":"IF($D$76>5,NA(),IF(D80<I80,MAX(W$78:$W80)+1,0))","v":0},{"$f":"IF(W80>0,C80,NA())","v":29316},{"$f":"IF(X80>0,D80,NA())","v":{"$error":"#N/A"}},{"$f":"IFERROR(IF($D$76>5,NA(), IF(D80>G80,1,0)),0)","v":1},{"$f":"IFERROR(IF(AND(AB79=1,AA80=1),1,IF(SUM(AA80:AA86)>=7,1,0)),NA())","v":0},{"$f":"IF(AB80=0,NA(),C80)","v":{"$error":"#N/A"}},null,{"$f":"IFERROR(IF($D$76>5,NA(), IF(D80<G80,1,0)),0)","v":0},{"$f":"IFERROR(IF(AND(AF79=1,AE80=1),1,IF(SUM(AE80:AE86)>=7,1,0)),NA())","v":0},{"$f":"IF(AF80=0,NA(),C80)","v":{"$error":"#N/A"}},null,{"$f":"IF($D$76>5,NA(),IF(D80>D79,1,0))","v":1},{"$f":"IFERROR(IF(AND(AJ79=1,AI80=1),1,IF(SUM(AI80:AI86)>=7,1,0)),NA())","v":0},{"$f":"IF(AJ80=0,NA(),C80)","v":{"$error":"#N/A"}},null,{"$f":"IF($D$76>5,NA(),IF(D80<D79,1,0))","v":0},{"$f":"IFERROR(IF(AND(AN79=1,AM80=1),1,IF(SUM(AM80:AM86)>=7,1,0)),NA())","v":0},{"$f":"IF(AN80=0,NA(),C80)","v":{"$error":"#N/A"}},null,{"$f":"IF(OR(W80>0,AB80>0,AJ80>0),C80,NA())","v":29316},{"$f":"IF(OR(X80>0,AF80>0,AN80>0),D80,NA())","v":{"$error":"#N/A"}}]
[null,{"$f":"IF(DAY(B80+31)=1,B80+31,B80+31-DAY(B80+31)+1)","v":"2018-04-01"},{"$f":"IFERROR(IF(GETPIVOTDATA(\"Value\",Pivots!$A$6,\"Month\",$B81,\"Delay reason\",$C$20)=0,\"\",GETPIVOTDATA(\"Value\",Pivots!$A$6,\"Month\",$B81,\"Delay reason\",$C$20)),NA())","v":26700},26700,null,null,25073.360000000001,{"$f":"IF($D$76>5,NA(),IF(D81=\"\",H80,G81+Q81))","v":28788.271666666667},{"$f":"IF($D$76>5,NA(),IF(D81=\"\",I80,G81-Q81))","v":21358.448333333334},null,null,null,null,"2018-04-01",{"$f":"IF(D80=\"\",\"\",IF(D81=\"\",\"\",ABS(D80-D81)))","v":2616},1396.5833333333333,{"$f":"IF(ISERROR((P81*2.66)),Q82,(P81*2.66))","v":3714.9116666666669},{"$f":"$P81*3.27","v":4566.8274999999994},null,null,null,null,{"$f":"IF($D$76>5,NA(),IF(D81>H81,MAX(W$78:$W80)+1,0))","v":0},{"$f":"IF($D$76>5,NA(),IF(D81<I81,MAX(W$78:$W81)+1,0))","v":0},{"$error":"#N/A"},{"$error":"#N/A"},1,0,{"$error":"#N/A"},null,0,0,{"$error":"#N/A"},null,0,0,{"$f":"IF(AJ81=0,NA(),C81)","v":{"$error":"#N/A"}},null,1,0,{"$f":"IF(AN81=0,NA(),C81)","v":{"$error":"#N/A"}},null,{"$error":"#N/A"},{"$error":"#N/A"}]
[null,"2018-05-01",{"$f":"IFERROR(IF(GETPIVOTDATA(\"Value\",Pivots!$A$6,\"Month\",$B82,\"Delay reason\",$C$20)=0,\"\",GETPIVOTDATA(\"Value\",Pivots!$A$6,\"Month\",$B82,\"Delay reason\",$C$20)),NA())","v":24841},24841,null,null,{"$f":"AVERAGE($D$79:$D$103)","v":25073.360000000001},28788.271666666667,21358.448333333334,null,null,null,null,"2018-05-01",1859,1396.5833333333333,{"$f":"IF(ISERROR((P82*2.66)),Q83,(P82*2.66))","v":3714.9116666666669},4566.8274999999994,null,null,null,null,{"$f":"IF($D$76>5,NA(),IF(D82>H82,MAX(W$78:$W81)+1,0))","v":0},{"$f":"IF($D$76>5,NA(),IF(D82<I82,MAX(W$78:$W82)+1,0))","v":0},{"$error":"#N/A"},{"$error":"#N/A"},0,0,{"$error":"#N/A"},null,1,1,24841,null,0,0,{"$error":"#N/A"},null,1,0,{"$error":"#N/A"},null,{"$error":"#N/A"},24841]
[null,"2018-06-01",{"$f":"IFERROR(IF(GETPIVOTDATA(\"Value\",Pivots!$A$6,\"Month\",$B83,\"Delay reason\",$C$20)=0,\"\",GETPIVOTDATA(\"Value\",Pivots!$A$6,\"Month\",$B83,\"Delay reason\",$C$20)),NA())","v":22953},22953,null,null,25073.360000000001,28788.271666666667,21358.448333333334,null,null,null,null,"2018-06-01",1888,1396.5833333333333,3714.9116666666669,4566.8274999999994,null,null,null,null,{"$f":"IF($D$76>5,NA(),IF(D83>H83,MAX(W$78:$W82)+1,0))","v":0},{"$f":"IF($D$76>5,NA(),IF(D83<I83,MAX(W$78:$W83)+1,0))","v":0},{"$error":"#N/A"},{"$error":"#N/A"},0,0,{"$error":"#N/A"},null,1,1,22953,null,0,0,{"$error":"#N/A"},null,1,0,{"$error":"#N/A"},null,{"$error":"#N/A"},22953]
[null,"2018-07-01",{"$f":"IFERROR(IF(GETPIVOTDATA(\"Value\",Pivots!$A$6,\"Month\",$B84,\"Delay reason\",$C$20)=0,\"\",GETPIVOTDATA(\"Value\",Pivots!$A$6,\"Month\",$B84,\"Delay reason\",$C$20)),NA())","v":24166},24166,null,null,25073.360000000001,28788.271666666667,21358.448333333334,null,null,null,null,"2018-07-01",1213,1396.5833333333333,3714.9116666666669,4566.8274999999994,null,null,null,null,{"$f":"IF($D$76>5,NA(),IF(D84>H84,MAX(W$78:$W83)+1,0))","v":0},{"$f":"IF($D$76>5,NA(),IF(D84<I84,MAX(W$78:$W84)+1,0))","v":0},{"$error":"#N/A"},{"$error":"#N/A"},0,0,{"$error":"#N/A"},null,1,1,24166,null,1,0,{"$error":"#N/A"},null,0,0,{"$error":"#N/A"},null,{"$error":"#N/A"},24166]
[null,"2018-08-01",{"$f":"IFERROR(IF(GETPIVOTDATA(\"Value\",Pivots!$A$6,\"Month\",$B85,\"Delay reason\",$C$20)=0,\"\",GETPIVOTDATA(\"Value\",Pivots!$A$6,\"Month\",$B85,\"Delay reason\",$C$20)),NA())","v":24797},24797,null,null,25073.360000000001,28788.271666666667,21358.448333333334,null,null,null,null,"2018-08-01",631,1396.5833333333333,3714.9116666666669,4566.8274999999994,null,null,null,null,{"$f":"IF($D$76>5,NA(),IF(D85>H85,MAX(W$78:$W84)+1,0))","v":0},{"$f":"IF($D$76>5,NA(),IF(D85<I85,MAX(W$78:$W85)+1,0))","v":0},{"$error":"#N/A"},{"$error":"#N/A"},0,0,{"$error":"#N/A"},null,1,1,24797,null,1,0,{"$error":"#N/A"},null,0,0,{"$error":"#N/A"},null,{"$error":"#N/A"},24797]
[null,"2018-09-01",{"$f":"IFERROR(IF(GETPIVOTDATA(\"Value\",Pivots!$A$6,\"Month\",$B86,\"Delay reason\",$C$20)=0,\"\",GETPIVOTDATA(\"Value\",Pivots!$A$6,\"Month\",$B86,\"Delay reason\",$C$20)),NA())","v":22400},22400,null,null,25073.360000000001,28788.271666666667,21358.448333333334,null,null,null,null,"2018-09-01",2397,1396.5833333333333,3714.9116666666669,4566.8274999999994,null,null,null,null,{"$f":"IF($D$76>5,NA(),IF(D86>H86,MAX(W$78:$W85)+1,0))","v":0},{"$f":"IF($D$76>5,NA(),IF(D86<I86,MAX(W$78:$W86)+1,0))","v":0},{"$error":"#N/A"},{"$error":"#N/A"},0,0,{"$error":"#N/A"},null,1,1,22400,null,0,0,{"$error":"#N/A"},null,1,0,{"$error":"#N/A"},null,{"$error":"#N/A"},22400]
[null,"2018-10-01",{"$f":"IFERROR(IF(GETPIVOTDATA(\"Value\",Pivots!$A$6,\"Month\",$B87,\"Delay reason\",$C$20)=0,\"\",GETPIVOTDATA(\"Value\",Pivots!$A$6,\"Month\",$B87,\"Delay reason\",$C$20)),NA())","v":22411},22411,null,null,25073.360000000001,28788.271666666667,21358.448333333334,null,null,null,null,"2018-10-01",11,1396.5833333333333,3714.9116666666669,4566.8274999999994,null,null,null,null,{"$f":"IF($D$76>5,NA(),IF(D87>H87,MAX(W$78:$W86)+1,0))","v":0},{"$f":"IF($D$76>5,NA(),IF(D87<I87,MAX(W$78:$W87)+1,0))","v":0},{"$error":"#N/A"},{"$error":"#N/A"},0,0,{"$error":"#N/A"},null,1,1,22411,null,1,0,{"$error":"#N/A"},null,0,0,{"$error":"#N/A"},null,{"$error":"#N/A"},22411]
[null,"2018-11-01",{"$f":"IFERROR(IF(GETPIVOTDATA(\"Value\",Pivots!$A$6,\"Month\",$B88,\"Delay reason\",$C$20)=0,\"\",GETPIVOTDATA(\"Value\",Pivots!$A$6,\"Month\",$B88,\"Delay reason\",$C$20)),NA())","v":21587},21587,null,null,25073.360000000001,28788.271666666667,21358.448333333334,null,null,null,null,"2018-11-01",824,1396.5833333333333,3714.9116666666669,4566.8274999999994,null,null,null,null,{"$f":"IF($D$76>5,NA(),IF(D88>H88,MAX(W$78:$W87)+1,0))","v":0},{"$f":"IF($D$76>5,NA(),IF(D88<I88,MAX(W$78:$W88)+1,0))","v":0},{"$error":"#N/A"},{"$error":"#N/A"},0,0,{"$error":"#N/A"},null,1,1,21587,null,0,0,{"$error":"#N/A"},null,1,0,{"$error":"#N/A"},null,{"$error":"#N/A"},21587]
[null,"2018-12-01",{"$f":"IFERROR(IF(GETPIVOTDATA(\"Value\",Pivots!$A$6,\"Month\",$B89,\"Delay reason\",$C$20)=0,\"\",GETPIVOTDATA(\"Value\",Pivots!$A$6,\"Month\",$B89,\"Delay reason\",$C$20)),NA())","v":21361},21361,null,null,25073.360000000001,28788.271666666667,21358.448333333334,null,null,null,null,"2018-12-01",226,1396.5833333333333,3714.9116666666669,4566.8274999999994,null,null,null,null,{"$f":"IF($D$76>5,NA(),IF(D89>H89,MAX(W$78:$W88)+1,0))","v":0},{"$f":"IF($D$76>5,NA(),IF(D89<I89,MAX(W$78:$W89)+1,0))","v":0},{"$error":"#N/A"},{"$error":"#N/A"},0,0,{"$error":"#N/A"},null,1,1,21361,null,0,0,{"$error":"#N/A"},null,1,0,{"$error":"#N/A"},null,{"$error":"#N/A"},21361]
[null,"2019-01-01",{"$f":"IFERROR(IF(GETPIVOTDATA(\"Value\",Pivots!$A$6,\"Month\",$B90,\"Delay reason\",$C$20)=0,\"\",GETPIVOTDATA(\"Value\",Pivots!$A$6,\"Month\",$B90,\"Delay reason\",$C$20)),NA())","v":24403},24403,null,null,25073.360000000001,28788.271666666667,21358.448333333334,null,null,null,null,"2019-01-01",3042,1396.5833333333333,3714.9116666666669,4566.8274999999994,null,null,null,null,{"$f":"IF($D$76>5,NA(),IF(D90>H90,MAX(W$78:$W89)+1,0))","v":0},{"$f":"IF($D$76>5,NA(),IF(D90<I90,MAX(W$78:$W90)+1,0))","v":0},{"$error":"#N/A"},{"$error":"#N/A"},0,0,{"$error":"#N/A"},null,1,1,24403,null,1,0,{"$error":"#N/A"},null,0,0,{"$error":"#N/A"},null,{"$error":"#N/A"},24403]
[null,"2019-02-01",{"$f":"IFERROR(IF(GETPIVOTDATA(\"Value\",Pivots!$A$6,\"Month\",$B91,\"Delay reason\",$C$20)=0,\"\",GETPIVOTDATA(\"Value\",Pivots!$A$6,\"Month\",$B91,\"Delay reason\",$C$20)),NA())","v":24289},24289,null,null,25073.360000000001,28788.271666666667,21358.448333333334,null,null,null,null,"2019-02-01",114,1396.5833333333333,3714.9116666666669,4566.8274999999994,null,null,null,null,{"$f":"IF($D$76>5,NA(),IF(D91>H91,MAX(W$78:$W90)+1,0))","v":0},{"$f":"IF($D$76>5,NA(),IF(D91<I91,MAX(W$78:$W91)+1,0))","v":0},{"$error":"#N/A"},{"$error":"#N/A"},0,0,{"$error":"#N/A"},null,1,1,24289,null,0,0,{"$error":"#N/A"},null,1,0,{"$error":"#N/A"},null,{"$error":"#N/A"},24289]
[null,"2019-03-01",{"$f":"IFERROR(IF(GETPIVOTDATA(\"Value\",Pivots!$A$6,\"Month\",$B92,\"Delay reason\",$C$20)=0,\"\",GETPIVOTDATA(\"Value\",Pivots!$A$6,\"Month\",$B92,\"Delay reason\",$C$20)),NA())","v":26458},26458,null,null,25073.360000000001,28788.271666666667,21358.448333333334,null,null,null,null,"2019-03-01",2169,1396.5833333333333,3714.9116666666669,4566.8274999999994,null,null,null,null,{"$f":"IF($D$76>5,NA(),IF(D92>H92,MAX(W$78:$W91)+1,0))","v":0},{"$f":"IF($D$76>5,NA(),IF(D92<I92,MAX(W$78:$W92)+1,0))","v":0},{"$error":"#N/A"},{"$error":"#N/A"},1,0,{"$error":"#N/A"},null,0,0,{"$error":"#N/A"},null,1,0,{"$error":"#N/A"},null,0,0,{"$error":"#N/A"},null,{"$error":"#N/A"},{"$error":"#N/A"}]
[null,"2019-04-01",{"$f":"IFERROR(IF(GETPIVOTDATA(\"Value\",Pivots!$A$6,\"Month\",$B93,\"Delay reason\",$C$20)=0,\"\",GETPIVOTDATA(\"Value\",Pivots!$A$6,\"Month\",$B93,\"Delay reason\",$C$20)),NA())","v":25624},25624,null,null,25073.360000000001,28788.271666666667,21358.448333333334,null,null,null,null,"2019-04-01",834,1396.5833333333333,3714.9116666666669,4566.8274999999994,null,null,null,null,{"$f":"IF($D$76>5,NA(),IF(D93>H93,MAX(W$78:$W92)+1,0))","v":0},{"$f":"IF($D$76>5,NA(),IF(D93<I93,MAX(W$78:$W93)+1,0))","v":0},{"$error":"#N/A"},{"$error":"#N/A"},1,0,{"$error":"#N/A"},null,0,0,{"$error":"#N/A"},null,0,0,{"$error":"#N/A"},null,1,0,{"$error":"#N/A"},null,{"$error":"#N/A"},{"$error":"#N/A"}]
[null,"2019-05-01",{"$f":"IFERROR(IF(GETPIVOTDATA(\"Value\",Pivots!$A$6,\"Month\",$B94,\"Delay reason\",$C$20)=0,\"\",GETPIVOTDATA(\"Value\",Pivots!$A$6,\"Month\",$B94,\"Delay reason\",$C$20)),NA())","v":26330},26330,null,null,25073.360000000001,28788.271666666667,21358.448333333334,null,null,null,null,"2019-05-01",706,1396.5833333333333,3714.9116666666669,4566.8274999999994,null,null,null,null,{"$f":"IF($D$76>5,NA(),IF(D94>H94,MAX(W$78:$W93)+1,0))","v":0},{"$f":"IF($D$76>5,NA(),IF(D94<I94,MAX(W$78:$W94)+1,0))","v":0},{"$error":"#N/A"},{"$error":"#N/A"},1,0,{"$error":"#N/A"},null,0,0,{"$error":"#N/A"},null,1,0,{"$error":"#N/A"},null,0,0,{"$error":"#N/A"},null,{"$error":"#N/A"},{"$error":"#N/A"}]
[null,"2019-06-01",{"$f":"IFERROR(IF(GETPIVOTDATA(\"Value\",Pivots!$A$6,\"Month\",$B95,\"Delay reason\",$C$20)=0,\"\",GETPIVOTDATA(\"Value\",Pivots!$A$6,\"Month\",$B95,\"Delay reason\",$C$20)),NA())","v":24777},24777,null,null,25073.360000000001,28788.271666666667,21358.448333333334,null,null,null,null,"2019-06-01",1553,1396.5833333333333,3714.9116666666669,4566.8274999999994,null,null,null,null,{"$f":"IF($D$76>5,NA(),IF(D95>H95,MAX(W$78:$W94)+1,0))","v":0},{"$f":"IF($D$76>5,NA(),IF(D95<I95,MAX(W$78:$W95)+1,0))","v":0},{"$error":"#N/A"},{"$error":"#N/A"},0,0,{"$error":"#N/A"},null,1,0,{"$error":"#N/A"},null,0,0,{"$error":"#N/A"},null,1,0,{"$error":"#N/A"},null,{"$error":"#N/A"},{"$error":"#N/A"}]
[null,"2019-07-01",{"$f":"IFERROR(IF(GETPIVOTDATA(\"Value\",Pivots!$A$6,\"Month\",$B96,\"Delay reason\",$C$20)=0,\"\",GETPIVOTDATA(\"Value\",Pivots!$A$6,\"Month\",$B96,\"Delay reason\",$C$20)),NA())","v":25100},25100,null,null,25073.360000000001,28788.271666666667,21358.448333333334,null,null,null,null,"2019-07-01",323,1396.5833333333333,3714.9116666666669,4566.8274999999994,null,null,null,null,{"$f":"IF($D$76>5,NA(),IF(D96>H96,MAX(W$78:$W95)+1,0))","v":0},{"$f":"IF($D$76>5,NA(),IF(D96<I96,MAX(W$78:$W96)+1,0))","v":0},{"$error":"#N/A"},{"$error":"#N/A"},1,0,{"$error":"#N/A"},null,0,0,{"$error":"#N/A"},null,1,0,{"$error":"#N/A"},null,0,0,{"$error":"#N/A"},null,{"$error":"#N/A"},{"$error":"#N/A"}]
[null,"2019-08-01",{"$f":"IFERROR(IF(GETPIVOTDATA(\"Value\",Pivots!$A$6,\"Month\",$B97,\"Delay reason\",$C$20)=0,\"\",GETPIVOTDATA(\"Value\",Pivots!$A$6,\"Month\",$B97,\"Delay reason\",$C$20)),NA())","v":24475},24475,null,null,25073.360000000001,28788.271666666667,21358.448333333334,null,null,null,null,"2019-08-01",625,1396.5833333333333,3714.9116666666669,4566.8274999999994,null,null,null,null,{"$f":"IF($D$76>5,NA(),IF(D97>H97,MAX(W$78:$W96)+1,0))","v":0},{"$f":"IF($D$76>5,NA(),IF(D97<I97,MAX(W$78:$W97)+1,0))","v":0},{"$error":"#N/A"},{"$error":"#N/A"},0,0,{"$error":"#N/A"},null,1,0,{"$error":"#N/A"},null,0,0,{"$error":"#N/A"},null,1,0,{"$error":"#N/A"},null,{"$error":"#N/A"},{"$error":"#N/A"}]
[null,"2019-09-01",{"$f":"IFERROR(IF(GETPIVOTDATA(\"Value\",Pivots!$A$6,\"Month\",$B98,\"Delay reason\",$C$20)=0,\"\",GETPIVOTDATA(\"Value\",Pivots!$A$6,\"Month\",$B98,\"Delay reason\",$C$20)),NA())","v":24587},24587,null,null,25073.360000000001,28788.271666666667,21358.448333333334,null,null,null,null,"2019-09-01",112,1396.5833333333333,3714.9116666666669,4566.8274999999994,null,null,null,null,{"$f":"IF($D$76>5,NA(),IF(D98>H98,MAX(W$78:$W97)+1,0))","v":0},{"$f":"IF($D$76>5,NA(),IF(D98<I98,MAX(W$78:$W98)+1,0))","v":0},{"$error":"#N/A"},{"$error":"#N/A"},0,0,{"$error":"#N/A"},null,1,0,{"$error":"#N/A"},null,1,0,{"$error":"#N/A"},null,0,0,{"$error":"#N/A"},null,{"$error":"#N/A"},{"$error":"#N/A"}]
[null,"2019-10-01",{"$f":"IFERROR(IF(GETPIVOTDATA(\"Value\",Pivots!$A$6,\"Month\",$B99,\"Delay reason\",$C$20)=0,\"\",GETPIVOTDATA(\"Value\",Pivots!$A$6,\"Month\",$B99,\"Delay reason\",$C$20)),NA())","v":26023},26023,null,null,25073.360000000001,28788.271666666667,21358.448333333334,null,null,null,null,"2019-10-01",1436,{"$f":"IF(O99=\"\",P98,AVERAGE(IF($O$79:$O$103<>\"\",$O$79:$O$103)))","v":1396.5833333333333},3714.9116666666669,4566.8274999999994,null,null,null,null,{"$f":"IF($D$76>5,NA(),IF(D99>H99,MAX(W$78:$W98)+1,0))","v":0},{"$f":"IF($D$76>5,NA(),IF(D99<I99,MAX(W$78:$W99)+1,0))","v":0},{"$error":"#N/A"},{"$error":"#N/A"},1,0,{"$error":"#N/A"},null,0,0,{"$error":"#N/A"},null,1,0,{"$error":"#N/A"},null,0,0,{"$error":"#N/A"},null,{"$error":"#N/A"},{"$error":"#N/A"}]
[null,"2019-11-01",{"$f":"IFERROR(IF(GETPIVOTDATA(\"Value\",Pivots!$A$6,\"Month\",$B100,\"Delay reason\",$C$20)=0,\"\",GETPIVOTDATA(\"Value\",Pivots!$A$6,\"Month\",$B100,\"Delay reason\",$C$20)),NA())","v":25343},25343,null,null,25073.360000000001,28788.271666666667,21358.448333333334,null,null,null,null,"2019-11-01",680,1396.5833333333333,3714.9116666666669,4566.8274999999994,null,null,null,null,{"$f":"IF($D$76>5,NA(),IF(D100>H100,MAX(W$78:$W99)+1,0))","v":0},{"$f":"IF($D$76>5,NA(),IF(D100<I100,MAX(W$78:$W100)+1,0))","v":0},{"$error":"#N/A"},{"$error":"#N/A"},1,{"$f":"IFERROR(IF(AND(AB99=1,AA100=1),1,IF(SUM(AA100:AA103)>=7,1,0)),NA())","v":0},{"$f":"IF(AB100=0,NA(),C100)","v":{"$error":"#N/A"}},null,0,{"$f":"IFERROR(IF(AND(AF99=1,AE100=1),1,IF(SUM(AE100:AE103)>=7,1,0)),NA())","v":0},{"$f":"IF(AF100=0,NA(),C100)","v":{"$error":"#N/A"}},null,0,0,{"$error":"#N/A"},null,1,0,{"$error":"#N/A"},null,{"$error":"#N/A"},{"$error":"#N/A"}]
[null,"2019-12-01",{"$f":"IFERROR(IF(GETPIVOTDATA(\"Value\",Pivots!$A$6,\"Month\",$B101,\"Delay reason\",$C$20)=0,\"\",GETPIVOTDATA(\"Value\",Pivots!$A$6,\"Month\",$B101,\"Delay reason\",$C$20)),NA())","v":25704},25704,null,null,25073.360000000001,28788.271666666667,21358.448333333334,null,null,null,null,"2019-12-01",361,1396.5833333333333,3714.9116666666669,4566.8274999999994,null,null,null,null,{"$f":"IF($D$76>5,NA(),IF(D101>H101,MAX(W$78:$W100)+1,0))","v":0},{"$f":"IF($D$76>5,NA(),IF(D101<I101,MAX(W$78:$W101)+1,0))","v":0},{"$error":"#N/A"},{"$error":"#N/A"},1,{"$f":"IFERROR(IF(AND(AB100=1,AA101=1),1,IF(SUM(AA101:AA103)>=7,1,0)),NA())","v":0},{"$f":"IF(AB101=0,NA(),C101)","v":{"$error":"#N/A"}},null,0,{"$f":"IFERROR(IF(AND(AF100=1,AE101=1),1,IF(SUM(AE101:AE103)>=7,1,0)),NA())","v":0},{"$f":"IF(AF101=0,NA(),C101)","v":{"$error":"#N/A"}},null,1,0,{"$error":"#N/A"},null,0,0,{"$error":"#N/A"},null,{"$error":"#N/A"},{"$error":"#N/A"}]
[null,"2020-01-01",{"$f":"IFERROR(IF(GETPIVOTDATA(\"Value\",Pivots!$A$6,\"Month\",$B102,\"Delay reason\",$C$20)=0,\"\",GETPIVOTDATA(\"Value\",Pivots!$A$6,\"Month\",$B102,\"Delay reason\",$C$20)),NA())","v":29825},29825,null,null,25073.360000000001,28788.271666666667,21358.448333333334,null,null,null,null,"2020-01-01",4121,1396.5833333333333,3714.9116666666669,4566.8274999999994,null,null,null,null,{"$f":"IF($D$76>5,NA(),IF(D102>H102,MAX(W$78:$W101)+1,0))","v":2},{"$f":"IF($D$76>5,NA(),IF(D102<I102,MAX(W$78:$W102)+1,0))","v":0},29825,{"$error":"#N/A"},1,{"$f":"IFERROR(IF(AND(AB101=1,AA102=1),1,IF(SUM(AA102:AA108)>=7,1,0)),NA())","v":0},{"$error":"#N/A"},null,0,{"$f":"IFERROR(IF(AND(AF101=1,AE102=1),1,IF(SUM(AE102:AE103)>=7,1,0)),NA())","v":0},{"$error":"#N/A"},null,1,0,{"$error":"#N/A"},null,0,0,{"$error":"#N/A"},null,29825,{"$error":"#N/A"}]
[null,"2020-02-01",{"$f":"IFERROR(IF(GETPIVOTDATA(\"Value\",Pivots!$A$6,\"Month\",$B103,\"Delay reason\",$C$20)=0,\"\",GETPIVOTDATA(\"Value\",Pivots!$A$6,\"Month\",$B103,\"Delay reason\",$C$20)),NA())","v":28717},28717,null,null,25073.360000000001,28788.271666666667,21358.448333333334,null,null,null,null,"2020-02-01",1108,{"$f":"IF(O103=\"\",P102,AVERAGE(IF($O$79:$O$103<>\"\",$O$79:$O$103)))","v":1396.5833333333333},{"$f":"IF(ISERROR((P103*2.66)),Q104,(P103*2.66))","v":3714.9116666666669},4566.8274999999994,null,null,null,null,{"$f":"IF($D$76>5,NA(),IF(D103>H103,MAX(W$78:$W102)+1,0))","v":0},{"$f":"IF($D$76>5,NA(),IF(D103<I103,MAX(W$78:$W103)+1,0))","v":0},{"$error":"#N/A"},{"$error":"#N/A"},{"$f":"IFERROR(IF($D$76>5,NA(), IF(D103>G103,1,0)),0)","v":1},{"$f":"IFERROR(IF(AND(AB102=1,AA103=1),1,IF(SUM(AA103)>=7,1,0)),NA())","v":0},{"$error":"#N/A"},null,0,{"$f":"IFERROR(IF(AND(AF102=1,AE103=1),1,IF(SUM(AE103)>=7,1,0)),NA())","v":0},{"$error":"#N/A"},null,{"$f":"IF($D$76>5,NA(),IF(D103>D102,1,0))","v":0},0,{"$error":"#N/A"},null,1,0,{"$error":"#N/A"},null,{"$error":"#N/A"},{"$error":"#N/A"}]
[null,null,null,"Count IF data point is zero"]
[null,{"$f":"C21","v":"Dii) Awaiting nursing home placement or availability"},null,{"$f":"COUNTIF(D108:D132,0)","v":0}]
[null,{"$f":"B37","v":5},{"$f":"ROW()","v":106},null,null,null,null,"Upper","Lower",null,null,null,null,"Date","Difference",null,"Sigma",null,null,null,null,null,"> 3","< 3 ",null,null,"7 points above/below mean",null,null,null,null,null,null,null,"Trend up/down",null,null,null,null,null,null,null,"chart 3"]
[null,"ID (Week no.)","Plot data","Data",null,null,"Mean","Control limits ","control limit (-3)",null,null,null,null,null,"For. Roll avg","Cumul. Moving Avg.","2.66* MR","3.27*MR",null,null,null,null,"Count","Count","Above 3 sigma","Below 3 sigma","7 points > mean","Count of 7point ","7 points above mean",null,"7 points <mean","Count of 7 point ","6 points below mean",null,"Trend up",null,null,null,"Trend Down",null,null,null,"Concern","Improvement"]
[null,{"$f":"D8","v":"2018-02-01"},{"$f":"IFERROR(IF(GETPIVOTDATA(\"Value\",Pivots!$A$6,\"Month\",$B108,\"Delay reason\",$C$21)=0,\"\",GETPIVOTDATA(\"Value\",Pivots!$A$6,\"Month\",$B108,\"Delay reason\",$C$21)),NA())","v":19461},{"$f":"IFERROR(IF(C108=\"\",0,C108),\"\")","v":19461},null,null,{"$f":"AVERAGE($D$108:$D$132)","v":19334.84},{"$f":"IF($D$105>5,NA(),IF(D108=\"\",H107,G108+Q108))","v":21670.209166666667},{"$f":"IF($D$105>5,NA(),IF(D108=\"\",I107,G108-Q108))","v":16999.470833333333},null,null,null,null,{"$f":"B108","v":"2018-02-01"},null,{"$f":"IF(O108=\"\",P107,AVERAGE(IF($O$108:$O$132<>\"\",$O$108:$O$132)))","v":"Cumul. Moving Avg."},{"$f":"Q109","v":2335.3691666666668},{"$f":"R109","v":2870.9237499999999},null,null,null,null,{"$f":"IF($D$105>5,NA(),IF(D108>H108,MAX(W$107:$W107)+1,0))","v":0},{"$f":"IF($D$105>5,NA(),IF(D108<I108,MAX(W$107:$W107)+1,0))","v":0},{"$f":"IF(W108>0,C108,NA())","v":{"$error":"#N/A"}},{"$f":"IF(X108>0,D108,NA())","v":{"$error":"#N/A"}},{"$f":"IFERROR(IF($D$105>5,NA(), IF(D108>G108,1,0)),0)","v":1},{"$f":"IFERROR(IF(AND(AB107=1,AA108=1),1,IF(SUM(AA108:AA114)>=7,1,0)),NA())","v":0},{"$f":"IF(AB108=0,NA(),C108)","v":{"$error":"#N/A"}},null,{"$f":"IFERROR(IF($D$105>5,NA(), IF(D108<G108,1,0)),0)","v":0},{"$f":"IFERROR(IF(AND(AF107=1,AE108=1),1,IF(SUM(AE108:AE114)>=7,1,0)),NA())","v":0},{"$f":"IF(AF108=0,NA(),C108)","v":{"$error":"#N/A"}},null,{"$f":"IF($D$105>5,NA(),IF(D108>D107,1,0))","v":0},{"$f":"IFERROR(IF(AND(AJ107=1,AI108=1),1,IF(SUM(AI108:AI114)>=7,1,0)),NA())","v":0},{"$f":"IF(AJ108=0,NA(),C108)","v":{"$error":"#N/A"}},null,{"$f":"IF($D$105>5,NA(),IF(D108<D107,1,0))","v":1},{"$f":"IFERROR(IF(AND(AN107=1,AM108=1),1,IF(SUM(AM108:AM114)>=7,1,0)),NA())","v":0},{"$f":"IF(AN108=0,NA(),C108)","v":{"$error":"#N/A"}},null,{"$f":"IF(OR(W108>0,AB108>0,AJ108>0),C108,NA())","v":{"$error":"#N/A"}},{"$f":"IF(OR(X108>0,AF108>0,AN108>0),D108,NA())","v":{"$error":"#N/A"}}]
[null,{"$f":"IF(DAY(B108+31)=1,B108+31,B108+31-DAY(B108+31)+1)","v":"2018-03-01"},{"$f":"IFERROR(IF(GETPIVOTDATA(\"Value\",Pivots!$A$6,\"Month\",$B109,\"Delay reason\",$C$21)=0,\"\",GETPIVOTDATA(\"Value\",Pivots!$A$6,\"Month\",$B109,\"Delay reason\",$C$21)),NA())","v":20569},{"$f":"IFERROR(IF(C109=\"\",0,C109),\"\")","v":20569},null,null,{"$f":"AVERAGE($D$108:$D$132)","v":19334.84},{"$f":"IF($D$105>5,NA(),IF(D109=\"\",H108,G109+Q109))","v":21670.209166666667},{"$f":"IF($D$105>5,NA(),IF(D109=\"\",I108,G109-Q109))","v":16999.470833333333},null,null,null,null,{"$f":"B109","v":"2018-03-01"},{"$f":"IF(D108=\"\",\"\",IF(D109=\"\",\"\",ABS(D108-D109)))","v":1108},877.95833333333337,{"$f":"IF(ISERROR((P109*2.66)),Q110,(P109*2.66))","v":2335.3691666666668},{"$f":"$P109*3.27","v":2870.9237499999999},null,null,null,null,{"$f":"IF($D$105>5,NA(),IF(D109>H109,MAX(W$107:$W108)+1,0))","v":0},{"$f":"IF($D$105>5,NA(),IF(D109<I109,MAX(W$107:$W108)+1,0))","v":0},{"$f":"IF(W109>0,C109,NA())","v":{"$error":"#N/A"}},{"$f":"IF(X109>0,D109,NA())","v":{"$error":"#N/A"}},{"$f":"IFERROR(IF($D$105>5,NA(), IF(D109>G109,1,0)),0)","v":1},{"$f":"IFERROR(IF(AND(AB108=1,AA109=1),1,IF(SUM(AA109:AA115)>=7,1,0)),NA())","v":0},{"$f":"IF(AB109=0,NA(),C109)","v":{"$error":"#N/A"}},null,{"$f":"IFERROR(IF($D$105>5,NA(), IF(D109<G109,1,0)),0)","v":0},{"$f":"IFERROR(IF(AND(AF108=1,AE109=1),1,IF(SUM(AE109:AE115)>=7,1,0)),NA())","v":0},{"$f":"IF(AF109=0,NA(),C109)","v":{"$error":"#N/A"}},null,{"$f":"IF($D$105>5,NA(),IF(D109>D108,1,0))","v":1},{"$f":"IFERROR(IF(AND(AJ108=1,AI109=1),1,IF(SUM(AI109:AI115)>=7,1,0)),NA())","v":0},{"$f":"IF(AJ109=0,NA(),C109)","v":{"$error":"#N/A"}},null,{"$f":"IF($D$105>5,NA(),IF(D109<D108,1,0))","v":0},{"$f":"IFERROR(IF(AND(AN108=1,AM109=1),1,IF(SUM(AM109:AM115)>=7,1,0)),NA())","v":0},{"$f":"IF(AN109=0,NA(),C109)","v":{"$error":"#N/A"}},null,{"$f":"IF(OR(W109>0,AB109>0,AJ109>0),C109,NA())","v":{"$error":"#N/A"}},{"$f":"IF(OR(X109>0,AF109>0,AN109>0),D109,NA())","v":{"$error":"#N/A"}}]
[null,{"$f":"IF(DAY(B109+31)=1,B109+31,B109+31-DAY(B109+31)+1)","v":"2018-04-01"},{"$f":"IFERROR(IF(GETPIVOTDATA(\"Value\",Pivots!$A$6,\"Month\",$B110,\"Delay reason\",$C$21)=0,\"\",GETPIVOTDATA(\"Value\",Pivots!$A$6,\"Month\",$B110,\"Delay reason\",$C$21)),NA())","v":19803},19803,null,null,19334.84,21670.209166666667,16999.470833333333,null,null,null,null,"2018-04-01",{"$f":"IF(D109=\"\",\"\",IF(D110=\"\",\"\",ABS(D109-D110)))","v":766},877.95833333333337,{"$f":"IF(ISERROR((P110*2.66)),Q111,(P110*2.66))","v":2335.3691666666668},{"$f":"$P110*3.27","v":2870.9237499999999},null,null,null,null,{"$f":"IF($D$105>5,NA(),IF(D110>H110,MAX(W$107:$W109)+1,0))","v":0},{"$f":"IF($D$105>5,NA(),IF(D110<I110,MAX(W$107:$W109)+1,0))","v":0},{"$error":"#N/A"},{"$error":"#N/A"},1,0,{"$error":"#N/A"},null,0,0,{"$error":"#N/A"},null,0,0,{"$f":"IF(AJ110=0,NA(),C110)","v":{"$error":"#N/A"}},null,1,0,{"$f":"IF(AN110=0,NA(),C110)","v":{"$error":"#N/A"}},null,{"$error":"#N/A"},{"$error":"#N/A"}]
[null,"2018-05-01",{"$f":"IFERROR(IF(GETPIVOTDATA(\"Value\",Pivots!$A$6,\"Month\",$B111,\"Delay reason\",$C$21)=0,\"\",GETPIVOTDATA(\"Value\",Pivots!$A$6,\"Month\",$B111,\"Delay reason\",$C$21)),NA())","v":19173},19173,null,null,19334.84,21670.209166666667,16999.470833333333,null,null,null,null,"2018-05-01",630,877.95833333333337,{"$f":"IF(ISERROR((P111*2.66)),Q112,(P111*2.66))","v":2335.3691666666668},2870.9237499999999,null,null,null,null,{"$f":"IF($D$105>5,NA(),IF(D111>H111,MAX(W$107:$W110)+1,0))","v":0},{"$f":"IF($D$105>5,NA(),IF(D111<I111,MAX(W$107:$W110)+1,0))","v":0},{"$error":"#N/A"},{"$error":"#N/A"},0,0,{"$error":"#N/A"},null,1,0,{"$error":"#N/A"},null,0,0,{"$error":"#N/A"},null,1,0,{"$error":"#N/A"},null,{"$error":"#N/A"},{"$error":"#N/A"}]
[null,"2018-06-01",{"$f":"IFERROR(IF(GETPIVOTDATA(\"Value\",Pivots!$A$6,\"Month\",$B112,\"Delay reason\",$C$21)=0,\"\",GETPIVOTDATA(\"Value\",Pivots!$A$6,\"Month\",$B112,\"Delay reason\",$C$21)),NA())","v":18511},18511,null,null,19334.84,21670.209166666667,16999.470833333333,null,null,null,null,"2018-06-01",662,877.95833333333337,{"$f":"IF(ISERROR((P112*2.66)),Q113,(P112*2.66))","v":2335.3691666666668},2870.9237499999999,null,null,null,null,{"$f":"IF($D$105>5,NA(),IF(D112>H112,MAX(W$107:$W111)+1,0))","v":0},{"$f":"IF($D$105>5,NA(),IF(D112<I112,MAX(W$107:$W111)+1,0))","v":0},{"$error":"#N/A"},{"$error":"#N/A"},0,0,{"$error":"#N/A"},null,1,0,{"$error":"#N/A"},null,0,0,{"$error":"#N/A"},null,1,0,{"$error":"#N/A"},null,{"$error":"#N/A"},{"$error":"#N/A"}]
[null,"2018-07-01",{"$f":"IFERROR(IF(GETPIVOTDATA(\"Value\",Pivots!$A$6,\"Month\",$B113,\"Delay reason\",$C$21)=0,\"\",GETPIVOTDATA(\"Value\",Pivots!$A$6,\"Month\",$B113,\"Delay reason\",$C$21)),NA())","v":19331},19331,null,null,19334.84,21670.209166666667,16999.470833333333,null,null,null,null,"2018-07-01",820,877.95833333333337,2335.3691666666668,2870.9237499999999,null,null,null,null,{"$f":"IF($D$105>5,NA(),IF(D113>H113,MAX(W$107:$W112)+1,0))","v":0},{"$f":"IF($D$105>5,NA(),IF(D113<I113,MAX(W$107:$W112)+1,0))","v":0},{"$error":"#N/A"},{"$error":"#N/A"},0,0,{"$error":"#N/A"},null,1,0,{"$error":"#N/A"},null,1,0,{"$error":"#N/A"},null,0,0,{"$error":"#N/A"},null,{"$error":"#N/A"},{"$error":"#N/A"}]
[null,"2018-08-01",{"$f":"IFERROR(IF(GETPIVOTDATA(\"Value\",Pivots!$A$6,\"Month\",$B114,\"Delay reason\",$C$21)=0,\"\",GETPIVOTDATA(\"Value\",Pivots!$A$6,\"Month\",$B114,\"Delay reason\",$C$21)),NA())","v":20672},20672,null,null,19334.84,21670.209166666667,16999.470833333333,null,null,null,null,"2018-08-01",1341,877.95833333333337,2335.3691666666668,2870.9237499999999,null,null,null,null,{"$f":"IF($D$105>5,NA(),IF(D114>H114,MAX(W$107:$W113)+1,0))","v":0},{"$f":"IF($D$105>5,NA(),IF(D114<I114,MAX(W$107:$W113)+1,0))","v":0},{"$error":"#N/A"},{"$error":"#N/A"},1,0,{"$error":"#N/A"},null,0,0,{"$error":"#N/A"},null,1,0,{"$error":"#N/A"},null,0,0,{"$error":"#N/A"},null,{"$error":"#N/A"},{"$error":"#N/A"}]
[null,"2018-09-01",{"$f":"IFERROR(IF(GETPIVOTDATA(\"Value\",Pivots!$A$6,\"Month\",$B115,\"Delay reason\",$C$21)=0,\"\",GETPIVOTDATA(\"Value\",Pivots!$A$6,\"Month\",$B115,\"Delay reason\",$C$21)),NA())","v":21063},21063,null,null,19334.84,21670.209166666667,16999.470833333333,null,null,null,null,"2018-09-01",391,877.95833333333337,2335.3691666666668,2870.9237499999999,null,null,null,null,{"$f":"IF($D$105>5,NA(),IF(D115>H115,MAX(W$107:$W114)+1,0))","v":0},{"$f":"IF($D$105>5,NA(),IF(D115<I115,MAX(W$107:$W114)+1,0))","v":0},{"$error":"#N/A"},{"$error":"#N/A"},1,0,{"$error":"#N/A"},null,0,0,{"$error":"#N/A"},null,1,0,{"$error":"#N/A"},null,0,0,{"$error":"#N/A"},null,{"$error":"#N/A"},{"$error":"#N/A"}]
[null,"2018-10-01",{"$f":"IFERROR(IF(GETPIVOTDATA(\"Value\",Pivots!$A$6,\"Month\",$B116,\"Delay reason\",$C$21)=0,\"\",GETPIVOTDATA(\"Value\",Pivots!$A$6,\"Month\",$B116,\"Delay reason\",$C$21)),NA())","v":21062},21062,null,null,19334.84,21670.209166666667,16999.470833333333,null,null,null,null,"2018-10-01",1,877.95833333333337,2335.3691666666668,2870.9237499999999,null,null,null,null,{"$f":"IF($D$105>5,NA(),IF(D116>H116,MAX(W$107:$W115)+1,0))","v":0},{"$f":"IF($D$105>5,NA(),IF(D116<I116,MAX(W$107:$W115)+1,0))","v":0},{"$error":"#N/A"},{"$error":"#N/A"},1,0,{"$error":"#N/A"},null,0,0,{"$error":"#N/A"},null,0,0,{"$error":"#N/A"},null,1,0,{"$error":"#N/A"},null,{"$error":"#N/A"},{"$error":"#N/A"}]
[null,"2018-11-01",{"$f":"IFERROR(IF(GETPIVOTDATA(\"Value\",Pivots!$A$6,\"Month\",$B117,\"Delay reason\",$C$21)=0,\"\",GETPIVOTDATA(\"Value\",Pivots!$A$6,\"Month\",$B117,\"Delay reason\",$C$21)),NA())","v":19943},19943,null,null,19334.84,21670.209166666667,16999.470833333333,null,null,null,null,"2018-11-01",1119,877.95833333333337,2335.3691666666668,2870.9237499999999,null,null,null,null,{"$f":"IF($D$105>5,NA(),IF(D117>H117,MAX(W$107:$W116)+1,0))","v":0},{"$f":"IF($D$105>5,NA(),IF(D117<I117,MAX(W$107:$W116)+1,0))","v":0},{"$error":"#N/A"},{"$error":"#N/A"},1,0,{"$error":"#N/A"},null,0,0,{"$error":"#N/A"},null,0,0,{"$error":"#N/A"},null,1,0,{"$error":"#N/A"},null,{"$error":"#N/A"},{"$error":"#N/A"}]
[null,"2018-12-01",{"$f":"IFERROR(IF(GETPIVOTDATA(\"Value\",Pivots!$A$6,\"Month\",$B118,\"Delay reason\",$C$21)=0,\"\",GETPIVOTDATA(\"Value\",Pivots!$A$6,\"Month\",$B118,\"Delay reason\",$C$21)),NA())","v":18394},18394,null,null,19334.84,21670.209166666667,16999.470833333333,null,null,null,null,"2018-12-01",1549,877.95833333333337,2335.3691666666668,2870.9237499999999,null,null,null,null,{"$f":"IF($D$105>5,NA(),IF(D118>H118,MAX(W$107:$W117)+1,0))","v":0},{"$f":"IF($D$105>5,NA(),IF(D118<I118,MAX(W$107:$W117)+1,0))","v":0},{"$error":"#N/A"},{"$error":"#N/A"},0,0,{"$error":"#N/A"},null,1,1,18394,null,0,0,{"$error":"#N/A"},null,1,0,{"$error":"#N/A"},null,{"$error":"#N/A"},18394]
[null,"2019-01-01",{"$f":"IFERROR(IF(GETPIVOTDATA(\"Value\",Pivots!$A$6,\"Month\",$B119,\"Delay reason\",$C$21)=0,\"\",GETPIVOTDATA(\"Value\",Pivots!$A$6,\"Month\",$B119,\"Delay reason\",$C$21)),NA())","v":17584},17584,null,null,19334.84,21670.209166666667,16999.470833333333,null,null,null,null,"2019-01-01",810,877.95833333333337,2335.3691666666668,2870.9237499999999,null,null,null,null,{"$f":"IF($D$105>5,NA(),IF(D119>H119,MAX(W$107:$W118)+1,0))","v":0},{"$f":"IF($D$105>5,NA(),IF(D119<I119,MAX(W$107:$W118)+1,0))","v":0},{"$error":"#N/A"},{"$error":"#N/A"},0,0,{"$error":"#N/A"},null,1,1,17584,null,0,0,{"$error":"#N/A"},null,1,0,{"$error":"#N/A"},null,{"$error":"#N/A"},17584]
[null,"2019-02-01",{"$f":"IFERROR(IF(GETPIVOTDATA(\"Value\",Pivots!$A$6,\"Month\",$B120,\"Delay reason\",$C$21)=0,\"\",GETPIVOTDATA(\"Value\",Pivots!$A$6,\"Month\",$B120,\"Delay reason\",$C$21)),NA())","v":17459},17459,null,null,19334.84,21670.209166666667,16999.470833333333,null,null,null,null,"2019-02-01",125,877.95833333333337,2335.3691666666668,2870.9237499999999,null,null,null,null,{"$f":"IF($D$105>5,NA(),IF(D120>H120,MAX(W$107:$W119)+1,0))","v":0},{"$f":"IF($D$105>5,NA(),IF(D120<I120,MAX(W$107:$W119)+1,0))","v":0},{"$error":"#N/A"},{"$error":"#N/A"},0,0,{"$error":"#N/A"},null,1,1,17459,null,0,0,{"$error":"#N/A"},null,1,0,{"$error":"#N/A"},null,{"$error":"#N/A"},17459]
[null,"2019-03-01",{"$f":"IFERROR(IF(GETPIVOTDATA(\"Value\",Pivots!$A$6,\"Month\",$B121,\"Delay reason\",$C$21)=0,\"\",GETPIVOTDATA(\"Value\",Pivots!$A$6,\"Month\",$B121,\"Delay reason\",$C$21)),NA())","v":18380},18380,null,null,19334.84,21670.209166666667,16999.470833333333,null,null,null,null,"2019-03-01",921,877.95833333333337,2335.3691666666668,2870.9237499999999,null,null,null,null,{"$f":"IF($D$105>5,NA(),IF(D121>H121,MAX(W$107:$W120)+1,0))","v":0},{"$f":"IF($D$105>5,NA(),IF(D121<I121,MAX(W$107:$W120)+1,0))","v":0},{"$error":"#N/A"},{"$error":"#N/A"},0,0,{"$error":"#N/A"},null,1,1,18380,null,1,0,{"$error":"#N/A"},null,0,0,{"$error":"#N/A"},null,{"$error":"#N/A"},18380]
[null,"2019-04-01",{"$f":"IFERROR(IF(GETPIVOTDATA(\"Value\",Pivots!$A$6,\"Month\",$B122,\"Delay reason\",$C$21)=0,\"\",GETPIVOTDATA(\"Value\",Pivots!$A$6,\"Month\",$B122,\"Delay reason\",$C$21)),NA())","v":17100},17100,null,null,19334.84,21670.209166666667,16999.470833333333,null,null,null,null,"2019-04-01",1280,877.95833333333337,2335.3691666666668,2870.9237499999999,null,null,null,null,{"$f":"IF($D$105>5,NA(),IF(D122>H122,MAX(W$107:$W121)+1,0))","v":0},{"$f":"IF($D$105>5,NA(),IF(D122<I122,MAX(W$107:$W121)+1,0))","v":0},{"$error":"#N/A"},{"$error":"#N/A"},0,0,{"$error":"#N/A"},null,1,1,17100,null,0,0,{"$error":"#N/A"},null,1,0,{"$error":"#N/A"},null,{"$error":"#N/A"},17100]
[null,"2019-05-01",{"$f":"IFERROR(IF(GETPIVOTDATA(\"Value\",Pivots!$A$6,\"Month\",$B123,\"Delay reason\",$C$21)=0,\"\",GETPIVOTDATA(\"Value\",Pivots!$A$6,\"Month\",$B123,\"Delay reason\",$C$21)),NA())","v":17102},17102,null,null,19334.84,21670.209166666667,16999.470833333333,null,null,null,null,"2019-05-01",2,877.95833333333337,2335.3691666666668,2870.9237499999999,null,null,null,null,{"$f":"IF($D$105>5,NA(),IF(D123>H123,MAX(W$107:$W122)+1,0))","v":0},{"$f":"IF($D$105>5,NA(),IF(D123<I123,MAX(W$107:$W122)+1,0))","v":0},{"$error":"#N/A"},{"$error":"#N/A"},0,0,{"$error":"#N/A"},null,1,1,17102,null,1,0,{"$error":"#N/A"},null,0,0,{"$error":"#N/A"},null,{"$error":"#N/A"},17102]
[null,"2019-06-01",{"$f":"IFERROR(IF(GETPIVOTDATA(\"Value\",Pivots!$A$6,\"Month\",$B124,\"Delay reason\",$C$21)=0,\"\",GETPIVOTDATA(\"Value\",Pivots!$A$6,\"Month\",$B124,\"Delay reason\",$C$21)),NA())","v":17453},17453,null,null,19334.84,21670.209166666667,16999.470833333333,null,null,null,null,"2019-06-01",351,877.95833333333337,2335.3691666666668,2870.9237499999999,null,null,null,null,{"$f":"IF($D$105>5,NA(),IF(D124>H124,MAX(W$107:$W123)+1,0))","v":0},{"$f":"IF($D$105>5,NA(),IF(D124<I124,MAX(W$107:$W123)+1,0))","v":0},{"$error":"#N/A"},{"$error":"#N/A"},0,0,{"$error":"#N/A"},null,1,1,17453,null,1,0,{"$error":"#N/A"},null,0,0,{"$error":"#N/A"},null,{"$error":"#N/A"},17453]
[null,"2019-07-01",{"$f":"IFERROR(IF(GETPIVOTDATA(\"Value\",Pivots!$A$6,\"Month\",$B125,\"Delay reason\",$C$21)=0,\"\",GETPIVOTDATA(\"Value\",Pivots!$A$6,\"Month\",$B125,\"Delay reason\",$C$21)),NA())","v":19140},19140,null,null,19334.84,21670.209166666667,16999.470833333333,null,null,null,null,"2019-07-01",1687,877.95833333333337,2335.3691666666668,2870.9237499999999,null,null,null,null,{"$f":"IF($D$105>5,NA(),IF(D125>H125,MAX(W$107:$W124)+1,0))","v":0},{"$f":"IF($D$105>5,NA(),IF(D125<I125,MAX(W$107:$W124)+1,0))","v":0},{"$error":"#N/A"},{"$error":"#N/A"},0,0,{"$error":"#N/A"},null,1,1,19140,null,1,0,{"$error":"#N/A"},null,0,0,{"$error":"#N/A"},null,{"$error":"#N/A"},19140]
[null,"2019-08-01",{"$f":"IFERROR(IF(GETPIVOTDATA(\"Value\",Pivots!$A$6,\"Month\",$B126,\"Delay reason\",$C$21)=0,\"\",GETPIVOTDATA(\"Value\",Pivots!$A$6,\"Month\",$B126,\"Delay reason\",$C$21)),NA())","v":20205},20205,null,null,19334.84,21670.209166666667,16999.470833333333,null,null,null,null,"2019-08-01",1065,877.95833333333337,2335.3691666666668,2870.9237499999999,null,null,null,null,{"$f":"IF($D$105>5,NA(),IF(D126>H126,MAX(W$107:$W125)+1,0))","v":0},{"$f":"IF($D$105>5,NA(),IF(D126<I126,MAX(W$107:$W125)+1,0))","v":0},{"$error":"#N/A"},{"$error":"#N/A"},1,1,20205,null,0,0,{"$error":"#N/A"},null,1,0,{"$error":"#N/A"},null,0,0,{"$error":"#N/A"},null,20205,{"$error":"#N/A"}]
[null,"2019-09-01",{"$f":"IFERROR(IF(GETPIVOTDATA(\"Value\",Pivots!$A$6,\"Month\",$B127,\"Delay reason\",$C$21)=0,\"\",GETPIVOTDATA(\"Value\",Pivots!$A$6,\"Month\",$B127,\"Delay reason\",$C$21)),NA())","v":19644},19644,null,null,19334.84,21670.209166666667,16999.470833333333,null,null,null,null,"2019-09-01",561,877.95833333333337,2335.3691666666668,2870.9237499999999,null,null,null,null,{"$f":"IF($D$105>5,NA(),IF(D127>H127,MAX(W$107:$W126)+1,0))","v":0},{"$f":"IF($D$105>5,NA(),IF(D127<I127,MAX(W$107:$W126)+1,0))","v":0},{"$error":"#N/A"},{"$error":"#N/A"},1,1,19644,null,0,0,{"$error":"#N/A"},null,0,0,{"$error":"#N/A"},null,1,0,{"$error":"#N/A"},null,19644,{"$error":"#N/A"}]
[null,"2019-10-01",{"$f":"IFERROR(IF(GETPIVOTDATA(\"Value\",Pivots!$A$6,\"Month\",$B128,\"Delay reason\",$C$21)=0,\"\",GETPIVOTDATA(\"Value\",Pivots!$A$6,\"Month\",$B128,\"Delay reason\",$C$21)),NA())","v":21881},21881,null,null,19334.84,21670.209166666667,16999.470833333333,null,null,null,null,"2019-10-01",2237,877.95833333333337,2335.3691666666668,2870.9237499999999,null,null,null,null,{"$f":"IF($D$105>5,NA(),IF(D128>H128,MAX(W$107:$W127)+1,0))","v":1},{"$f":"IF($D$105>5,NA(),IF(D128<I128,MAX(W$107:$W127)+1,0))","v":0},21881,{"$error":"#N/A"},1,1,21881,null,0,0,{"$error":"#N/A"},null,1,0,{"$error":"#N/A"},null,0,0,{"$error":"#N/A"},null,21881,{"$error":"#N/A"}]
[null,"2019-11-01",{"$f":"IFERROR(IF(GETPIVOTDATA(\"Value\",Pivots!$A$6,\"Month\",$B129,\"Delay reason\",$C$21)=0,\"\",GETPIVOTDATA(\"Value\",Pivots!$A$6,\"Month\",$B129,\"Delay reason\",$C$21)),NA())","v":20004},20004,null,null,19334.84,21670.209166666667,16999.470833333333,null,null,null,null,"2019-11-01",1877,877.95833333333337,2335.3691666666668,2870.9237499999999,null,null,null,null,{"$f":"IF($D$105>5,NA(),IF(D129>H129,MAX(W$107:$W128)+1,0))","v":0},{"$f":"IF($D$105>5,NA(),IF(D129<I129,MAX(W$107:$W128)+1,0))","v":0},{"$error":"#N/A"},{"$error":"#N/A"},1,{"$f":"IFERROR(IF(AND(AB128=1,AA129=1),1,IF(SUM(AA129:AA132)>=7,1,0)),NA())","v":1},{"$f":"IF(AB129=0,NA(),C129)","v":20004},null,0,{"$f":"IFERROR(IF(AND(AF128=1,AE129=1),1,IF(SUM(AE129:AE132)>=7,1,0)),NA())","v":0},{"$f":"IF(AF129=0,NA(),C129)","v":{"$error":"#N/A"}},null,0,0,{"$error":"#N/A"},null,1,0,{"$error":"#N/A"},null,20004,{"$error":"#N/A"}]
[null,"2019-12-01",{"$f":"IFERROR(IF(GETPIVOTDATA(\"Value\",Pivots!$A$6,\"Month\",$B130,\"Delay reason\",$C$21)=0,\"\",GETPIVOTDATA(\"Value\",Pivots!$A$6,\"Month\",$B130,\"Delay reason\",$C$21)),NA())","v":19344},19344,null,null,19334.84,21670.209166666667,16999.470833333333,null,null,null,null,"2019-12-01",660,877.95833333333337,2335.3691666666668,2870.9237499999999,null,null,null,null,{"$f":"IF($D$105>5,NA(),IF(D130>H130,MAX(W$107:$W129)+1,0))","v":0},{"$f":"IF($D$105>5,NA(),IF(D130<I130,MAX(W$107:$W129)+1,0))","v":0},{"$error":"#N/A"},{"$error":"#N/A"},1,{"$f":"IFERROR(IF(AND(AB129=1,AA130=1),1,IF(SUM(AA130:AA132)>=7,1,0)),NA())","v":1},{"$f":"IF(AB130=0,NA(),C130)","v":19344},null,0,{"$f":"IFERROR(IF(AND(AF129=1,AE130=1),1,IF(SUM(AE130:AE132)>=7,1,0)),NA())","v":0},{"$f":"IF(AF130=0,NA(),C130)","v":{"$error":"#N/A"}},null,0,0,{"$error":"#N/A"},null,1,0,{"$error":"#N/A"},null,19344,{"$error":"#N/A"}]
[null,"2020-01-01",{"$f":"IFERROR(IF(GETPIVOTDATA(\"Value\",Pivots!$A$6,\"Month\",$B131,\"Delay reason\",$C$21)=0,\"\",GETPIVOTDATA(\"Value\",Pivots!$A$6,\"Month\",$B131,\"Delay reason\",$C$21)),NA())","v":19641},19641,null,null,19334.84,21670.209166666667,16999.470833333333,null,null,null,null,"2020-01-01",297,877.95833333333337,2335.3691666666668,2870.9237499999999,null,null,null,null,{"$f":"IF($D$105>5,NA(),IF(D131>H131,MAX(W$107:$W130)+1,0))","v":0},{"$f":"IF($D$105>5,NA(),IF(D131<I131,MAX(W$107:$W130)+1,0))","v":0},{"$error":"#N/A"},{"$error":"#N/A"},1,{"$f":"IFERROR(IF(AND(AB130=1,AA131=1),1,IF(SUM(AA131:AA137)>=7,1,0)),NA())","v":1},19641,null,0,{"$f":"IFERROR(IF(AND(AF130=1,AE131=1),1,IF(SUM(AE131:AE132)>=7,1,0)),NA())","v":0},{"$error":"#N/A"},null,1,0,{"$error":"#N/A"},null,0,0,{"$error":"#N/A"},null,19641,{"$error":"#N/A"}]
[null,"2020-02-01",{"$f":"IFERROR(IF(GETPIVOTDATA(\"Value\",Pivots!$A$6,\"Month\",$B132,\"Delay reason\",$C$21)=0,\"\",GETPIVOTDATA(\"Value\",Pivots!$A$6,\"Month\",$B132,\"Delay reason\",$C$21)),NA())","v":20452},20452,null,null,19334.84,21670.209166666667,16999.470833333333,null,null,null,null,"2020-02-01",811,{"$f":"IF(O132=\"\",P131,AVERAGE(IF($O$108:$O$132<>\"\",$O$108:$O$132)))","v":877.95833333333337},{"$f":"IF(ISERROR((P132*2.66)),Q133,(P132*2.66))","v":2335.3691666666668},2870.9237499999999,null,null,null,null,{"$f":"IF($D$105>5,NA(),IF(D132>H132,MAX(W$107:$W131)+1,0))","v":0},{"$f":"IF($D$105>5,NA(),IF(D132<I132,MAX(W$107:$W131)+1,0))","v":0},{"$error":"#N/A"},{"$error":"#N/A"},1,{"$f":"IFERROR(IF(AND(AB131=1,AA132=1),1,IF(SUM(AA132)>=7,1,0)),NA())","v":1},20452,null,0,{"$f":"IFERROR(IF(AND(AF131=1,AE132=1),1,IF(SUM(AE132)>=7,1,0)),NA())","v":0},{"$error":"#N/A"},null,1,0,{"$error":"#N/A"},null,0,0,{"$error":"#N/A"},null,20452,{"$error":"#N/A"}]
[null,null,null,"Count IF data point is zero"]
[null,{"$f":"C22","v":"A) Awaiting completion of assessment"},null,{"$f":"COUNTIF(D137:D161,0)","v":0}]
[null,{"$f":"B38","v":6},{"$f":"ROW()","v":135},null,null,null,null,"Upper","Lower",null,null,null,null,"Date","Difference",null,"Sigma",null,null,null,null,null,"> 3","< 3 ",null,null,"7 points above/below mean",null,null,null,null,null,null,null,"Trend up/down",null,null,null,null,null,null,null,"chart 4"]
[null,"ID (Week no.)","Plot data","Data",null,null,"Mean","Control limits ","control limit (-3)",null,null,null,null,null,"For. Roll avg","Cumul. Moving Avg.","2.66* MR","3.27*MR",null,null,null,null,"Count","Count","Above 3 sigma","Below 3 sigma","7 points > mean","Count of 7point ","7 points above mean",null,"7 points <mean","Count of 7 point ","6 points below mean",null,"Trend up",null,null,null,"Trend Down",null,null,null,"Concern","Improvement"]
[null,{"$f":"D8","v":"2018-02-01"},{"$f":"IFERROR(IF(GETPIVOTDATA(\"Value\",Pivots!$A$6,\"Month\",$B137,\"Delay reason\",$C$22)=0,\"\",GETPIVOTDATA(\"Value\",Pivots!$A$6,\"Month\",$B137,\"Delay reason\",$C$22)),NA())","v":17748},{"$f":"IFERROR(IF(C137=\"\",0,C137),\"\")","v":17748},null,null,{"$f":"AVERAGE($D$137:$D$161)","v":16886.080000000002},{"$f":"IF($D$134>5,NA(),IF(D137=\"\",H136,G137+Q137))","v":20059.01666666667},{"$f":"IF($D$134>5,NA(),IF(D137=\"\",I136,G137-Q137))","v":13713.143333333335},null,null,null,null,{"$f":"B137","v":"2018-02-01"},null,{"$f":"IF(O137=\"\",P136,AVERAGE(IF($O$137:$O$161<>\"\",$O$137:$O$161)))","v":"Cumul. Moving Avg."},{"$f":"Q138","v":3172.9366666666665},{"$f":"R138","v":3900.5649999999996},null,null,null,null,{"$f":"IF($D$134>5,NA(),IF(D137>H137,MAX(W$136:$W136)+1,0))","v":0},{"$f":"IF($D$134>5,NA(),IF(D137<I137,MAX(W$136:$W136)+1,0))","v":0},{"$f":"IF(W137>0,C137,NA())","v":{"$error":"#N/A"}},{"$f":"IF(X137>0,D137,NA())","v":{"$error":"#N/A"}},{"$f":"IFERROR(IF($D$134>5,NA(), IF(D137>G137,1,0)),0)","v":1},{"$f":"IFERROR(IF(AND(AB136=1,AA137=1),1,IF(SUM(AA137:AA143)>=7,1,0)),NA())","v":0},{"$f":"IF(AB137=0,NA(),C137)","v":{"$error":"#N/A"}},null,{"$f":"IFERROR(IF($D$134>5,NA(), IF(D137<G137,1,0)),0)","v":0},{"$f":"IFERROR(IF(AND(AF136=1,AE137=1),1,IF(SUM(AE137:AE143)>=7,1,0)),NA())","v":0},{"$f":"IF(AF137=0,NA(),C137)","v":{"$error":"#N/A"}},null,{"$f":"IF($D$134>5,NA(),IF(D137>D136,1,0))","v":0},{"$f":"IFERROR(IF(AND(AJ136=1,AI137=1),1,IF(SUM(AI137:AI143)>=7,1,0)),NA())","v":0},{"$f":"IF(AJ137=0,NA(),C137)","v":{"$error":"#N/A"}},null,{"$f":"IF($D$134>5,NA(),IF(D137<D136,1,0))","v":1},{"$f":"IFERROR(IF(AND(AN136=1,AM137=1),1,IF(SUM(AM137:AM143)>=7,1,0)),NA())","v":0},{"$f":"IF(AN137=0,NA(),C137)","v":{"$error":"#N/A"}},null,{"$f":"IF(OR(W137>0,AB137>0,AJ137>0),C137,NA())","v":{"$error":"#N/A"}},{"$f":"IF(OR(X137>0,AF137>0,AN137>0),D137,NA())","v":{"$error":"#N/A"}}]
[null,{"$f":"IF(DAY(B137+31)=1,B137+31,B137+31-DAY(B137+31)+1)","v":"2018-03-01"},{"$f":"IFERROR(IF(GETPIVOTDATA(\"Value\",Pivots!$A$6,\"Month\",$B138,\"Delay reason\",$C$22)=0,\"\",GETPIVOTDATA(\"Value\",Pivots!$A$6,\"Month\",$B138,\"Delay reason\",$C$22)),NA())","v":18643},{"$f":"IFERROR(IF(C138=\"\",0,C138),\"\")","v":18643},null,null,{"$f":"AVERAGE($D$137:$D$161)","v":16886.080000000002},{"$f":"IF($D$134>5,NA(),IF(D138=\"\",H137,G138+Q138))","v":20059.01666666667},{"$f":"IF($D$134>5,NA(),IF(D138=\"\",I137,G138-Q138))","v":13713.143333333335},null,null,null,null,{"$f":"B138","v":"2018-03-01"},{"$f":"IF(D137=\"\",\"\",IF(D138=\"\",\"\",ABS(D137-D138)))","v":895},1192.8333333333333,{"$f":"IF(ISERROR((P138*2.66)),Q139,(P138*2.66))","v":3172.9366666666665},{"$f":"$P138*3.27","v":3900.5649999999996},null,null,null,null,{"$f":"IF($D$134>5,NA(),IF(D138>H138,MAX(W$136:$W137)+1,0))","v":0},{"$f":"IF($D$134>5,NA(),IF(D138<I138,MAX(W$136:$W137)+1,0))","v":0},{"$f":"IF(W138>0,C138,NA())","v":{"$error":"#N/A"}},{"$f":"IF(X138>0,D138,NA())","v":{"$error":"#N/A"}},{"$f":"IFERROR(IF($D$134>5,NA(), IF(D138>G138,1,0)),0)","v":1},{"$f":"IFERROR(IF(AND(AB137=1,AA138=1),1,IF(SUM(AA138:AA144)>=7,1,0)),NA())","v":0},{"$f":"IF(AB138=0,NA(),C138)","v":{"$error":"#N/A"}},null,{"$f":"IFERROR(IF($D$134>5,NA(), IF(D138<G138,1,0)),0)","v":0},{"$f":"IFERROR(IF(AND(AF137=1,AE138=1),1,IF(SUM(AE138:AE144)>=7,1,0)),NA())","v":0},{"$f":"IF(AF138=0,NA(),C138)","v":{"$error":"#N/A"}},null,{"$f":"IF($D$134>5,NA(),IF(D138>D137,1,0))","v":1},{"$f":"IFERROR(IF(AND(AJ137=1,AI138=1),1,IF(SUM(AI138:AI144)>=7,1,0)),NA())","v":0},{"$f":"IF(AJ138=0,NA(),C138)","v":{"$error":"#N/A"}},null,{"$f":"IF($D$134>5,NA(),IF(D138<D137,1,0))","v":0},{"$f":"IFERROR(IF(AND(AN137=1,AM138=1),1,IF(SUM(AM138:AM144)>=7,1,0)),NA())","v":0},{"$f":"IF(AN138=0,NA(),C138)","v":{"$error":"#N/A"}},null,{"$f":"IF(OR(W138>0,AB138>0,AJ138>0),C138,NA())","v":{"$error":"#N/A"}},{"$f":"IF(OR(X138>0,AF138>0,AN138>0),D138,NA())","v":{"$error":"#N/A"}}]
[null,{"$f":"IF(DAY(B138+31)=1,B138+31,B138+31-DAY(B138+31)+1)","v":"2018-04-01"},{"$f":"IFERROR(IF(GETPIVOTDATA(\"Value\",Pivots!$A$6,\"Month\",$B139,\"Delay reason\",$C$22)=0,\"\",GETPIVOTDATA(\"Value\",Pivots!$A$6,\"Month\",$B139,\"Delay reason\",$C$22)),NA())","v":16858},16858,null,null,16886.080000000002,20059.01666666667,13713.143333333335,null,null,null,null,"2018-04-01",{"$f":"IF(D138=\"\",\"\",IF(D139=\"\",\"\",ABS(D138-D139)))","v":1785},1192.8333333333333,{"$f":"IF(ISERROR((P139*2.66)),Q140,(P139*2.66))","v":3172.9366666666665},{"$f":"$P139*3.27","v":3900.5649999999996},null,null,null,null,{"$f":"IF($D$134>5,NA(),IF(D139>H139,MAX(W$136:$W138)+1,0))","v":0},{"$f":"IF($D$134>5,NA(),IF(D139<I139,MAX(W$136:$W138)+1,0))","v":0},{"$error":"#N/A"},{"$error":"#N/A"},0,0,{"$error":"#N/A"},null,1,0,{"$error":"#N/A"},null,0,0,{"$f":"IF(AJ139=0,NA(),C139)","v":{"$error":"#N/A"}},null,1,0,{"$f":"IF(AN139=0,NA(),C139)","v":{"$error":"#N/A"}},null,{"$error":"#N/A"},{"$error":"#N/A"}]
[null,"2018-05-01",{"$f":"IFERROR(IF(GETPIVOTDATA(\"Value\",Pivots!$A$6,\"Month\",$B140,\"Delay reason\",$C$22)=0,\"\",GETPIVOTDATA(\"Value\",Pivots!$A$6,\"Month\",$B140,\"Delay reason\",$C$22)),NA())","v":16111},16111,null,null,16886.080000000002,20059.01666666667,13713.143333333335,null,null,null,null,"2018-05-01",747,1192.8333333333333,{"$f":"IF(ISERROR((P140*2.66)),Q141,(P140*2.66))","v":3172.9366666666665},3900.5649999999996,null,null,null,null,{"$f":"IF($D$134>5,NA(),IF(D140>H140,MAX(W$136:$W139)+1,0))","v":0},{"$f":"IF($D$134>5,NA(),IF(D140<I140,MAX(W$136:$W139)+1,0))","v":0},{"$error":"#N/A"},{"$error":"#N/A"},0,0,{"$error":"#N/A"},null,1,0,{"$error":"#N/A"},null,0,0,{"$error":"#N/A"},null,1,0,{"$error":"#N/A"},null,{"$error":"#N/A"},{"$error":"#N/A"}]
[null,"2018-06-01",{"$f":"IFERROR(IF(GETPIVOTDATA(\"Value\",Pivots!$A$6,\"Month\",$B141,\"Delay reason\",$C$22)=0,\"\",GETPIVOTDATA(\"Value\",Pivots!$A$6,\"Month\",$B141,\"Delay reason\",$C$22)),NA())","v":15083},15083,null,null,16886.080000000002,20059.01666666667,13713.143333333335,null,null,null,null,"2018-06-01",1028,1192.8333333333333,{"$f":"IF(ISERROR((P141*2.66)),Q142,(P141*2.66))","v":3172.9366666666665},3900.5649999999996,null,null,null,null,{"$f":"IF($D$134>5,NA(),IF(D141>H141,MAX(W$136:$W140)+1,0))","v":0},{"$f":"IF($D$134>5,NA(),IF(D141<I141,MAX(W$136:$W140)+1,0))","v":0},{"$error":"#N/A"},{"$error":"#N/A"},0,0,{"$error":"#N/A"},null,1,0,{"$error":"#N/A"},null,0,0,{"$error":"#N/A"},null,1,0,{"$error":"#N/A"},null,{"$error":"#N/A"},{"$error":"#N/A"}]
[null,"2018-07-01",{"$f":"IFERROR(IF(GETPIVOTDATA(\"Value\",Pivots!$A$6,\"Month\",$B142,\"Delay reason\",$C$22)=0,\"\",GETPIVOTDATA(\"Value\",Pivots!$A$6,\"Month\",$B142,\"Delay reason\",$C$22)),NA())","v":15807},15807,null,null,16886.080000000002,20059.01666666667,13713.143333333335,null,null,null,null,"2018-07-01",724,1192.8333333333333,3172.9366666666665,3900.5649999999996,null,null,null,null,{"$f":"IF($D$134>5,NA(),IF(D142>H142,MAX(W$136:$W141)+1,0))","v":0},{"$f":"IF($D$134>5,NA(),IF(D142<I142,MAX(W$136:$W141)+1,0))","v":0},{"$error":"#N/A"},{"$error":"#N/A"},0,0,{"$error":"#N/A"},null,1,0,{"$error":"#N/A"},null,1,0,{"$error":"#N/A"},null,0,0,{"$error":"#N/A"},null,{"$error":"#N/A"},{"$error":"#N/A"}]
[null,"2018-08-01",{"$f":"IFERROR(IF(GETPIVOTDATA(\"Value\",Pivots!$A$6,\"Month\",$B143,\"Delay reason\",$C$22)=0,\"\",GETPIVOTDATA(\"Value\",Pivots!$A$6,\"Month\",$B143,\"Delay reason\",$C$22)),NA())","v":16740},16740,null,null,16886.080000000002,20059.01666666667,13713.143333333335,null,null,null,null,"2018-08-01",933,1192.8333333333333,3172.9366666666665,3900.5649999999996,null,null,null,null,{"$f":"IF($D$134>5,NA(),IF(D143>H143,MAX(W$136:$W142)+1,0))","v":0},{"$f":"IF($D$134>5,NA(),IF(D143<I143,MAX(W$136:$W142)+1,0))","v":0},{"$error":"#N/A"},{"$error":"#N/A"},0,0,{"$error":"#N/A"},null,1,0,{"$error":"#N/A"},null,1,0,{"$error":"#N/A"},null,0,0,{"$error":"#N/A"},null,{"$error":"#N/A"},{"$error":"#N/A"}]
[null,"2018-09-01",{"$f":"IFERROR(IF(GETPIVOTDATA(\"Value\",Pivots!$A$6,\"Month\",$B144,\"Delay reason\",$C$22)=0,\"\",GETPIVOTDATA(\"Value\",Pivots!$A$6,\"Month\",$B144,\"Delay reason\",$C$22)),NA())","v":17079},17079,null,null,16886.080000000002,20059.01666666667,13713.143333333335,null,null,null,null,"2018-09-01",339,1192.8333333333333,3172.9366666666665,3900.5649999999996,null,null,null,null,{"$f":"IF($D$134>5,NA(),IF(D144>H144,MAX(W$136:$W143)+1,0))","v":0},{"$f":"IF($D$134>5,NA(),IF(D144<I144,MAX(W$136:$W143)+1,0))","v":0},{"$error":"#N/A"},{"$error":"#N/A"},1,0,{"$error":"#N/A"},null,0,0,{"$error":"#N/A"},null,1,0,{"$error":"#N/A"},null,0,0,{"$error":"#N/A"},null,{"$error":"#N/A"},{"$error":"#N/A"}]
[null,"2018-10-01",{"$f":"IFERROR(IF(GETPIVOTDATA(\"Value\",Pivots!$A$6,\"Month\",$B145,\"Delay reason\",$C$22)=0,\"\",GETPIVOTDATA(\"Value\",Pivots!$A$6,\"Month\",$B145,\"Delay reason\",$C$22)),NA())","v":16538},16538,null,null,16886.080000000002,20059.01666666667,13713.143333333335,null,null,null,null,"2018-10-01",541,1192.8333333333333,3172.9366666666665,3900.5649999999996,null,null,null,null,{"$f":"IF($D$134>5,NA(),IF(D145>H145,MAX(W$136:$W144)+1,0))","v":0},{"$f":"IF($D$134>5,NA(),IF(D145<I145,MAX(W$136:$W144)+1,0))","v":0},{"$error":"#N/A"},{"$error":"#N/A"},0,0,{"$error":"#N/A"},null,1,1,16538,null,0,0,{"$error":"#N/A"},null,1,0,{"$error":"#N/A"},null,{"$error":"#N/A"},16538]
[null,"2018-11-01",{"$f":"IFERROR(IF(GETPIVOTDATA(\"Value\",Pivots!$A$6,\"Month\",$B146,\"Delay reason\",$C$22)=0,\"\",GETPIVOTDATA(\"Value\",Pivots!$A$6,\"Month\",$B146,\"Delay reason\",$C$22)),NA())","v":13739},13739,null,null,16886.080000000002,20059.01666666667,13713.143333333335,null,null,null,null,"2018-11-01",2799,1192.8333333333333,3172.9366666666665,3900.5649999999996,null,null,null,null,{"$f":"IF($D$134>5,NA(),IF(D146>H146,MAX(W$136:$W145)+1,0))","v":0},{"$f":"IF($D$134>5,NA(),IF(D146<I146,MAX(W$136:$W145)+1,0))","v":0},{"$error":"#N/A"},{"$error":"#N/A"},0,0,{"$error":"#N/A"},null,1,1,13739,null,0,0,{"$error":"#N/A"},null,1,0,{"$error":"#N/A"},null,{"$error":"#N/A"},13739]
[null,"2018-12-01",{"$f":"IFERROR(IF(GETPIVOTDATA(\"Value\",Pivots!$A$6,\"Month\",$B147,\"Delay reason\",$C$22)=0,\"\",GETPIVOTDATA(\"Value\",Pivots!$A$6,\"Month\",$B147,\"Delay reason\",$C$22)),NA())","v":13983},13983,null,null,16886.080000000002,20059.01666666667,13713.143333333335,null,null,null,null,"2018-12-01",244,1192.8333333333333,3172.9366666666665,3900.5649999999996,null,null,null,null,{"$f":"IF($D$134>5,NA(),IF(D147>H147,MAX(W$136:$W146)+1,0))","v":0},{"$f":"IF($D$134>5,NA(),IF(D147<I147,MAX(W$136:$W146)+1,0))","v":0},{"$error":"#N/A"},{"$error":"#N/A"},0,0,{"$error":"#N/A"},null,1,1,13983,null,1,0,{"$error":"#N/A"},null,0,0,{"$error":"#N/A"},null,{"$error":"#N/A"},13983]
[null,"2019-01-01",{"$f":"IFERROR(IF(GETPIVOTDATA(\"Value\",Pivots!$A$6,\"Month\",$B148,\"Delay reason\",$C$22)=0,\"\",GETPIVOTDATA(\"Value\",Pivots!$A$6,\"Month\",$B148,\"Delay reason\",$C$22)),NA())","v":15811},15811,null,null,16886.080000000002,20059.01666666667,13713.143333333335,null,null,null,null,"2019-01-01",1828,1192.8333333333333,3172.9366666666665,3900.5649999999996,null,null,null,null,{"$f":"IF($D$134>5,NA(),IF(D148>H148,MAX(W$136:$W147)+1,0))","v":0},{"$f":"IF($D$134>5,NA(),IF(D148<I148,MAX(W$136:$W147)+1,0))","v":0},{"$error":"#N/A"},{"$error":"#N/A"},0,0,{"$error":"#N/A"},null,1,1,15811,null,1,0,{"$error":"#N/A"},null,0,0,{"$error":"#N/A"},null,{"$error":"#N/A"},15811]
[null,"2019-02-01",{"$f":"IFERROR(IF(GETPIVOTDATA(\"Value\",Pivots!$A$6,\"Month\",$B149,\"Delay reason\",$C$22)=0,\"\",GETPIVOTDATA(\"Value\",Pivots!$A$6,\"Month\",$B149,\"Delay reason\",$C$22)),NA())","v":14266},14266,null,null,16886.080000000002,20059.01666666667,13713.143333333335,null,null,null,null,"2019-02-01",1545,1192.8333333333333,3172.9366666666665,3900.5649999999996,null,null,null,null,{"$f":"IF($D$134>5,NA(),IF(D149>H149,MAX(W$136:$W148)+1,0))","v":0},{"$f":"IF($D$134>5,NA(),IF(D149<I149,MAX(W$136:$W148)+1,0))","v":0},{"$error":"#N/A"},{"$error":"#N/A"},0,0,{"$error":"#N/A"},null,1,1,14266,null,0,0,{"$error":"#N/A"},null,1,0,{"$error":"#N/A"},null,{"$error":"#N/A"},14266]
[null,"2019-03-01",{"$f":"IFERROR(IF(GETPIVOTDATA(\"Value\",Pivots!$A$6,\"Month\",$B150,\"Delay reason\",$C$22)=0,\"\",GETPIVOTDATA(\"Value\",Pivots!$A$6,\"Month\",$B150,\"Delay reason\",$C$22)),NA())","v":15422},15422,null,null,16886.080000000002,20059.01666666667,13713.143333333335,null,null,null,null,"2019-03-01",1156,1192.8333333333333,3172.9366666666665,3900.5649999999996,null,null,null,null,{"$f":"IF($D$134>5,NA(),IF(D150>H150,MAX(W$136:$W149)+1,0))","v":0},{"$f":"IF($D$134>5,NA(),IF(D150<I150,MAX(W$136:$W149)+1,0))","v":0},{"$error":"#N/A"},{"$error":"#N/A"},0,0,{"$error":"#N/A"},null,1,1,15422,null,1,0,{"$error":"#N/A"},null,0,0,{"$error":"#N/A"},null,{"$error":"#N/A"},15422]
[null,"2019-04-01",{"$f":"IFERROR(IF(GETPIVOTDATA(\"Value\",Pivots!$A$6,\"Month\",$B151,\"Delay reason\",$C$22)=0,\"\",GETPIVOTDATA(\"Value\",Pivots!$A$6,\"Month\",$B151,\"Delay reason\",$C$22)),NA())","v":15076},15076,null,null,16886.080000000002,20059.01666666667,13713.143333333335,null,null,null,null,"2019-04-01",346,1192.8333333333333,3172.9366666666665,3900.5649999999996,null,null,null,null,{"$f":"IF($D$134>5,NA(),IF(D151>H151,MAX(W$136:$W150)+1,0))","v":0},{"$f":"IF($D$134>5,NA(),IF(D151<I151,MAX(W$136:$W150)+1,0))","v":0},{"$error":"#N/A"},{"$error":"#N/A"},0,0,{"$error":"#N/A"},null,1,1,15076,null,0,0,{"$error":"#N/A"},null,1,0,{"$error":"#N/A"},null,{"$error":"#N/A"},15076]
[null,"2019-05-01",{"$f":"IFERROR(IF(GETPIVOTDATA(\"Value\",Pivots!$A$6,\"Month\",$B152,\"Delay reason\",$C$22)=0,\"\",GETPIVOTDATA(\"Value\",Pivots!$A$6,\"Month\",$B152,\"Delay reason\",$C$22)),NA())","v":17620},17620,null,null,16886.080000000002,20059.01666666667,13713.143333333335,null,null,null,null,"2019-05-01",2544,1192.8333333333333,3172.9366666666665,3900.5649999999996,null,null,null,null,{"$f":"IF($D$134>5,NA(),IF(D152>H152,MAX(W$136:$W151)+1,0))","v":0},{"$f":"IF($D$134>5,NA(),IF(D152<I152,MAX(W$136:$W151)+1,0))","v":0},{"$error":"#N/A"},{"$error":"#N/A"},1,0,{"$error":"#N/A"},null,0,0,{"$error":"#N/A"},null,1,0,{"$error":"#N/A"},null,0,0,{"$error":"#N/A"},null,{"$error":"#N/A"},{"$error":"#N/A"}]
[null,"2019-06-01",{"$f":"IFERROR(IF(GETPIVOTDATA(\"Value\",Pivots!$A$6,\"Month\",$B153,\"Delay reason\",$C$22)=0,\"\",GETPIVOTDATA(\"Value\",Pivots!$A$6,\"Month\",$B153,\"Delay reason\",$C$22)),NA())","v":15622},15622,null,null,16886.080000000002,20059.01666666667,13713.143333333335,null,null,null,null,"2019-06-01",1998,1192.8333333333333,3172.9366666666665,3900.5649999999996,null,null,null,null,{"$f":"IF($D$134>5,NA(),IF(D153>H153,MAX(W$136:$W152)+1,0))","v":0},{"$f":"IF($D$134>5,NA(),IF(D153<I153,MAX(W$136:$W152)+1,0))","v":0},{"$error":"#N/A"},{"$error":"#N/A"},0,0,{"$error":"#N/A"},null,1,0,{"$error":"#N/A"},null,0,0,{"$error":"#N/A"},null,1,0,{"$error":"#N/A"},null,{"$error":"#N/A"},{"$error":"#N/A"}]
[null,"2019-07-01",{"$f":"IFERROR(IF(GETPIVOTDATA(\"Value\",Pivots!$A$6,\"Month\",$B154,\"Delay reason\",$C$22)=0,\"\",GETPIVOTDATA(\"Value\",Pivots!$A$6,\"Month\",$B154,\"Delay reason\",$C$22)),NA())","v":16535},16535,null,null,16886.080000000002,20059.01666666667,13713.143333333335,null,null,null,null,"2019-07-01",913,1192.8333333333333,3172.9366666666665,3900.5649999999996,null,null,null,null,{"$f":"IF($D$134>5,NA(),IF(D154>H154,MAX(W$136:$W153)+1,0))","v":0},{"$f":"IF($D$134>5,NA(),IF(D154<I154,MAX(W$136:$W153)+1,0))","v":0},{"$error":"#N/A"},{"$error":"#N/A"},0,0,{"$error":"#N/A"},null,1,0,{"$error":"#N/A"},null,1,0,{"$error":"#N/A"},null,0,0,{"$error":"#N/A"},null,{"$error":"#N/A"},{"$error":"#N/A"}]
[null,"2019-08-01",{"$f":"IFERROR(IF(GETPIVOTDATA(\"Value\",Pivots!$A$6,\"Month\",$B155,\"Delay reason\",$C$22)=0,\"\",GETPIVOTDATA(\"Value\",Pivots!$A$6,\"Month\",$B155,\"Delay reason\",$C$22)),NA())","v":17871},17871,null,null,16886.080000000002,20059.01666666667,13713.143333333335,null,null,null,null,"2019-08-01",1336,1192.8333333333333,3172.9366666666665,3900.5649999999996,null,null,null,null,{"$f":"IF($D$134>5,NA(),IF(D155>H155,MAX(W$136:$W154)+1,0))","v":0},{"$f":"IF($D$134>5,NA(),IF(D155<I155,MAX(W$136:$W154)+1,0))","v":0},{"$error":"#N/A"},{"$error":"#N/A"},1,1,17871,null,0,0,{"$error":"#N/A"},null,1,0,{"$error":"#N/A"},null,0,0,{"$error":"#N/A"},null,17871,{"$error":"#N/A"}]
[null,"2019-09-01",{"$f":"IFERROR(IF(GETPIVOTDATA(\"Value\",Pivots!$A$6,\"Month\",$B156,\"Delay reason\",$C$22)=0,\"\",GETPIVOTDATA(\"Value\",Pivots!$A$6,\"Month\",$B156,\"Delay reason\",$C$22)),NA())","v":19611},19611,null,null,16886.080000000002,20059.01666666667,13713.143333333335,null,null,null,null,"2019-09-01",1740,1192.8333333333333,3172.9366666666665,3900.5649999999996,null,null,null,null,{"$f":"IF($D$134>5,NA(),IF(D156>H156,MAX(W$136:$W155)+1,0))","v":0},{"$f":"IF($D$134>5,NA(),IF(D156<I156,MAX(W$136:$W155)+1,0))","v":0},{"$error":"#N/A"},{"$error":"#N/A"},1,1,19611,null,0,0,{"$error":"#N/A"},null,1,0,{"$error":"#N/A"},null,0,{"$f":"IFERROR(IF(AND(AN155=1,AM156=1),1,IF(SUM(AM156:AM161)>=7,1,0)),NA())","v":0},{"$error":"#N/A"},null,19611,{"$error":"#N/A"}]
[null,"2019-10-01",{"$f":"IFERROR(IF(GETPIVOTDATA(\"Value\",Pivots!$A$6,\"Month\",$B157,\"Delay reason\",$C$22)=0,\"\",GETPIVOTDATA(\"Value\",Pivots!$A$6,\"Month\",$B157,\"Delay reason\",$C$22)),NA())","v":18437},18437,null,null,16886.080000000002,20059.01666666667,13713.143333333335,null,null,null,null,"2019-10-01",1174,1192.8333333333333,3172.9366666666665,3900.5649999999996,null,null,null,null,{"$f":"IF($D$134>5,NA(),IF(D157>H157,MAX(W$136:$W156)+1,0))","v":0},{"$f":"IF($D$134>5,NA(),IF(D157<I157,MAX(W$136:$W156)+1,0))","v":0},{"$error":"#N/A"},{"$error":"#N/A"},1,1,18437,null,0,0,{"$error":"#N/A"},null,0,{"$f":"IFERROR(IF(AND(AJ156=1,AI157=1),1,IF(SUM(AI157:AI161)>=7,1,0)),NA())","v":0},{"$error":"#N/A"},null,1,{"$f":"IFERROR(IF(AND(AN156=1,AM157=1),1,IF(SUM(AM157:AM161)>=7,1,0)),NA())","v":0},{"$error":"#N/A"},null,18437,{"$error":"#N/A"}]
[null,"2019-11-01",{"$f":"IFERROR(IF(GETPIVOTDATA(\"Value\",Pivots!$A$6,\"Month\",$B158,\"Delay reason\",$C$22)=0,\"\",GETPIVOTDATA(\"Value\",Pivots!$A$6,\"Month\",$B158,\"Delay reason\",$C$22)),NA())","v":18022},18022,null,null,16886.080000000002,20059.01666666667,13713.143333333335,null,null,null,null,"2019-11-01",415,1192.8333333333333,3172.9366666666665,3900.5649999999996,null,null,null,null,{"$f":"IF($D$134>5,NA(),IF(D158>H158,MAX(W$136:$W157)+1,0))","v":0},{"$f":"IF($D$134>5,NA(),IF(D158<I158,MAX(W$136:$W157)+1,0))","v":0},{"$error":"#N/A"},{"$error":"#N/A"},1,{"$f":"IFERROR(IF(AND(AB157=1,AA158=1),1,IF(SUM(AA158:AA161)>=7,1,0)),NA())","v":1},{"$f":"IF(AB158=0,NA(),C158)","v":18022},null,0,{"$f":"IFERROR(IF(AND(AF157=1,AE158=1),1,IF(SUM(AE158:AE161)>=7,1,0)),NA())","v":0},{"$f":"IF(AF158=0,NA(),C158)","v":{"$error":"#N/A"}},null,0,{"$f":"IFERROR(IF(AND(AJ157=1,AI158=1),1,IF(SUM(AI158:AI161)>=7,1,0)),NA())","v":0},{"$error":"#N/A"},null,1,{"$f":"IFERROR(IF(AND(AN157=1,AM158=1),1,IF(SUM(AM158:AM161)>=7,1,0)),NA())","v":0},{"$error":"#N/A"},null,18022,{"$error":"#N/A"}]
[null,"2019-12-01",{"$f":"IFERROR(IF(GETPIVOTDATA(\"Value\",Pivots!$A$6,\"Month\",$B159,\"Delay reason\",$C$22)=0,\"\",GETPIVOTDATA(\"Value\",Pivots!$A$6,\"Month\",$B159,\"Delay reason\",$C$22)),NA())","v":18399},18399,null,null,16886.080000000002,20059.01666666667,13713.143333333335,null,null,null,null,"2019-12-01",377,1192.8333333333333,3172.9366666666665,3900.5649999999996,null,null,null,null,{"$f":"IF($D$134>5,NA(),IF(D159>H159,MAX(W$136:$W158)+1,0))","v":0},{"$f":"IF($D$134>5,NA(),IF(D159<I159,MAX(W$136:$W158)+1,0))","v":0},{"$error":"#N/A"},{"$error":"#N/A"},1,{"$f":"IFERROR(IF(AND(AB158=1,AA159=1),1,IF(SUM(AA159:AA161)>=7,1,0)),NA())","v":1},{"$f":"IF(AB159=0,NA(),C159)","v":18399},null,0,{"$f":"IFERROR(IF(AND(AF158=1,AE159=1),1,IF(SUM(AE159:AE161)>=7,1,0)),NA())","v":0},{"$f":"IF(AF159=0,NA(),C159)","v":{"$error":"#N/A"}},null,1,{"$f":"IFERROR(IF(AND(AJ158=1,AI159=1),1,IF(SUM(AI159:AI161)>=7,1,0)),NA())","v":0},{"$error":"#N/A"},null,0,{"$f":"IFERROR(IF(AND(AN158=1,AM159=1),1,IF(SUM(AM159:AM161)>=7,1,0)),NA())","v":0},{"$error":"#N/A"},null,18399,{"$error":"#N/A"}]
[null,"2020-01-01",{"$f":"IFERROR(IF(GETPIVOTDATA(\"Value\",Pivots!$A$6,\"Month\",$B160,\"Delay reason\",$C$22)=0,\"\",GETPIVOTDATA(\"Value\",Pivots!$A$6,\"Month\",$B160,\"Delay reason\",$C$22)),NA())","v":20917},20917,null,null,16886.080000000002,20059.01666666667,13713.143333333335,null,null,null,null,"2020-01-01",2518,1192.8333333333333,3172.9366666666665,3900.5649999999996,null,null,null,null,{"$f":"IF($D$134>5,NA(),IF(D160>H160,MAX(W$136:$W159)+1,0))","v":1},{"$f":"IF($D$134>5,NA(),IF(D160<I160,MAX(W$136:$W159)+1,0))","v":0},20917,{"$error":"#N/A"},1,{"$f":"IFERROR(IF(AND(AB159=1,AA160=1),1,IF(SUM(AA160:AA166)>=7,1,0)),NA())","v":1},20917,null,0,{"$f":"IFERROR(IF(AND(AF159=1,AE160=1),1,IF(SUM(AE160:AE161)>=7,1,0)),NA())","v":0},{"$error":"#N/A"},null,1,{"$f":"IFERROR(IF(AND(AJ159=1,AI160=1),1,IF(SUM(AI160:AI161)>=7,1,0)),NA())","v":0},{"$error":"#N/A"},null,0,{"$f":"IFERROR(IF(AND(AN159=1,AM160=1),1,IF(SUM(AM160:AM161)>=7,1,0)),NA())","v":0},{"$error":"#N/A"},null,20917,{"$error":"#N/A"}]
[null,"2020-02-01",{"$f":"IFERROR(IF(GETPIVOTDATA(\"Value\",Pivots!$A$6,\"Month\",$B161,\"Delay reason\",$C$22)=0,\"\",GETPIVOTDATA(\"Value\",Pivots!$A$6,\"Month\",$B161,\"Delay reason\",$C$22)),NA())","v":20214},20214,null,null,16886.080000000002,20059.01666666667,{"$f":"IF($D$134>5,NA(),IF(D161=\"\",I160,G161-Q161))","v":13713.143333333335},null,null,null,null,"2020-02-01",703,{"$f":"IF(O161=\"\",P160,AVERAGE(IF($O$137:$O$161<>\"\",$O$137:$O$161)))","v":1192.8333333333333},{"$f":"IF(ISERROR((P161*2.66)),Q162,(P161*2.66))","v":3172.9366666666665},3900.5649999999996,null,null,null,null,{"$f":"IF($D$134>5,NA(),IF(D161>H161,MAX(W$136:$W160)+1,0))","v":2},{"$f":"IF($D$134>5,NA(),IF(D161<I161,MAX(W$136:$W160)+1,0))","v":0},20214,{"$error":"#N/A"},1,{"$f":"IFERROR(IF(AND(AB160=1,AA161=1),1,IF(SUM(AA161)>=7,1,0)),NA())","v":1},20214,null,0,{"$f":"IFERROR(IF(AND(AF160=1,AE161=1),1,IF(SUM(AE161)>=7,1,0)),NA())","v":0},{"$error":"#N/A"},null,0,{"$f":"IFERROR(IF(AND(AJ160=1,AI161=1),1,IF(SUM(AI161)>=7,1,0)),NA())","v":0},{"$error":"#N/A"},null,1,{"$f":"IFERROR(IF(AND(AN160=1,AM161=1),1,IF(SUM(AM161)>=7,1,0)),NA())","v":0},{"$error":"#N/A"},null,20214,{"$error":"#N/A"}]
[]
[null,{"$f":"C23","v":"E) Awaiting care package in own home"},null,"Count IF data point is zero"]
[null,{"$f":"B39","v":7},{"$f":"ROW()","v":164},{"$f":"COUNTIF(D167:D191,0)","v":0},null,null,null,"Upper","Lower",null,null,null,null,"Date","Difference",null,"Sigma",null,null,null,null,null,"> 3","< 3 ",null,null,"7 points above/below mean",null,null,null,null,null,null,null,"Trend up/down",null,null,null,null,null,null,null,"chart 5"]
[null,"ID (Week no.)","Plot data","Data",null,null,"Mean","Control limits ","control limit (-3)",null,null,null,null,null,"For. Roll avg","Cumul. Moving Avg.","2.66* MR","3.27*MR",null,null,null,null,"Count","Count","Above 3 sigma","Below 3 sigma","7 points > mean","Count of 7point ","7 points above mean",null,"7 points <mean","Count of 7 point ","6 points below mean",null,"Trend up",null,null,null,"Trend Down",null,null,null,"Concern","Improvement"]
[null,{"$f":"D8","v":"2018-02-01"},{"$f":"IFERROR(IF(GETPIVOTDATA(\"Value\",Pivots!$A$6,\"Month\",$B166,\"Delay reason\",$C$23)=0,\"\",GETPIVOTDATA(\"Value\",Pivots!$A$6,\"Month\",$B166,\"Delay reason\",$C$23)),NA())","v":30876},{"$f":"IFERROR(IF(C166=\"\",0,C166),\"\")","v":30876},null,null,{"$f":"AVERAGE($D$166:$D$190)","v":29837.279999999999},{"$f":"IF($D$164>5,NA(),IF(D166=\"\",H165,G166+Q166))","v":34333.345000000001},{"$f":"IF($D$164>5,NA(),IF(D166=\"\",I165,G166-Q166))","v":25341.214999999997},null,null,null,null,{"$f":"B166","v":"2018-02-01"},null,{"$f":"IF(O166=\"\",P165,AVERAGE(IF($O$166:$O$190<>\"\",$O$166:$O$190)))","v":"Cumul. Moving Avg."},{"$f":"Q167","v":4496.0650000000005},{"$f":"R167","v":5527.1175000000003},null,null,null,null,{"$f":"IF($D$164>5,NA(),IF(D166>H166,MAX(W$165:$W165)+1,0))","v":0},{"$f":"IF($D$164>5,NA(),IF(D166<I166,MAX(W$165:$W165)+1,0))","v":0},{"$f":"IF(W166>0,C166,NA())","v":{"$error":"#N/A"}},{"$f":"IF(X166>0,D166,NA())","v":{"$error":"#N/A"}},{"$f":"IFERROR(IF($D$164>5,NA(), IF(D166>G166,1,0)),0)","v":1},{"$f":"IFERROR(IF(AND(AB165=1,AA166=1),1,IF(SUM(AA166:AA172)>=7,1,0)),NA())","v":0},{"$f":"IF(AB166=0,NA(),C166)","v":{"$error":"#N/A"}},null,{"$f":"IFERROR(IF($D$164>5,NA(), IF(D166<G166,1,0)),0)","v":0},{"$f":"IFERROR(IF(AND(AF165=1,AE166=1),1,IF(SUM(AE166:AE172)>=7,1,0)),NA())","v":0},{"$f":"IF(AF166=0,NA(),C166)","v":{"$error":"#N/A"}},null,{"$f":"IF($D$164>5,NA(),IF(D166>D165,1,0))","v":0},{"$f":"IFERROR(IF(AND(AJ165=1,AI166=1),1,IF(SUM(AI166:AI172)>=7,1,0)),NA())","v":0},{"$f":"IF(AJ166=0,NA(),C166)","v":{"$error":"#N/A"}},null,{"$f":"IF($D$164>5,NA(),IF(D166<D165,1,0))","v":1},{"$f":"IFERROR(IF(AND(AN165=1,AM166=1),1,IF(SUM(AM166:AM172)>=7,1,0)),NA())","v":0},{"$f":"IF(AN166=0,NA(),C166)","v":{"$error":"#N/A"}},null,{"$f":"IF(OR(W166>0,AB166>0,AJ166>0),C166,NA())","v":{"$error":"#N/A"}},{"$f":"IF(OR(X166>0,AF166>0,AN166>0),D166,NA())","v":{"$error":"#N/A"}}]
[null,{"$f":"IF(DAY(B166+31)=1,B166+31,B166+31-DAY(B166+31)+1)","v":"2018-03-01"},{"$f":"IFERROR(IF(GETPIVOTDATA(\"Value\",Pivots!$A$6,\"Month\",$B167,\"Delay reason\",$C$23)=0,\"\",GETPIVOTDATA(\"Value\",Pivots!$A$6,\"Month\",$B167,\"Delay reason\",$C$23)),NA())","v":33504},{"$f":"IFERROR(IF(C167=\"\",0,C167),\"\")","v":33504},null,null,{"$f":"AVERAGE($D$166:$D$190)","v":29837.279999999999},{"$f":"IF($D$164>5,NA(),IF(D167=\"\",H166,G167+Q167))","v":34333.345000000001},{"$f":"IF($D$164>5,NA(),IF(D167=\"\",I166,G167-Q167))","v":25341.214999999997},null,null,null,null,{"$f":"B167","v":"2018-03-01"},{"$f":"IF(D166=\"\",\"\",IF(D167=\"\",\"\",ABS(D166-D167)))","v":2628},1690.25,{"$f":"IF(ISERROR((P167*2.66)),Q168,(P167*2.66))","v":4496.0650000000005},{"$f":"$P167*3.27","v":5527.1175000000003},null,null,null,null,{"$f":"IF($D$164>5,NA(),IF(D167>H167,MAX(W$165:$W166)+1,0))","v":0},{"$f":"IF($D$164>5,NA(),IF(D167<I167,MAX(W$165:$W166)+1,0))","v":0},{"$f":"IF(W167>0,C167,NA())","v":{"$error":"#N/A"}},{"$f":"IF(X167>0,D167,NA())","v":{"$error":"#N/A"}},{"$f":"IFERROR(IF($D$164>5,NA(), IF(D167>G167,1,0)),0)","v":1},{"$f":"IFERROR(IF(AND(AB166=1,AA167=1),1,IF(SUM(AA167:AA173)>=7,1,0)),NA())","v":0},{"$f":"IF(AB167=0,NA(),C167)","v":{"$error":"#N/A"}},null,{"$f":"IFERROR(IF($D$164>5,NA(), IF(D167<G167,1,0)),0)","v":0},{"$f":"IFERROR(IF(AND(AF166=1,AE167=1),1,IF(SUM(AE167:AE173)>=7,1,0)),NA())","v":0},{"$f":"IF(AF167=0,NA(),C167)","v":{"$error":"#N/A"}},null,{"$f":"IF($D$164>5,NA(),IF(D167>D166,1,0))","v":1},{"$f":"IFERROR(IF(AND(AJ166=1,AI167=1),1,IF(SUM(AI167:AI173)>=7,1,0)),NA())","v":0},{"$f":"IF(AJ167=0,NA(),C167)","v":{"$error":"#N/A"}},null,{"$f":"IF($D$164>5,NA(),IF(D167<D166,1,0))","v":0},{"$f":"IFERROR(IF(AND(AN166=1,AM167=1),1,IF(SUM(AM167:AM173)>=7,1,0)),NA())","v":0},{"$f":"IF(AN167=0,NA(),C167)","v":{"$error":"#N/A"}},null,{"$f":"IF(OR(W167>0,AB167>0,AJ167>0),C167,NA())","v":{"$error":"#N/A"}},{"$f":"IF(OR(X167>0,AF167>0,AN167>0),D167,NA())","v":{"$error":"#N/A"}}]
[null,{"$f":"IF(DAY(B167+31)=1,B167+31,B167+31-DAY(B167+31)+1)","v":"2018-04-01"},{"$f":"IFERROR(IF(GETPIVOTDATA(\"Value\",Pivots!$A$6,\"Month\",$B168,\"Delay reason\",$C$23)=0,\"\",GETPIVOTDATA(\"Value\",Pivots!$A$6,\"Month\",$B168,\"Delay reason\",$C$23)),NA())","v":29458},29458,null,null,29837.279999999999,34333.345000000001,25341.214999999997,null,null,null,null,"2018-04-01",{"$f":"IF(D167=\"\",\"\",IF(D168=\"\",\"\",ABS(D167-D168)))","v":4046},1690.25,{"$f":"IF(ISERROR((P168*2.66)),Q169,(P168*2.66))","v":4496.0650000000005},{"$f":"$P168*3.27","v":5527.1175000000003},null,null,null,null,{"$f":"IF($D$164>5,NA(),IF(D168>H168,MAX(W$165:$W167)+1,0))","v":0},{"$f":"IF($D$164>5,NA(),IF(D168<I168,MAX(W$165:$W167)+1,0))","v":0},{"$error":"#N/A"},{"$error":"#N/A"},0,0,{"$error":"#N/A"},null,1,0,{"$error":"#N/A"},null,0,0,{"$f":"IF(AJ168=0,NA(),C168)","v":{"$error":"#N/A"}},null,1,0,{"$f":"IF(AN168=0,NA(),C168)","v":{"$error":"#N/A"}},null,{"$error":"#N/A"},{"$error":"#N/A"}]
[null,"2018-05-01",{"$f":"IFERROR(IF(GETPIVOTDATA(\"Value\",Pivots!$A$6,\"Month\",$B169,\"Delay reason\",$C$23)=0,\"\",GETPIVOTDATA(\"Value\",Pivots!$A$6,\"Month\",$B169,\"Delay reason\",$C$23)),NA())","v":27442},27442,null,null,29837.279999999999,34333.345000000001,25341.214999999997,null,null,null,null,"2018-05-01",2016,1690.25,{"$f":"IF(ISERROR((P169*2.66)),Q170,(P169*2.66))","v":4496.0650000000005},5527.1175000000003,null,null,null,null,{"$f":"IF($D$164>5,NA(),IF(D169>H169,MAX(W$165:$W168)+1,0))","v":0},{"$f":"IF($D$164>5,NA(),IF(D169<I169,MAX(W$165:$W168)+1,0))","v":0},{"$error":"#N/A"},{"$error":"#N/A"},0,0,{"$error":"#N/A"},null,1,0,{"$error":"#N/A"},null,0,0,{"$error":"#N/A"},null,1,0,{"$error":"#N/A"},null,{"$error":"#N/A"},{"$error":"#N/A"}]
[null,"2018-06-01",{"$f":"IFERROR(IF(GETPIVOTDATA(\"Value\",Pivots!$A$6,\"Month\",$B170,\"Delay reason\",$C$23)=0,\"\",GETPIVOTDATA(\"Value\",Pivots!$A$6,\"Month\",$B170,\"Delay reason\",$C$23)),NA())","v":27978},27978,null,null,29837.279999999999,34333.345000000001,25341.214999999997,null,null,null,null,"2018-06-01",536,1690.25,{"$f":"IF(ISERROR((P170*2.66)),Q171,(P170*2.66))","v":4496.0650000000005},5527.1175000000003,null,null,null,null,{"$f":"IF($D$164>5,NA(),IF(D170>H170,MAX(W$165:$W169)+1,0))","v":0},{"$f":"IF($D$164>5,NA(),IF(D170<I170,MAX(W$165:$W169)+1,0))","v":0},{"$error":"#N/A"},{"$error":"#N/A"},0,0,{"$error":"#N/A"},null,1,0,{"$error":"#N/A"},null,1,0,{"$error":"#N/A"},null,0,0,{"$error":"#N/A"},null,{"$error":"#N/A"},{"$error":"#N/A"}]
[null,"2018-07-01",{"$f":"IFERROR(IF(GETPIVOTDATA(\"Value\",Pivots!$A$6,\"Month\",$B171,\"Delay reason\",$C$23)=0,\"\",GETPIVOTDATA(\"Value\",Pivots!$A$6,\"Month\",$B171,\"Delay reason\",$C$23)),NA())","v":30570},30570,null,null,29837.279999999999,34333.345000000001,25341.214999999997,null,null,null,null,"2018-07-01",2592,1690.25,4496.0650000000005,5527.1175000000003,null,null,null,null,{"$f":"IF($D$164>5,NA(),IF(D171>H171,MAX(W$165:$W170)+1,0))","v":0},{"$f":"IF($D$164>5,NA(),IF(D171<I171,MAX(W$165:$W170)+1,0))","v":0},{"$error":"#N/A"},{"$error":"#N/A"},1,0,{"$error":"#N/A"},null,0,0,{"$error":"#N/A"},null,1,0,{"$error":"#N/A"},null,0,0,{"$error":"#N/A"},null,{"$error":"#N/A"},{"$error":"#N/A"}]
[null,"2018-08-01",{"$f":"IFERROR(IF(GETPIVOTDATA(\"Value\",Pivots!$A$6,\"Month\",$B172,\"Delay reason\",$C$23)=0,\"\",GETPIVOTDATA(\"Value\",Pivots!$A$6,\"Month\",$B172,\"Delay reason\",$C$23)),NA())","v":31577},31577,null,null,29837.279999999999,34333.345000000001,25341.214999999997,null,null,null,null,"2018-08-01",1007,1690.25,4496.0650000000005,5527.1175000000003,null,null,null,null,{"$f":"IF($D$164>5,NA(),IF(D172>H172,MAX(W$165:$W171)+1,0))","v":0},{"$f":"IF($D$164>5,NA(),IF(D172<I172,MAX(W$165:$W171)+1,0))","v":0},{"$error":"#N/A"},{"$error":"#N/A"},1,0,{"$error":"#N/A"},null,0,0,{"$error":"#N/A"},null,1,0,{"$error":"#N/A"},null,0,0,{"$error":"#N/A"},null,{"$error":"#N/A"},{"$error":"#N/A"}]
[null,"2018-09-01",{"$f":"IFERROR(IF(GETPIVOTDATA(\"Value\",Pivots!$A$6,\"Month\",$B173,\"Delay reason\",$C$23)=0,\"\",GETPIVOTDATA(\"Value\",Pivots!$A$6,\"Month\",$B173,\"Delay reason\",$C$23)),NA())","v":31080},31080,null,null,29837.279999999999,34333.345000000001,25341.214999999997,null,null,null,null,"2018-09-01",497,1690.25,4496.0650000000005,5527.1175000000003,null,null,null,null,{"$f":"IF($D$164>5,NA(),IF(D173>H173,MAX(W$165:$W172)+1,0))","v":0},{"$f":"IF($D$164>5,NA(),IF(D173<I173,MAX(W$165:$W172)+1,0))","v":0},{"$error":"#N/A"},{"$error":"#N/A"},1,0,{"$error":"#N/A"},null,0,0,{"$error":"#N/A"},null,0,0,{"$error":"#N/A"},null,1,0,{"$error":"#N/A"},null,{"$error":"#N/A"},{"$error":"#N/A"}]
[null,"2018-10-01",{"$f":"IFERROR(IF(GETPIVOTDATA(\"Value\",Pivots!$A$6,\"Month\",$B174,\"Delay reason\",$C$23)=0,\"\",GETPIVOTDATA(\"Value\",Pivots!$A$6,\"Month\",$B174,\"Delay reason\",$C$23)),NA())","v":30807},30807,null,null,29837.279999999999,34333.345000000001,25341.214999999997,null,null,null,null,"2018-10-01",273,1690.25,4496.0650000000005,5527.1175000000003,null,null,null,null,{"$f":"IF($D$164>5,NA(),IF(D174>H174,MAX(W$165:$W173)+1,0))","v":0},{"$f":"IF($D$164>5,NA(),IF(D174<I174,MAX(W$165:$W173)+1,0))","v":0},{"$error":"#N/A"},{"$error":"#N/A"},1,0,{"$error":"#N/A"},null,0,0,{"$error":"#N/A"},null,0,0,{"$error":"#N/A"},null,1,0,{"$error":"#N/A"},null,{"$error":"#N/A"},{"$error":"#N/A"}]
[null,"2018-11-01",{"$f":"IFERROR(IF(GETPIVOTDATA(\"Value\",Pivots!$A$6,\"Month\",$B175,\"Delay reason\",$C$23)=0,\"\",GETPIVOTDATA(\"Value\",Pivots!$A$6,\"Month\",$B175,\"Delay reason\",$C$23)),NA())","v":28822},28822,null,null,29837.279999999999,34333.345000000001,25341.214999999997,null,null,null,null,"2018-11-01",1985,1690.25,4496.0650000000005,5527.1175000000003,null,null,null,null,{"$f":"IF($D$164>5,NA(),IF(D175>H175,MAX(W$165:$W174)+1,0))","v":0},{"$f":"IF($D$164>5,NA(),IF(D175<I175,MAX(W$165:$W174)+1,0))","v":0},{"$error":"#N/A"},{"$error":"#N/A"},0,0,{"$error":"#N/A"},null,1,1,28822,null,0,0,{"$error":"#N/A"},null,1,0,{"$error":"#N/A"},null,{"$error":"#N/A"},28822]
[null,"2018-12-01",{"$f":"IFERROR(IF(GETPIVOTDATA(\"Value\",Pivots!$A$6,\"Month\",$B176,\"Delay reason\",$C$23)=0,\"\",GETPIVOTDATA(\"Value\",Pivots!$A$6,\"Month\",$B176,\"Delay reason\",$C$23)),NA())","v":27550},27550,null,null,29837.279999999999,34333.345000000001,25341.214999999997,null,null,null,null,"2018-12-01",1272,1690.25,4496.0650000000005,5527.1175000000003,null,null,null,null,{"$f":"IF($D$164>5,NA(),IF(D176>H176,MAX(W$165:$W175)+1,0))","v":0},{"$f":"IF($D$164>5,NA(),IF(D176<I176,MAX(W$165:$W175)+1,0))","v":0},{"$error":"#N/A"},{"$error":"#N/A"},0,0,{"$error":"#N/A"},null,1,1,27550,null,0,0,{"$error":"#N/A"},null,1,0,{"$error":"#N/A"},null,{"$error":"#N/A"},27550]
[null,"2019-01-01",{"$f":"IFERROR(IF(GETPIVOTDATA(\"Value\",Pivots!$A$6,\"Month\",$B177,\"Delay reason\",$C$23)=0,\"\",GETPIVOTDATA(\"Value\",Pivots!$A$6,\"Month\",$B177,\"Delay reason\",$C$23)),NA())","v":27733},27733,null,null,29837.279999999999,34333.345000000001,25341.214999999997,null,null,null,null,"2019-01-01",183,1690.25,4496.0650000000005,5527.1175000000003,null,null,null,null,{"$f":"IF($D$164>5,NA(),IF(D177>H177,MAX(W$165:$W176)+1,0))","v":0},{"$f":"IF($D$164>5,NA(),IF(D177<I177,MAX(W$165:$W176)+1,0))","v":0},{"$error":"#N/A"},{"$error":"#N/A"},{"$f":"IFERROR(IF($D$164>5,NA(), IF(D177>G177,1,0)),0)","v":0},0,{"$error":"#N/A"},null,1,1,27733,null,1,0,{"$error":"#N/A"},null,0,0,{"$error":"#N/A"},null,{"$error":"#N/A"},27733]
[null,"2019-02-01",{"$f":"IFERROR(IF(GETPIVOTDATA(\"Value\",Pivots!$A$6,\"Month\",$B178,\"Delay reason\",$C$23)=0,\"\",GETPIVOTDATA(\"Value\",Pivots!$A$6,\"Month\",$B178,\"Delay reason\",$C$23)),NA())","v":25350},25350,null,null,29837.279999999999,34333.345000000001,25341.214999999997,null,null,null,null,"2019-02-01",2383,1690.25,4496.0650000000005,5527.1175000000003,null,null,null,null,{"$f":"IF($D$164>5,NA(),IF(D178>H178,MAX(W$165:$W177)+1,0))","v":0},{"$f":"IF($D$164>5,NA(),IF(D178<I178,MAX(W$165:$W177)+1,0))","v":0},{"$error":"#N/A"},{"$error":"#N/A"},0,0,{"$error":"#N/A"},null,1,1,25350,null,0,0,{"$error":"#N/A"},null,1,0,{"$error":"#N/A"},null,{"$error":"#N/A"},25350]
[null,"2019-03-01",{"$f":"IFERROR(IF(GETPIVOTDATA(\"Value\",Pivots!$A$6,\"Month\",$B179,\"Delay reason\",$C$23)=0,\"\",GETPIVOTDATA(\"Value\",Pivots!$A$6,\"Month\",$B179,\"Delay reason\",$C$23)),NA())","v":28208},28208,null,null,29837.279999999999,34333.345000000001,25341.214999999997,null,null,null,null,"2019-03-01",2858,1690.25,4496.0650000000005,5527.1175000000003,null,null,null,null,{"$f":"IF($D$164>5,NA(),IF(D179>H179,MAX(W$165:$W178)+1,0))","v":0},{"$f":"IF($D$164>5,NA(),IF(D179<I179,MAX(W$165:$W178)+1,0))","v":0},{"$error":"#N/A"},{"$error":"#N/A"},0,0,{"$error":"#N/A"},null,1,1,28208,null,1,0,{"$error":"#N/A"},null,0,0,{"$error":"#N/A"},null,{"$error":"#N/A"},28208]
[null,"2019-04-01",{"$f":"IFERROR(IF(GETPIVOTDATA(\"Value\",Pivots!$A$6,\"Month\",$B180,\"Delay reason\",$C$23)=0,\"\",GETPIVOTDATA(\"Value\",Pivots!$A$6,\"Month\",$B180,\"Delay reason\",$C$23)),NA())","v":25051},25051,null,null,29837.279999999999,34333.345000000001,25341.214999999997,null,null,null,null,"2019-04-01",3157,1690.25,4496.0650000000005,5527.1175000000003,null,null,null,null,{"$f":"IF($D$164>5,NA(),IF(D180>H180,MAX(W$165:$W179)+1,0))","v":0},{"$f":"IF($D$164>5,NA(),IF(D180<I180,MAX(W$165:$W179)+1,0))","v":1},{"$error":"#N/A"},25051,0,0,{"$error":"#N/A"},null,1,1,25051,null,0,0,{"$error":"#N/A"},null,1,0,{"$error":"#N/A"},null,{"$error":"#N/A"},25051]
[null,"2019-05-01",{"$f":"IFERROR(IF(GETPIVOTDATA(\"Value\",Pivots!$A$6,\"Month\",$B181,\"Delay reason\",$C$23)=0,\"\",GETPIVOTDATA(\"Value\",Pivots!$A$6,\"Month\",$B181,\"Delay reason\",$C$23)),NA())","v":27789},27789,null,null,29837.279999999999,34333.345000000001,25341.214999999997,null,null,null,null,"2019-05-01",2738,1690.25,4496.0650000000005,5527.1175000000003,null,null,null,null,{"$f":"IF($D$164>5,NA(),IF(D181>H181,MAX(W$165:$W180)+1,0))","v":0},{"$f":"IF($D$164>5,NA(),IF(D181<I181,MAX(W$165:$W180)+1,0))","v":0},{"$error":"#N/A"},{"$error":"#N/A"},0,0,{"$error":"#N/A"},null,1,1,27789,null,1,0,{"$error":"#N/A"},null,0,0,{"$error":"#N/A"},null,{"$error":"#N/A"},27789]
[null,"2019-06-01",{"$f":"IFERROR(IF(GETPIVOTDATA(\"Value\",Pivots!$A$6,\"Month\",$B182,\"Delay reason\",$C$23)=0,\"\",GETPIVOTDATA(\"Value\",Pivots!$A$6,\"Month\",$B182,\"Delay reason\",$C$23)),NA())","v":27719},27719,null,null,29837.279999999999,34333.345000000001,25341.214999999997,null,null,null,null,"2019-06-01",70,1690.25,4496.0650000000005,5527.1175000000003,null,null,null,null,{"$f":"IF($D$164>5,NA(),IF(D182>H182,MAX(W$165:$W181)+1,0))","v":0},{"$f":"IF($D$164>5,NA(),IF(D182<I182,MAX(W$165:$W181)+1,0))","v":0},{"$error":"#N/A"},{"$error":"#N/A"},0,0,{"$error":"#N/A"},null,1,1,27719,null,0,0,{"$error":"#N/A"},null,1,0,{"$error":"#N/A"},null,{"$error":"#N/A"},27719]
[null,"2019-07-01",{"$f":"IFERROR(IF(GETPIVOTDATA(\"Value\",Pivots!$A$6,\"Month\",$B183,\"Delay reason\",$C$23)=0,\"\",GETPIVOTDATA(\"Value\",Pivots!$A$6,\"Month\",$B183,\"Delay reason\",$C$23)),NA())","v":29889},29889,null,null,29837.279999999999,34333.345000000001,25341.214999999997,null,null,null,null,"2019-07-01",2170,1690.25,4496.0650000000005,5527.1175000000003,null,null,null,null,{"$f":"IF($D$164>5,NA(),IF(D183>H183,MAX(W$165:$W182)+1,0))","v":0},{"$f":"IF($D$164>5,NA(),IF(D183<I183,MAX(W$165:$W182)+1,0))","v":0},{"$error":"#N/A"},{"$error":"#N/A"},1,1,29889,null,0,0,{"$error":"#N/A"},null,1,0,{"$error":"#N/A"},null,0,0,{"$error":"#N/A"},null,29889,{"$error":"#N/A"}]
[null,"2019-08-01",{"$f":"IFERROR(IF(GETPIVOTDATA(\"Value\",Pivots!$A$6,\"Month\",$B184,\"Delay reason\",$C$23)=0,\"\",GETPIVOTDATA(\"Value\",Pivots!$A$6,\"Month\",$B184,\"Delay reason\",$C$23)),NA())","v":32173},32173,null,null,29837.279999999999,34333.345000000001,25341.214999999997,null,null,null,null,"2019-08-01",2284,1690.25,4496.0650000000005,5527.1175000000003,null,null,null,null,{"$f":"IF($D$164>5,NA(),IF(D184>H184,MAX(W$165:$W183)+1,0))","v":0},{"$f":"IF($D$164>5,NA(),IF(D184<I184,MAX(W$165:$W183)+1,0))","v":0},{"$error":"#N/A"},{"$error":"#N/A"},1,1,32173,null,0,0,{"$error":"#N/A"},null,1,0,{"$error":"#N/A"},null,0,0,{"$error":"#N/A"},null,32173,{"$error":"#N/A"}]
[null,"2019-09-01",{"$f":"IFERROR(IF(GETPIVOTDATA(\"Value\",Pivots!$A$6,\"Month\",$B185,\"Delay reason\",$C$23)=0,\"\",GETPIVOTDATA(\"Value\",Pivots!$A$6,\"Month\",$B185,\"Delay reason\",$C$23)),NA())","v":32025},32025,null,null,29837.279999999999,34333.345000000001,25341.214999999997,null,null,null,null,"2019-09-01",148,1690.25,4496.0650000000005,5527.1175000000003,null,null,null,null,{"$f":"IF($D$164>5,NA(),IF(D185>H185,MAX(W$165:$W184)+1,0))","v":0},{"$f":"IF($D$164>5,NA(),IF(D185<I185,MAX(W$165:$W184)+1,0))","v":0},{"$error":"#N/A"},{"$error":"#N/A"},1,1,32025,null,0,0,{"$error":"#N/A"},null,0,0,{"$error":"#N/A"},null,1,0,{"$error":"#N/A"},null,32025,{"$error":"#N/A"}]
[null,"2019-10-01",{"$f":"IFERROR(IF(GETPIVOTDATA(\"Value\",Pivots!$A$6,\"Month\",$B186,\"Delay reason\",$C$23)=0,\"\",GETPIVOTDATA(\"Value\",Pivots!$A$6,\"Month\",$B186,\"Delay reason\",$C$23)),NA())","v":31643},31643,null,null,29837.279999999999,34333.345000000001,25341.214999999997,null,null,null,null,"2019-10-01",382,1690.25,4496.0650000000005,5527.1175000000003,null,null,null,null,{"$f":"IF($D$164>5,NA(),IF(D186>H186,MAX(W$165:$W185)+1,0))","v":0},{"$f":"IF($D$164>5,NA(),IF(D186<I186,MAX(W$165:$W185)+1,0))","v":0},{"$error":"#N/A"},{"$error":"#N/A"},1,1,31643,null,0,0,{"$error":"#N/A"},null,0,0,{"$error":"#N/A"},null,1,0,{"$error":"#N/A"},null,31643,{"$error":"#N/A"}]
[null,"2019-11-01",{"$f":"IFERROR(IF(GETPIVOTDATA(\"Value\",Pivots!$A$6,\"Month\",$B187,\"Delay reason\",$C$23)=0,\"\",GETPIVOTDATA(\"Value\",Pivots!$A$6,\"Month\",$B187,\"Delay reason\",$C$23)),NA())","v":30375},30375,null,null,29837.279999999999,34333.345000000001,25341.214999999997,null,null,null,null,"2019-11-01",1268,1690.25,4496.0650000000005,5527.1175000000003,null,null,null,null,{"$f":"IF($D$164>5,NA(),IF(D187>H187,MAX(W$165:$W186)+1,0))","v":0},{"$f":"IF($D$164>5,NA(),IF(D187<I187,MAX(W$165:$W186)+1,0))","v":0},{"$error":"#N/A"},{"$error":"#N/A"},1,{"$f":"IFERROR(IF(AND(AB186=1,AA187=1),1,IF(SUM(AA187:AA190)>=7,1,0)),NA())","v":1},{"$f":"IF(AB187=0,NA(),C187)","v":30375},null,0,{"$f":"IFERROR(IF(AND(AF186=1,AE187=1),1,IF(SUM(AE187:AE190)>=7,1,0)),NA())","v":0},{"$f":"IF(AF187=0,NA(),C187)","v":{"$error":"#N/A"}},null,0,0,{"$error":"#N/A"},null,1,0,{"$error":"#N/A"},null,30375,{"$error":"#N/A"}]
[null,"2019-12-01",{"$f":"IFERROR(IF(GETPIVOTDATA(\"Value\",Pivots!$A$6,\"Month\",$B188,\"Delay reason\",$C$23)=0,\"\",GETPIVOTDATA(\"Value\",Pivots!$A$6,\"Month\",$B188,\"Delay reason\",$C$23)),NA())","v":31393},31393,null,null,29837.279999999999,34333.345000000001,25341.214999999997,null,null,null,null,"2019-12-01",1018,1690.25,4496.0650000000005,5527.1175000000003,null,null,null,null,{"$f":"IF($D$164>5,NA(),IF(D188>H188,MAX(W$165:$W187)+1,0))","v":0},{"$f":"IF($D$164>5,NA(),IF(D188<I188,MAX(W$165:$W187)+1,0))","v":0},{"$error":"#N/A"},{"$error":"#N/A"},1,{"$f":"IFERROR(IF(AND(AB187=1,AA188=1),1,IF(SUM(AA188:AA190)>=7,1,0)),NA())","v":1},{"$f":"IF(AB188=0,NA(),C188)","v":31393},null,0,{"$f":"IFERROR(IF(AND(AF187=1,AE188=1),1,IF(SUM(AE188:AE190)>=7,1,0)),NA())","v":0},{"$f":"IF(AF188=0,NA(),C188)","v":{"$error":"#N/A"}},null,1,0,{"$error":"#N/A"},null,0,0,{"$error":"#N/A"},null,31393,{"$error":"#N/A"}]
[null,"2020-01-01",{"$f":"IFERROR(IF(GETPIVOTDATA(\"Value\",Pivots!$A$6,\"Month\",$B189,\"Delay reason\",$C$23)=0,\"\",GETPIVOTDATA(\"Value\",Pivots!$A$6,\"Month\",$B189,\"Delay reason\",$C$23)),NA())","v":34456},34456,null,null,29837.279999999999,34333.345000000001,25341.214999999997,null,null,null,null,"2020-01-01",3063,1690.25,{"$f":"IF(ISERROR((P189*2.66)),Q190,(P189*2.66))","v":4496.0650000000005},5527.1175000000003,null,null,null,null,{"$f":"IF($D$164>5,NA(),IF(D189>H189,MAX(W$165:$W188)+1,0))","v":1},{"$f":"IF($D$164>5,NA(),IF(D189<I189,MAX(W$165:$W188)+1,0))","v":0},34456,{"$error":"#N/A"},1,{"$f":"IFERROR(IF(AND(AB188=1,AA189=1),1,IF(SUM(AA189:AA195)>=7,1,0)),NA())","v":1},34456,null,0,{"$f":"IFERROR(IF(AND(AF188=1,AE189=1),1,IF(SUM(AE189:AE190)>=7,1,0)),NA())","v":0},{"$error":"#N/A"},null,1,{"$error":"#N/A"},{"$error":"#N/A"},null,0,{"$error":"#N/A"},{"$error":"#N/A"},null,{"$error":"#N/A"},{"$error":"#N/A"}]
[null,"2020-02-01",{"$f":"IFERROR(IF(GETPIVOTDATA(\"Value\",Pivots!$A$6,\"Month\",$B190,\"Delay reason\",$C$23)=0,\"\",GETPIVOTDATA(\"Value\",Pivots!$A$6,\"Month\",$B190,\"Delay reason\",$C$23)),NA())","v":32464},32464,null,null,29837.279999999999,{"$f":"IF($D$164>5,NA(),IF(D190=\"\",H189,G190+Q190))","v":34333.345000000001},{"$f":"IF($D$164>5,NA(),IF(D190=\"\",I189,G190-Q190))","v":25341.214999999997},null,null,null,null,"2020-02-01",1992,{"$f":"IF(O190=\"\",P189,AVERAGE(IF($O$166:$O$190<>\"\",$O$166:$O$190)))","v":1690.25},{"$f":"IF(ISERROR((P190*2.66)),Q191,(P190*2.66))","v":4496.0650000000005},5527.1175000000003,null,null,null,null,{"$f":"IF($D$164>5,NA(),IF(D190>H190,MAX(W$165:$W189)+1,0))","v":0},{"$f":"IF($D$164>5,NA(),IF(D190<I190,MAX(W$165:$W189)+1,0))","v":0},{"$error":"#N/A"},{"$error":"#N/A"},{"$f":"IFERROR(IF($D$164>5,NA(), IF(D190>G190,1,0)),0)","v":1},{"$f":"IFERROR(IF(AND(AB189=1,AA190=1),1,IF(SUM(AA190)>=7,1,0)),NA())","v":1},32464,null,{"$f":"IFERROR(IF($D$164>5,NA(), IF(D190<G190,1,0)),0)","v":0},{"$f":"IFERROR(IF(AND(AF189=1,AE190=1),1,IF(SUM(AE190)>=7,1,0)),NA())","v":0},{"$error":"#N/A"},null,0,{"$error":"#N/A"},{"$error":"#N/A"},null,1,{"$error":"#N/A"},{"$error":"#N/A"},null,{"$error":"#N/A"},{"$error":"#N/A"}]
[]
[null,"Grand total of reasons","pareto link","Count IF data point is blank"]
[null,{"$f":"B68","v":43678},{"$f":"ROW()","v":193},{"$f":"COUNTIF(D196:D220,\"\")","v":19},null,null,null,"Upper","Lower",null,null,null,null,"Date","Difference",null,"Sigma",null,null,null,null,null,"> 3","< 3 ",null,null,"7 points above/below mean",null,null,null,null,null,null,null,"Trend up/down",null,null,null,null,null,null,null,"chart 6"]
[null,"ID (Week no.)","Plot data","Data",null,null,"Mean","Control limits ","control limit (-3)",null,null,null,null,null,"For. Roll avg","Cumul. Moving Avg.","2.66* MR","3.27*MR",null,null,null,null,"Count","Count","Above 3 sigma","Below 3 sigma","7 points > mean","Count of 7point ","7 points above mean",null,"7 points <mean","Count of 7 point ","7points below mean",null,"Trend up",null,null,null,"Trend Down",null,null,null,"Concern","Improvement"]
[null,{"$f":"IF(AG17=0,NA(),T17)","v":{"$error":"#N/A"}},{"$f":"IFERROR(IF(GETPIVOTDATA(\"Value\",Pivots!$A$6,\"Month\",$B195)=0,\"\",GETPIVOTDATA(\"Value\",Pivots!$A$6,\"Month\",$B195)),NA())","v":{"$error":"#N/A"}},{"$f":"IFERROR(IF(C195=\"\",\"\",C195),\"\")","v":""},null,null,{"$f":"AVERAGE($D$195:$D$219)","v":152039.5},{"$f":"IF($D$193>5,NA(),IF(D195=\"\",H194,(G195+Q195)))","v":{"$error":"#N/A"}},{"$f":"IF($D$193>5,NA(),IF(D195=\"\",I194,(G195-Q195)))","v":{"$error":"#N/A"}},null,null,null,null,{"$f":"IFERROR(B195,NA())","v":{"$error":"#N/A"}},null,{"$f":"IF(O195=\"\",P194,AVERAGE(IF($O$195:$O$219<>\"\",$O$195:$O$219)))","v":"Cumul. Moving Avg."},{"$f":"Q196","v":15675.380000000001},{"$f":"R196","v":{"$error":"#VALUE!"}},null,null,null,null,{"$f":"IF($D$193>5,NA(),IF(D195>H195,MAX(W$194:$W194)+1,0))","v":{"$error":"#N/A"}},{"$f":"IF($D$193>5,NA(),IF(D195<I195,MAX(W$194:$W194)+1,0))","v":{"$error":"#N/A"}},{"$f":"IF(W195>0,C195,NA())","v":{"$error":"#N/A"}},{"$f":"IF(X195>0,D195,NA())","v":{"$error":"#N/A"}},{"$f":"IFERROR(IF($D$193>5,NA(), IF(D195>G195,1,0)),NA())","v":{"$error":"#N/A"}},{"$f":"IFERROR(IF(AND(AB194=1,AA195=1),1,IF(SUM(AA195:AA201)>=7,1,0)),0)","v":0},{"$f":"IF(AB195=0,NA(),C195)","v":{"$error":"#N/A"}},null,{"$f":"IFERROR(IF($D$193>5,NA(), IF(D195<G195,1,0)),NA())","v":{"$error":"#N/A"}},{"$f":"IFERROR(IF(AND(AF194=1,AE195=1),1,IF(SUM(AE195:AE201)>=7,1,0)),0)","v":0},{"$f":"IF(AF195=0,NA(),C195)","v":{"$error":"#N/A"}},null,{"$f":"IF($D$193>5,NA(),IF(D195>D194,1,0))","v":{"$error":"#N/A"}},{"$f":"IFERROR(IF(AND(AJ194=1,AI195=1),1,IF(SUM(AI195:AI201)>=7,1,0)),NA())","v":{"$error":"#N/A"}},{"$f":"IF(AJ195=0,NA(),C195)","v":{"$error":"#N/A"}},null,{"$f":"IF($D$193>5,NA(),IF(D195<D194,1,0))","v":{"$error":"#N/A"}},{"$f":"IFERROR(IF(AND(AN194=1,AM195=1),1,IF(SUM(AM195:AM201)>=7,1,0)),NA())","v":{"$error":"#N/A"}},{"$f":"IF(AN195=0,NA(),C195)","v":{"$error":"#N/A"}},null,{"$f":"IF(OR(W195>0,AB195>0,AJ195>0),C195,NA())","v":{"$error":"#N/A"}},{"$f":"IF(OR(X195>0,AF195>0,AN195>0),D195,NA())","v":{"$error":"#N/A"}}]
[null,{"$f":"IF(AG18=0,NA(),T18)","v":{"$error":"#N/A"}},{"$f":"IFERROR(IF(GETPIVOTDATA(\"Value\",Pivots!$A$6,\"Month\",$B196)=0,\"\",GETPIVOTDATA(\"Value\",Pivots!$A$6,\"Month\",$B196)),NA())","v":{"$error":"#N/A"}},{"$f":"IFERROR(IF(C196=\"\",\"\",C196),\"\")","v":""},null,null,{"$f":"AVERAGE($D$195:$D$219)","v":152039.5},{"$f":"IF($D$193>5,NA(),IF(D196=\"\",H195,(G196+Q196)))","v":{"$error":"#N/A"}},{"$f":"IF($D$193>5,NA(),IF(D196=\"\",I195,(G196-Q196)))","v":{"$error":"#N/A"}},null,null,null,null,{"$f":"IFERROR(B196,NA())","v":{"$error":"#N/A"}},{"$f":"IF(D195=\"\",\"\",IF(D196=\"\",\"\",ABS(D195-D196)))","v":""},"Cumul. Moving Avg.",{"$f":"IF(ISERROR((P196*2.66)),Q197,(P196*2.66))","v":15675.380000000001},{"$f":"$P196*3.27","v":{"$error":"#VALUE!"}},null,null,null,null,{"$f":"IF($D$193>5,NA(),IF(D196>H196,MAX(W$194:$W195)+1,0))","v":{"$error":"#N/A"}},{"$f":"IF($D$193>5,NA(),IF(D196<I196,MAX(W$194:$W195)+1,0))","v":{"$error":"#N/A"}},{"$f":"IF(W196>0,C196,NA())","v":{"$error":"#N/A"}},{"$f":"IF(X196>0,D196,NA())","v":{"$error":"#N/A"}},{"$f":"IFERROR(IF($D$193>5,NA(), IF(D196>G196,1,0)),NA())","v":{"$error":"#N/A"}},{"$f":"IFERROR(IF(AND(AB195=1,AA196=1),1,IF(SUM(AA196:AA202)>=7,1,0)),0)","v":0},{"$f":"IF(AB196=0,NA(),C196)","v":{"$error":"#N/A"}},null,{"$f":"IFERROR(IF($D$193>5,NA(), IF(D196<G196,1,0)),NA())","v":{"$error":"#N/A"}},{"$f":"IFERROR(IF(AND(AF195=1,AE196=1),1,IF(SUM(AE196:AE202)>=7,1,0)),0)","v":0},{"$f":"IF(AF196=0,NA(),C196)","v":{"$error":"#N/A"}},null,{"$f":"IF($D$193>5,NA(),IF(D196>D195,1,0))","v":{"$error":"#N/A"}},{"$f":"IFERROR(IF(AND(AJ195=1,AI196=1),1,IF(SUM(AI196:AI202)>=7,1,0)),NA())","v":{"$error":"#N/A"}},{"$f":"IF(AJ196=0,NA(),C196)","v":{"$error":"#N/A"}},null,{"$f":"IF($D$193>5,NA(),IF(D196<D195,1,0))","v":{"$error":"#N/A"}},{"$f":"IFERROR(IF(AND(AN195=1,AM196=1),1,IF(SUM(AM196:AM202)>=7,1,0)),NA())","v":{"$error":"#N/A"}},{"$f":"IF(AN196=0,NA(),C196)","v":{"$error":"#N/A"}},null,{"$f":"IF(OR(W196>0,AB196>0,AJ196>0),C196,NA())","v":{"$error":"#N/A"}},{"$f":"IF(OR(X196>0,AF196>0,AN196>0),D196,NA())","v":{"$error":"#N/A"}}]
[null,{"$error":"#N/A"},{"$f":"IFERROR(IF(GETPIVOTDATA(\"Value\",Pivots!$A$6,\"Month\",$B197)=0,\"\",GETPIVOTDATA(\"Value\",Pivots!$A$6,\"Month\",$B197)),NA())","v":{"$error":"#N/A"}},"",null,null,152039.5,{"$error":"#N/A"},{"$error":"#N/A"},null,null,null,null,{"$error":"#N/A"},{"$f":"IF(D196=\"\",\"\",IF(D197=\"\",\"\",ABS(D196-D197)))","v":""},"Cumul. Moving Avg.",{"$f":"IF(ISERROR((P197*2.66)),Q198,(P197*2.66))","v":15675.380000000001},{"$f":"$P197*3.27","v":{"$error":"#VALUE!"}},null,null,null,null,{"$f":"IF($D$193>5,NA(),IF(D197>H197,MAX(W$194:$W196)+1,0))","v":{"$error":"#N/A"}},{"$f":"IF($D$193>5,NA(),IF(D197<I197,MAX(W$194:$W196)+1,0))","v":{"$error":"#N/A"}},{"$error":"#N/A"},{"$error":"#N/A"},{"$error":"#N/A"},0,{"$f":"IF(AB197=0,NA(),C197)","v":{"$error":"#N/A"}},null,{"$error":"#N/A"},0,{"$f":"IF(AF197=0,NA(),C197)","v":{"$error":"#N/A"}},null,{"$error":"#N/A"},{"$error":"#N/A"},{"$f":"IF(AJ197=0,NA(),C197)","v":{"$error":"#N/A"}},null,{"$error":"#N/A"},{"$error":"#N/A"},{"$f":"IF(AN197=0,NA(),C197)","v":{"$error":"#N/A"}},null,{"$error":"#N/A"},{"$error":"#N/A"}]
[null,{"$error":"#N/A"},{"$f":"IFERROR(IF(GETPIVOTDATA(\"Value\",Pivots!$A$6,\"Month\",$B198)=0,\"\",GETPIVOTDATA(\"Value\",Pivots!$A$6,\"Month\",$B198)),NA())","v":{"$error":"#N/A"}},"",null,null,152039.5,{"$error":"#N/A"},{"$error":"#N/A"},null,null,null,null,{"$error":"#N/A"},"","Cumul. Moving Avg.",{"$f":"IF(ISERROR((P198*2.66)),Q199,(P198*2.66))","v":15675.380000000001},{"$error":"#VALUE!"},null,null,null,null,{"$f":"IF($D$193>5,NA(),IF(D198>H198,MAX(W$194:$W197)+1,0))","v":{"$error":"#N/A"}},{"$f":"IF($D$193>5,NA(),IF(D198<I198,MAX(W$194:$W197)+1,0))","v":{"$error":"#N/A"}},{"$error":"#N/A"},{"$error":"#N/A"},{"$error":"#N/A"},0,{"$error":"#N/A"},null,{"$error":"#N/A"},0,{"$error":"#N/A"},null,{"$error":"#N/A"},{"$error":"#N/A"},{"$error":"#N/A"},null,{"$error":"#N/A"},{"$error":"#N/A"},{"$error":"#N/A"},null,{"$error":"#N/A"},{"$error":"#N/A"}]
[null,{"$error":"#N/A"},{"$f":"IFERROR(IF(GETPIVOTDATA(\"Value\",Pivots!$A$6,\"Month\",$B199)=0,\"\",GETPIVOTDATA(\"Value\",Pivots!$A$6,\"Month\",$B199)),NA())","v":{"$error":"#N/A"}},"",null,null,152039.5,{"$error":"#N/A"},{"$error":"#N/A"},null,null,null,null,{"$error":"#N/A"},"","Cumul. Moving Avg.",{"$f":"IF(ISERROR((P199*2.66)),Q200,(P199*2.66))","v":15675.380000000001},{"$error":"#VALUE!"},null,null,null,null,{"$f":"IF($D$193>5,NA(),IF(D199>H199,MAX(W$194:$W198)+1,0))","v":{"$error":"#N/A"}},{"$f":"IF($D$193>5,NA(),IF(D199<I199,MAX(W$194:$W198)+1,0))","v":{"$error":"#N/A"}},{"$error":"#N/A"},{"$error":"#N/A"},{"$error":"#N/A"},0,{"$error":"#N/A"},null,{"$error":"#N/A"},0,{"$error":"#N/A"},null,{"$error":"#N/A"},{"$error":"#N/A"},{"$error":"#N/A"},null,{"$error":"#N/A"},{"$error":"#N/A"},{"$error":"#N/A"},null,{"$error":"#N/A"},{"$error":"#N/A"}]
[null,{"$error":"#N/A"},{"$f":"IFERROR(IF(GETPIVOTDATA(\"Value\",Pivots!$A$6,\"Month\",$B200)=0,\"\",GETPIVOTDATA(\"Value\",Pivots!$A$6,\"Month\",$B200)),NA())","v":{"$error":"#N/A"}},"",null,null,152039.5,{"$error":"#N/A"},{"$error":"#N/A"},null,null,null,null,{"$error":"#N/A"},"","Cumul. Moving Avg.",15675.380000000001,{"$error":"#VALUE!"},null,null,null,null,{"$f":"IF($D$193>5,NA(),IF(D200>H200,MAX(W$194:$W199)+1,0))","v":{"$error":"#N/A"}},{"$f":"IF($D$193>5,NA(),IF(D200<I200,MAX(W$194:$W199)+1,0))","v":{"$error":"#N/A"}},{"$error":"#N/A"},{"$error":"#N/A"},{"$error":"#N/A"},0,{"$error":"#N/A"},null,{"$error":"#N/A"},0,{"$error":"#N/A"},null,{"$error":"#N/A"},{"$error":"#N/A"},{"$error":"#N/A"},null,{"$error":"#N/A"},{"$error":"#N/A"},{"$error":"#N/A"},null,{"$error":"#N/A"},{"$error":"#N/A"}]
[null,{"$error":"#N/A"},{"$f":"IFERROR(IF(GETPIVOTDATA(\"Value\",Pivots!$A$6,\"Month\",$B201)=0,\"\",GETPIVOTDATA(\"Value\",Pivots!$A$6,\"Month\",$B201)),NA())","v":{"$error":"#N/A"}},"",null,null,152039.5,{"$error":"#N/A"},{"$error":"#N/A"},null,null,null,null,{"$error":"#N/A"},"","Cumul. Moving Avg.",15675.380000000001,{"$error":"#VALUE!"},null,null,null,null,{"$f":"IF($D$193>5,NA(),IF(D201>H201,MAX(W$194:$W200)+1,0))","v":{"$error":"#N/A"}},{"$f":"IF($D$193>5,NA(),IF(D201<I201,MAX(W$194:$W200)+1,0))","v":{"$error":"#N/A"}},{"$error":"#N/A"},{"$error":"#N/A"},{"$error":"#N/A"},0,{"$error":"#N/A"},null,{"$error":"#N/A"},0,{"$error":"#N/A"},null,{"$error":"#N/A"},{"$error":"#N/A"},{"$error":"#N/A"},null,{"$error":"#N/A"},{"$error":"#N/A"},{"$error":"#N/A"},null,{"$error":"#N/A"},{"$error":"#N/A"}]
[null,{"$error":"#N/A"},{"$f":"IFERROR(IF(GETPIVOTDATA(\"Value\",Pivots!$A$6,\"Month\",$B202)=0,\"\",GETPIVOTDATA(\"Value\",Pivots!$A$6,\"Month\",$B202)),NA())","v":{"$error":"#N/A"}},"",null,null,152039.5,{"$error":"#N/A"},{"$error":"#N/A"},null,null,null,null,{"$error":"#N/A"},"","Cumul. Moving Avg.",15675.380000000001,{"$error":"#VALUE!"},null,null,null,null,{"$f":"IF($D$193>5,NA(),IF(D202>H202,MAX(W$194:$W201)+1,0))","v":{"$error":"#N/A"}},{"$f":"IF($D$193>5,NA(),IF(D202<I202,MAX(W$194:$W201)+1,0))","v":{"$error":"#N/A"}},{"$error":"#N/A"},{"$error":"#N/A"},{"$error":"#N/A"},0,{"$error":"#N/A"},null,{"$error":"#N/A"},0,{"$error":"#N/A"},null,{"$error":"#N/A"},{"$error":"#N/A"},{"$error":"#N/A"},null,{"$error":"#N/A"},{"$error":"#N/A"},{"$error":"#N/A"},null,{"$error":"#N/A"},{"$error":"#N/A"}]
[null,{"$error":"#N/A"},{"$f":"IFERROR(IF(GETPIVOTDATA(\"Value\",Pivots!$A$6,\"Month\",$B203)=0,\"\",GETPIVOTDATA(\"Value\",Pivots!$A$6,\"Month\",$B203)),NA())","v":{"$error":"#N/A"}},"",null,null,152039.5,{"$error":"#N/A"},{"$error":"#N/A"},null,null,null,null,{"$error":"#N/A"},"","Cumul. Moving Avg.",15675.380000000001,{"$error":"#VALUE!"},null,null,null,null,{"$f":"IF($D$193>5,NA(),IF(D203>H203,MAX(W$194:$W202)+1,0))","v":{"$error":"#N/A"}},{"$f":"IF($D$193>5,NA(),IF(D203<I203,MAX(W$194:$W202)+1,0))","v":{"$error":"#N/A"}},{"$error":"#N/A"},{"$error":"#N/A"},{"$error":"#N/A"},0,{"$error":"#N/A"},null,{"$error":"#N/A"},0,{"$error":"#N/A"},null,{"$error":"#N/A"},{"$error":"#N/A"},{"$error":"#N/A"},null,{"$error":"#N/A"},{"$error":"#N/A"},{"$error":"#N/A"},null,{"$error":"#N/A"},{"$error":"#N/A"}]
[null,{"$error":"#N/A"},{"$f":"IFERROR(IF(GETPIVOTDATA(\"Value\",Pivots!$A$6,\"Month\",$B204)=0,\"\",GETPIVOTDATA(\"Value\",Pivots!$A$6,\"Month\",$B204)),NA())","v":{"$error":"#N/A"}},"",null,null,152039.5,{"$error":"#N/A"},{"$error":"#N/A"},null,null,null,null,{"$error":"#N/A"},"","Cumul. Moving Avg.",15675.380000000001,{"$error":"#VALUE!"},null,null,null,null,{"$f":"IF($D$193>5,NA(),IF(D204>H204,MAX(W$194:$W203)+1,0))","v":{"$error":"#N/A"}},{"$f":"IF($D$193>5,NA(),IF(D204<I204,MAX(W$194:$W203)+1,0))","v":{"$error":"#N/A"}},{"$error":"#N/A"},{"$error":"#N/A"},{"$error":"#N/A"},0,{"$error":"#N/A"},null,{"$error":"#N/A"},0,{"$error":"#N/A"},null,{"$error":"#N/A"},{"$error":"#N/A"},{"$error":"#N/A"},null,{"$error":"#N/A"},{"$error":"#N/A"},{"$error":"#N/A"},null,{"$error":"#N/A"},{"$error":"#N/A"}]
[null,{"$error":"#N/A"},{"$f":"IFERROR(IF(GETPIVOTDATA(\"Value\",Pivots!$A$6,\"Month\",$B205)=0,\"\",GETPIVOTDATA(\"Value\",Pivots!$A$6,\"Month\",$B205)),NA())","v":{"$error":"#N/A"}},"",null,null,152039.5,{"$error":"#N/A"},{"$error":"#N/A"},null,null,null,null,{"$error":"#N/A"},"","Cumul. Moving Avg.",15675.380000000001,{"$error":"#VALUE!"},null,null,null,null,{"$f":"IF($D$193>5,NA(),IF(D205>H205,MAX(W$194:$W204)+1,0))","v":{"$error":"#N/A"}},{"$f":"IF($D$193>5,NA(),IF(D205<I205,MAX(W$194:$W204)+1,0))","v":{"$error":"#N/A"}},{"$error":"#N/A"},{"$error":"#N/A"},{"$error":"#N/A"},0,{"$error":"#N/A"},null,{"$error":"#N/A"},0,{"$error":"#N/A"},null,{"$error":"#N/A"},{"$error":"#N/A"},{"$error":"#N/A"},null,{"$error":"#N/A"},{"$error":"#N/A"},{"$error":"#N/A"},null,{"$error":"#N/A"},{"$error":"#N/A"}]
[null,{"$error":"#N/A"},{"$f":"IFERROR(IF(GETPIVOTDATA(\"Value\",Pivots!$A$6,\"Month\",$B206)=0,\"\",GETPIVOTDATA(\"Value\",Pivots!$A$6,\"Month\",$B206)),NA())","v":{"$error":"#N/A"}},"",null,null,152039.5,{"$error":"#N/A"},{"$error":"#N/A"},null,null,null,null,{"$error":"#N/A"},"","Cumul. Moving Avg.",15675.380000000001,{"$error":"#VALUE!"},null,null,null,null,{"$f":"IF($D$193>5,NA(),IF(D206>H206,MAX(W$194:$W205)+1,0))","v":{"$error":"#N/A"}},{"$f":"IF($D$193>5,NA(),IF(D206<I206,MAX(W$194:$W205)+1,0))","v":{"$error":"#N/A"}},{"$error":"#N/A"},{"$error":"#N/A"},{"$error":"#N/A"},0,{"$error":"#N/A"},null,{"$error":"#N/A"},0,{"$error":"#N/A"},null,{"$error":"#N/A"},{"$error":"#N/A"},{"$error":"#N/A"},null,{"$error":"#N/A"},{"$error":"#N/A"},{"$error":"#N/A"},null,{"$error":"#N/A"},{"$error":"#N/A"}]
[null,{"$error":"#N/A"},{"$f":"IFERROR(IF(GETPIVOTDATA(\"Value\",Pivots!$A$6,\"Month\",$B207)=0,\"\",GETPIVOTDATA(\"Value\",Pivots!$A$6,\"Month\",$B207)),NA())","v":{"$error":"#N/A"}},"",null,null,152039.5,{"$error":"#N/A"},{"$error":"#N/A"},null,null,null,null,{"$error":"#N/A"},"","Cumul. Moving Avg.",15675.380000000001,{"$error":"#VALUE!"},null,null,null,null,{"$f":"IF($D$193>5,NA(),IF(D207>H207,MAX(W$194:$W206)+1,0))","v":{"$error":"#N/A"}},{"$f":"IF($D$193>5,NA(),IF(D207<I207,MAX(W$194:$W206)+1,0))","v":{"$error":"#N/A"}},{"$error":"#N/A"},{"$error":"#N/A"},{"$error":"#N/A"},0,{"$error":"#N/A"},null,{"$error":"#N/A"},0,{"$error":"#N/A"},null,{"$error":"#N/A"},{"$error":"#N/A"},{"$error":"#N/A"},null,{"$error":"#N/A"},{"$error":"#N/A"},{"$error":"#N/A"},null,{"$error":"#N/A"},{"$error":"#N/A"}]
[null,{"$error":"#N/A"},{"$f":"IFERROR(IF(GETPIVOTDATA(\"Value\",Pivots!$A$6,\"Month\",$B208)=0,\"\",GETPIVOTDATA(\"Value\",Pivots!$A$6,\"Month\",$B208)),NA())","v":{"$error":"#N/A"}},"",null,null,152039.5,{"$error":"#N/A"},{"$error":"#N/A"},null,null,null,null,{"$error":"#N/A"},"","Cumul. Moving Avg.",15675.380000000001,{"$error":"#VALUE!"},null,null,null,null,{"$f":"IF($D$193>5,NA(),IF(D208>H208,MAX(W$194:$W207)+1,0))","v":{"$error":"#N/A"}},{"$f":"IF($D$193>5,NA(),IF(D208<I208,MAX(W$194:$W207)+1,0))","v":{"$error":"#N/A"}},{"$error":"#N/A"},{"$error":"#N/A"},{"$error":"#N/A"},0,{"$error":"#N/A"},null,{"$error":"#N/A"},0,{"$error":"#N/A"},null,{"$error":"#N/A"},{"$error":"#N/A"},{"$error":"#N/A"},null,{"$error":"#N/A"},{"$error":"#N/A"},{"$error":"#N/A"},null,{"$error":"#N/A"},{"$error":"#N/A"}]
[null,{"$error":"#N/A"},{"$f":"IFERROR(IF(GETPIVOTDATA(\"Value\",Pivots!$A$6,\"Month\",$B209)=0,\"\",GETPIVOTDATA(\"Value\",Pivots!$A$6,\"Month\",$B209)),NA())","v":{"$error":"#N/A"}},"",null,null,152039.5,{"$error":"#N/A"},{"$error":"#N/A"},null,null,null,null,{"$error":"#N/A"},"","Cumul. Moving Avg.",15675.380000000001,{"$error":"#VALUE!"},null,null,null,null,{"$f":"IF($D$193>5,NA(),IF(D209>H209,MAX(W$194:$W208)+1,0))","v":{"$error":"#N/A"}},{"$f":"IF($D$193>5,NA(),IF(D209<I209,MAX(W$194:$W208)+1,0))","v":{"$error":"#N/A"}},{"$error":"#N/A"},{"$error":"#N/A"},{"$error":"#N/A"},0,{"$error":"#N/A"},null,{"$error":"#N/A"},0,{"$error":"#N/A"},null,{"$error":"#N/A"},{"$error":"#N/A"},{"$error":"#N/A"},null,{"$error":"#N/A"},{"$error":"#N/A"},{"$error":"#N/A"},null,{"$error":"#N/A"},{"$error":"#N/A"}]
[null,{"$error":"#N/A"},{"$f":"IFERROR(IF(GETPIVOTDATA(\"Value\",Pivots!$A$6,\"Month\",$B210)=0,\"\",GETPIVOTDATA(\"Value\",Pivots!$A$6,\"Month\",$B210)),NA())","v":{"$error":"#N/A"}},"",null,null,152039.5,{"$error":"#N/A"},{"$error":"#N/A"},null,null,null,null,{"$error":"#N/A"},"","Cumul. Moving Avg.",15675.380000000001,{"$error":"#VALUE!"},null,null,null,null,{"$f":"IF($D$193>5,NA(),IF(D210>H210,MAX(W$194:$W209)+1,0))","v":{"$error":"#N/A"}},{"$f":"IF($D$193>5,NA(),IF(D210<I210,MAX(W$194:$W209)+1,0))","v":{"$error":"#N/A"}},{"$error":"#N/A"},{"$error":"#N/A"},{"$error":"#N/A"},0,{"$error":"#N/A"},null,{"$error":"#N/A"},0,{"$error":"#N/A"},null,{"$error":"#N/A"},{"$error":"#N/A"},{"$error":"#N/A"},null,{"$error":"#N/A"},{"$error":"#N/A"},{"$error":"#N/A"},null,{"$error":"#N/A"},{"$error":"#N/A"}]
[null,{"$error":"#N/A"},{"$f":"IFERROR(IF(GETPIVOTDATA(\"Value\",Pivots!$A$6,\"Month\",$B211)=0,\"\",GETPIVOTDATA(\"Value\",Pivots!$A$6,\"Month\",$B211)),NA())","v":{"$error":"#N/A"}},"",null,null,152039.5,{"$error":"#N/A"},{"$error":"#N/A"},null,null,null,null,{"$error":"#N/A"},"","Cumul. Moving Avg.",15675.380000000001,{"$error":"#VALUE!"},null,null,null,null,{"$f":"IF($D$193>5,NA(),IF(D211>H211,MAX(W$194:$W210)+1,0))","v":{"$error":"#N/A"}},{"$f":"IF($D$193>5,NA(),IF(D211<I211,MAX(W$194:$W210)+1,0))","v":{"$error":"#N/A"}},{"$error":"#N/A"},{"$error":"#N/A"},{"$error":"#N/A"},0,{"$error":"#N/A"},null,{"$error":"#N/A"},0,{"$error":"#N/A"},null,{"$error":"#N/A"},{"$error":"#N/A"},{"$error":"#N/A"},null,{"$error":"#N/A"},{"$error":"#N/A"},{"$error":"#N/A"},null,{"$error":"#N/A"},{"$error":"#N/A"}]
[null,{"$error":"#N/A"},{"$f":"IFERROR(IF(GETPIVOTDATA(\"Value\",Pivots!$A$6,\"Month\",$B212)=0,\"\",GETPIVOTDATA(\"Value\",Pivots!$A$6,\"Month\",$B212)),NA())","v":{"$error":"#N/A"}},"",null,null,152039.5,{"$error":"#N/A"},{"$error":"#N/A"},null,null,null,null,{"$error":"#N/A"},"","Cumul. Moving Avg.",15675.380000000001,{"$error":"#VALUE!"},null,null,null,null,{"$f":"IF($D$193>5,NA(),IF(D212>H212,MAX(W$194:$W211)+1,0))","v":{"$error":"#N/A"}},{"$f":"IF($D$193>5,NA(),IF(D212<I212,MAX(W$194:$W211)+1,0))","v":{"$error":"#N/A"}},{"$error":"#N/A"},{"$error":"#N/A"},{"$error":"#N/A"},0,{"$error":"#N/A"},null,{"$error":"#N/A"},0,{"$error":"#N/A"},null,{"$error":"#N/A"},{"$error":"#N/A"},{"$error":"#N/A"},null,{"$error":"#N/A"},{"$error":"#N/A"},{"$error":"#N/A"},null,{"$error":"#N/A"},{"$error":"#N/A"}]
[null,{"$error":"#N/A"},{"$f":"IFERROR(IF(GETPIVOTDATA(\"Value\",Pivots!$A$6,\"Month\",$B213)=0,\"\",GETPIVOTDATA(\"Value\",Pivots!$A$6,\"Month\",$B213)),NA())","v":{"$error":"#N/A"}},"",null,null,152039.5,{"$error":"#N/A"},{"$error":"#N/A"},null,null,null,null,{"$error":"#N/A"},"","Cumul. Moving Avg.",15675.380000000001,{"$error":"#VALUE!"},null,null,null,null,{"$f":"IF($D$193>5,NA(),IF(D213>H213,MAX(W$194:$W212)+1,0))","v":{"$error":"#N/A"}},{"$f":"IF($D$193>5,NA(),IF(D213<I213,MAX(W$194:$W212)+1,0))","v":{"$error":"#N/A"}},{"$error":"#N/A"},{"$error":"#N/A"},{"$error":"#N/A"},0,{"$error":"#N/A"},null,{"$error":"#N/A"},0,{"$error":"#N/A"},null,{"$error":"#N/A"},{"$error":"#N/A"},{"$error":"#N/A"},null,{"$error":"#N/A"},{"$error":"#N/A"},{"$error":"#N/A"},null,{"$error":"#N/A"},{"$error":"#N/A"}]
[null,"2019-09-01",{"$f":"IFERROR(IF(GETPIVOTDATA(\"Value\",Pivots!$A$6,\"Month\",$B214)=0,\"\",GETPIVOTDATA(\"Value\",Pivots!$A$6,\"Month\",$B214)),NA())","v":149384},149384,null,null,152039.5,{"$error":"#N/A"},{"$error":"#N/A"},null,null,null,null,"2019-09-01","","Cumul. Moving Avg.",15675.380000000001,{"$error":"#VALUE!"},null,null,null,null,{"$f":"IF($D$193>5,NA(),IF(D214>H214,MAX(W$194:$W213)+1,0))","v":{"$error":"#N/A"}},{"$f":"IF($D$193>5,NA(),IF(D214<I214,MAX(W$194:$W213)+1,0))","v":{"$error":"#N/A"}},{"$error":"#N/A"},{"$error":"#N/A"},{"$error":"#N/A"},0,{"$error":"#N/A"},null,{"$error":"#N/A"},0,{"$error":"#N/A"},null,{"$error":"#N/A"},{"$error":"#N/A"},{"$error":"#N/A"},null,{"$error":"#N/A"},{"$error":"#N/A"},{"$error":"#N/A"},null,{"$error":"#N/A"},{"$error":"#N/A"}]
[null,"2019-10-01",{"$f":"IFERROR(IF(GETPIVOTDATA(\"Value\",Pivots!$A$6,\"Month\",$B215)=0,\"\",GETPIVOTDATA(\"Value\",Pivots!$A$6,\"Month\",$B215)),NA())","v":152522},152522,null,null,152039.5,{"$error":"#N/A"},{"$error":"#N/A"},null,null,null,null,"2019-10-01",3138,5893,15675.380000000001,19270.11,null,null,null,null,{"$f":"IF($D$193>5,NA(),IF(D215>H215,MAX(W$194:$W214)+1,0))","v":{"$error":"#N/A"}},{"$f":"IF($D$193>5,NA(),IF(D215<I215,MAX(W$194:$W214)+1,0))","v":{"$error":"#N/A"}},{"$error":"#N/A"},{"$error":"#N/A"},{"$error":"#N/A"},{"$f":"IFERROR(IF(AND(AB214=1,AA215=1),1,IF(SUM(AA215:AA220)>=7,1,0)),0)","v":0},{"$error":"#N/A"},null,{"$error":"#N/A"},{"$f":"IFERROR(IF(AND(AF214=1,AE215=1),1,IF(SUM(AE215:AE220)>=7,1,0)),0)","v":0},{"$error":"#N/A"},null,{"$error":"#N/A"},{"$f":"IFERROR(IF(AND(AJ214=1,AI215=1),1,IF(SUM(AI215:AI220)>=7,1,0)),NA())","v":{"$error":"#N/A"}},{"$error":"#N/A"},null,{"$error":"#N/A"},{"$f":"IFERROR(IF(AND(AN214=1,AM215=1),1,IF(SUM(AM215:AM220)>=7,1,0)),NA())","v":{"$error":"#N/A"}},{"$error":"#N/A"},null,{"$error":"#N/A"},{"$error":"#N/A"}]
[null,"2019-11-01",{"$f":"IFERROR(IF(GETPIVOTDATA(\"Value\",Pivots!$A$6,\"Month\",$B216)=0,\"\",GETPIVOTDATA(\"Value\",Pivots!$A$6,\"Month\",$B216)),NA())","v":145876},145876,null,null,152039.5,{"$error":"#N/A"},{"$error":"#N/A"},null,null,null,null,"2019-11-01",6646,5893,15675.380000000001,19270.11,null,null,null,null,{"$f":"IF($D$193>5,NA(),IF(D216>H216,MAX(W$194:$W215)+1,0))","v":{"$error":"#N/A"}},{"$f":"IF($D$193>5,NA(),IF(D216<I216,MAX(W$194:$W215)+1,0))","v":{"$error":"#N/A"}},{"$error":"#N/A"},{"$error":"#N/A"},{"$error":"#N/A"},{"$f":"IFERROR(IF(AND(AB215=1,AA216=1),1,IF(SUM(AA216:AA220)>=7,1,0)),0)","v":0},{"$error":"#N/A"},null,{"$error":"#N/A"},{"$f":"IFERROR(IF(AND(AF215=1,AE216=1),1,IF(SUM(AE216:AE220)>=7,1,0)),0)","v":0},{"$error":"#N/A"},null,{"$error":"#N/A"},{"$f":"IFERROR(IF(AND(AJ215=1,AI216=1),1,IF(SUM(AI216:AI220)>=7,1,0)),NA())","v":{"$error":"#N/A"}},{"$error":"#N/A"},null,{"$error":"#N/A"},{"$f":"IFERROR(IF(AND(AN215=1,AM216=1),1,IF(SUM(AM216:AM220)>=7,1,0)),NA())","v":{"$error":"#N/A"}},{"$error":"#N/A"},null,{"$error":"#N/A"},{"$error":"#N/A"}]
[null,"2019-12-01",{"$f":"IFERROR(IF(GETPIVOTDATA(\"Value\",Pivots!$A$6,\"Month\",$B217)=0,\"\",GETPIVOTDATA(\"Value\",Pivots!$A$6,\"Month\",$B217)),NA())","v":148101},148101,null,null,152039.5,{"$error":"#N/A"},{"$error":"#N/A"},null,null,null,null,"2019-12-01",2225,5893,15675.380000000001,19270.11,null,null,null,null,{"$f":"IF($D$193>5,NA(),IF(D217>H217,MAX(W$194:$W216)+1,0))","v":{"$error":"#N/A"}},{"$f":"IF($D$193>5,NA(),IF(D217<I217,MAX(W$194:$W216)+1,0))","v":{"$error":"#N/A"}},{"$error":"#N/A"},{"$error":"#N/A"},{"$error":"#N/A"},{"$f":"IFERROR(IF(AND(AB216=1,AA217=1),1,IF(SUM(AA217:AA220)>=7,1,0)),0)","v":0},{"$error":"#N/A"},null,{"$error":"#N/A"},{"$f":"IFERROR(IF(AND(AF216=1,AE217=1),1,IF(SUM(AE217:AE220)>=7,1,0)),0)","v":0},{"$error":"#N/A"},null,{"$error":"#N/A"},{"$f":"IFERROR(IF(AND(AJ216=1,AI217=1),1,IF(SUM(AI217:AI220)>=7,1,0)),NA())","v":{"$error":"#N/A"}},{"$error":"#N/A"},null,{"$error":"#N/A"},{"$f":"IFERROR(IF(AND(AN216=1,AM217=1),1,IF(SUM(AM217:AM220)>=7,1,0)),NA())","v":{"$error":"#N/A"}},{"$error":"#N/A"},null,{"$error":"#N/A"},{"$error":"#N/A"}]
[null,"2020-01-01",{"$f":"IFERROR(IF(GETPIVOTDATA(\"Value\",Pivots!$A$6,\"Month\",$B218)=0,\"\",GETPIVOTDATA(\"Value\",Pivots!$A$6,\"Month\",$B218)),NA())","v":160637},160637,null,null,152039.5,{"$error":"#N/A"},{"$error":"#N/A"},null,null,null,null,"2020-01-01",12536,5893,{"$f":"IF(ISERROR((P218*2.66)),Q219,(P218*2.66))","v":15675.380000000001},19270.11,null,null,null,null,{"$f":"IF($D$193>5,NA(),IF(D218>H218,MAX(W$194:$W217)+1,0))","v":{"$error":"#N/A"}},{"$f":"IF($D$193>5,NA(),IF(D218<I218,MAX(W$194:$W217)+1,0))","v":{"$error":"#N/A"}},{"$error":"#N/A"},{"$error":"#N/A"},{"$error":"#N/A"},{"$f":"IFERROR(IF(AND(AB217=1,AA218=1),1,IF(SUM(AA218:AA220)>=7,1,0)),0)","v":0},{"$error":"#N/A"},null,{"$error":"#N/A"},{"$f":"IFERROR(IF(AND(AF217=1,AE218=1),1,IF(SUM(AE218:AE220)>=7,1,0)),0)","v":0},{"$error":"#N/A"},null,{"$error":"#N/A"},{"$f":"IFERROR(IF(AND(AJ217=1,AI218=1),1,IF(SUM(AI218:AI220)>=7,1,0)),NA())","v":{"$error":"#N/A"}},{"$error":"#N/A"},null,{"$error":"#N/A"},{"$f":"IFERROR(IF(AND(AN217=1,AM218=1),1,IF(SUM(AM218:AM220)>=7,1,0)),NA())","v":{"$error":"#N/A"}},{"$error":"#N/A"},null,{"$error":"#N/A"},{"$error":"#N/A"}]
[null,"2020-02-01",{"$f":"IFERROR(IF(GETPIVOTDATA(\"Value\",Pivots!$A$6,\"Month\",$B219)=0,\"\",GETPIVOTDATA(\"Value\",Pivots!$A$6,\"Month\",$B219)),NA())","v":155717},155717,null,null,152039.5,{"$error":"#N/A"},{"$error":"#N/A"},null,null,null,null,"2020-02-01",{"$f":"IF(D218=\"\",\"\",IF(D219=\"\",\"\",ABS(D218-D219)))","v":4920},{"$f":"IF(O219=\"\",P218,AVERAGE(IF($O$195:$O$219<>\"\",$O$195:$O$219)))","v":5893},{"$f":"IF(ISERROR((P219*2.66)),Q220,(P219*2.66))","v":15675.380000000001},19270.11,null,null,null,null,{"$f":"IF($D$193>5,NA(),IF(D219>H219,MAX(W$194:$W218)+1,0))","v":{"$error":"#N/A"}},{"$f":"IF($D$193>5,NA(),IF(D219<I219,MAX(W$194:$W218)+1,0))","v":{"$error":"#N/A"}},{"$error":"#N/A"},{"$error":"#N/A"},{"$f":"IFERROR(IF($D$193>5,NA(), IF(D219>G219,1,0)),NA())","v":{"$error":"#N/A"}},{"$f":"IFERROR(IF(AND(AB218=1,AA219=1),1,IF(SUM(AA219:AA220)>=7,1,0)),0)","v":0},{"$error":"#N/A"},null,{"$error":"#N/A"},{"$f":"IFERROR(IF(AND(AF218=1,AE219=1),1,IF(SUM(AE219:AE220)>=7,1,0)),0)","v":0},{"$error":"#N/A"},null,{"$error":"#N/A"},{"$f":"IFERROR(IF(AND(AJ218=1,AI219=1),1,IF(SUM(AI219:AI220)>=7,1,0)),NA())","v":{"$error":"#N/A"}},{"$error":"#N/A"},null,{"$error":"#N/A"},{"$f":"IFERROR(IF(AND(AN218=1,AM219=1),1,IF(SUM(AM219:AM220)>=7,1,0)),NA())","v":{"$error":"#N/A"}},{"$error":"#N/A"},null,{"$error":"#N/A"},{"$error":"#N/A"}]
[]
[]
[null,{"$f":"IF($AG$17>0,$T$17,NA())","v":{"$error":"#N/A"}}]

{"sheet":"DTOC_Tool LA","index":3,"n_rows":49,"n_cols":33,"rows_kept":49,"cut":false,"hidden":false,"merged":[[1,1,5,27],[7,21,7,27],[8,21,8,27],[7,12,7,15],[7,17,7,19],[8,12,8,15],[8,17,8,19],[7,1,7,10],[8,1,8,10],[38,1,38,9],[38,11,38,19],[24,21,24,22],[24,1,24,9],[24,11,24,19],[38,21,50,28]]}
[]
[null,"Delayed transfer of care (local authority level) \nBy reason (number of delayed days)"]
[null,null,null,null,null,null,null,null,null,null,null,null,null,null,null,null,null,null,null,null,null,null,null,null,null,null,null,null,null,null,null,"Click on button to go to:"]
[]
[]
[]
[]
[null,"Region",null,null,null,null,null,null,null,null,null,null,"Type",null,null,null,null,"Source",null,null,null,"Local authority",null,null,null,null,null,null,null,null,"To view England overview remove filters from 'Region' and 'Local authority'"]
[null,{"$f":"IF(LA_Charts!$E$12=1,\"(All)\",LA_Charts!$D$12)","v":"(All)"},null,null,null,null,null,null,null,null,null,null,{"$f":"LA_Charts!C14","v":"(All)"},null,null,null,null,{"$f":"LA_Charts!C13","v":"(All)"},null,null,null,{"$f":"IF(LA_Charts!$E$11=1,\"(All)\",LA_Charts!$D$11)","v":"(All)"}]
[]
[]
[]
[]
[]
[]
[]
[]
[]
[]
[]
[]
[]
[]
[]
[]
[]
[]
[]
[]
[]
[]
[null,null,null,null,null,null,null,null,null,null,null,null,null,null,null,null,null,null,null,null,null,null,null,null,null,null,null,null,null,null,"\n"]
[]
[]
[]
[null,null,null,null,null,null,null,null,null,null,null,null,null,null,null,null,null,null,null,null,null,null,null,null,null,null,null,null,null,null,"Key:"]
[]
[]
[null,null,null,null,null,null,null,null,null,null,null,null,null,null,null,null,null,null,null,null,null,"Additional comments:\nThe five charts displaying the reasons will change from SPC charts to run charts if more than 5 data points are 0. \n\nThe Pareto chart will display the number of delayed days for the period selected and will rank them in descending order. \n\nThe four charts underneath will display the last 25 months of data for each of the top four reasons. \n\nThe user can select to display a fifth chart and the reason it displays."]
[]
[]
[]
[]
[]
[]
[]
[]
[]
[null,null,null,null,null,null,null,null,null,null,null,null,null,null,null,null,null,null,null,null,null,null,null,null,null,null,null,null,null,null,null,null,"`"]

{"sheet":"LA_Charts","index":4,"n_rows":214,"n_cols":45,"rows_kept":214,"cut":false,"hidden":true,"merged":[[8,1,8,2],[40,22,40,41],[42,19,43,19],[42,20,43,20],[42,26,42,32],[42,34,42,40],[21,2,21,5],[12,13,14,15],[17,2,17,5],[18,2,18,5],[19,2,19,5],[20,2,20,5],[16,2,16,5],[42,14,42,15],[42,16,42,17],[71,34,71,40],[129,14,129,15],[129,16,129,17],[71,14,71,15],[71,16,71,17],[71,19,72,19],[71,20,72,20],[71,26,71,32],[100,34,100,40],[100,26,100,32],[129,20,130,20],[129,26,129,32],[129,34,129,40],[100,14,100,15],[100,16,100,17],[187,14,187,15],[187,16,187,17],[187,26,187,32],[187,34,187,40],[158,14,158,15],[158,16,158,17],[158,34,158,40],[158,26,158,32]]}
[]
[null,"Source"]
[null,"Earliest week",null,{"$f":"MIN(Pivots_LA!$A$9:$A$36)","v":"2018-02-01"}]
[null,"Last date",null,{"$f":"MAX(Pivots_LA!$A$9:$A$36)","v":"2020-02-01"}]
[]
[null,null,null,null,null,null,null,null,null,null,null,null,null,null,null,null,null,"Chart title",null,{"$f":"IF(U10=1,T7,T8)","v":"Pareto chart showing delayed days by reason for 6 months"}]
[null,null,null,null,null,null,null,null,null,null,null,null,null,null,null,null,null,null,null,{"$f":"\"Pareto chart showing delayed days by reason for\" &\" \"&U10&\" \"&\"month\"","v":"Pareto chart showing delayed days by reason for 6 month"}]
[null,null,null,null,null,null,null,null,null,null,null,null,null,null,null,null,null,null,null,{"$f":"\"Pareto chart showing delayed days by reason for\" &\" \"&U10&\" \"&\"months\"","v":"Pareto chart showing delayed days by reason for 6 months"}]
[null,"Start month ",null,{"$f":"D3","v":"2018-02-01"}]
[null,null,null,null,"IF = all put 1 else 0",null,null,null,null,null,null,null,null,null,null,null,null,null,null,"Total months",{"$f":"COUNT(V14:V38)","v":6}]
[null,"LA Name",{"$f":"Pivots_LA!B2","v":"(All)"},{"$f":"IF(C11=\"(All)\",\"England\",C11)","v":"England"},{"$f":"IF(AND(C11=\"(All)\"),1,0)","v":1}]
[null,"Region ref",{"$f":"Pivots_LA!B6","v":"(All)"},{"$f":"IF(C12=\"(All)\",\"England\",C12)","v":"England"},{"$f":"IF(AND(C12=\"(All)\"),1,0)","v":1},null,null,null,null,null,null,null,null,null,null,null,null,null,null,null,null,1,2,3,4,5,6,7,8,9,10,11]
[null,"Source",{"$f":"Pivots_LA!B4","v":"(All)"},{"$f":"IF(D12=\"England\",\"All\",C13)","v":"All"},null,null,null,null,null,null,null,null,null,"Delayed reasons adjust date range calculations",null,null,null,null,null,"Month","Region","A) Awaiting completion of assessment","B) Awaiting public funding","C) Awaiting further non-acute NHS care (including intermediate care, rehabilitation services etc)","Di) Awaiting residential home placement or availability","Dii) Awaiting nursing home placement or availability","E) Awaiting care package in own home","F) Awaiting community equipment and adaptations","G) Patient or family choice","H) Disputes","I) Housing – patients not covered by NHS Care Act","O) Other"]
[null,"Type",{"$f":"Pivots_LA!B3","v":"(All)"},{"$f":"IF(D12=\"England\",\"All\",C14)","v":"All"},null,null,null,null,null,null,null,null,null,null,null,null,null,null,1,{"$f":"B45","v":"2018-02-01"},{"$f":"$C$12","v":"(All)"},{"$f":"IFERROR(IF(AND($T14>=$P$23,$T14<=$P$24),(GETPIVOTDATA(\"Value\",Pivots_LA!$A$6,\"Month\",$T14,\"Delay reason\",V$13)),\"\"),0)","v":""},{"$f":"IFERROR(IF(AND($T14>=$P$23,$T14<=$P$24),(GETPIVOTDATA(\"Value\",Pivots_LA!$A$6,\"Month\",$T14,\"Delay reason\",W$13)),\"\"),0)","v":""},{"$f":"IFERROR(IF(AND($T14>=$P$23,$T14<=$P$24),(GETPIVOTDATA(\"Value\",Pivots_LA!$A$6,\"Month\",$T14,\"Delay reason\",X$13)),\"\"),0)","v":""},{"$f":"IFERROR(IF(AND($T14>=$P$23,$T14<=$P$24),(GETPIVOTDATA(\"Value\",Pivots_LA!$A$6,\"Month\",$T14,\"Delay reason\",Y$13)),\"\"),0)","v":""},{"$f":"IFERROR(IF(AND($T14>=$P$23,$T14<=$P$24),(GETPIVOTDATA(\"Value\",Pivots_LA!$A$6,\"Month\",$T14,\"Delay reason\",Z$13)),\"\"),0)","v":""},{"$f":"IFERROR(IF(AND($T14>=$P$23,$T14<=$P$24),(GETPIVOTDATA(\"Value\",Pivots_LA!$A$6,\"Month\",$T14,\"Delay reason\",AA$13)),\"\"),0)","v":""},{"$f":"IFERROR(IF(AND($T14>=$P$23,$T14<=$P$24),(GETPIVOTDATA(\"Value\",Pivots_LA!$A$6,\"Month\",$T14,\"Delay reason\",AB$13)),\"\"),0)","v":""},{"$f":"IFERROR(IF(AND($T14>=$P$23,$T14<=$P$24),(GETPIVOTDATA(\"Value\",Pivots_LA!$A$6,\"Month\",$T14,\"Delay reason\",AC$13)),\"\"),0)","v":""},{"$f":"IFERROR(IF(AND($T14>=$P$23,$T14<=$P$24),(GETPIVOTDATA(\"Value\",Pivots_LA!$A$6,\"Month\",$T14,\"Delay reason\",AD$13)),\"\"),0)","v":""},{"$f":"IFERROR(IF(AND($T14>=$P$23,$T14<=$P$24),(GETPIVOTDATA(\"Value\",Pivots_LA!$A$6,\"Month\",$T14,\"Delay reason\",AE$13)),\"\"),0)","v":""},{"$f":"IFERROR(IF(AND($T14>=$P$23,$T14<=$P$24),(GETPIVOTDATA(\"Value\",Pivots_LA!$A$6,\"Month\",$T14,\"Delay reason\",AF$13)),\"\"),0)","v":""},{"$f":"COUNT(V14:AF14)","v":0}]
[null,null,null,null,null,null,null,null,null,null,null,null,null,null,null,null,null,null,2,"2018-03-01","(All)",{"$f":"IFERROR(IF(AND($T15>=$P$23,$T15<=$P$24),(GETPIVOTDATA(\"Value\",Pivots_LA!$A$6,\"Month\",$T15,\"Delay reason\",V$13)),\"\"),0)","v":""},{"$f":"IFERROR(IF(AND($T15>=$P$23,$T15<=$P$24),(GETPIVOTDATA(\"Value\",Pivots_LA!$A$6,\"Month\",$T15,\"Delay reason\",W$13)),\"\"),0)","v":""},{"$f":"IFERROR(IF(AND($T15>=$P$23,$T15<=$P$24),(GETPIVOTDATA(\"Value\",Pivots_LA!$A$6,\"Month\",$T15,\"Delay reason\",X$13)),\"\"),0)","v":""},{"$f":"IFERROR(IF(AND($T15>=$P$23,$T15<=$P$24),(GETPIVOTDATA(\"Value\",Pivots_LA!$A$6,\"Month\",$T15,\"Delay reason\",Y$13)),\"\"),0)","v":""},{"$f":"IFERROR(IF(AND($T15>=$P$23,$T15<=$P$24),(GETPIVOTDATA(\"Value\",Pivots_LA!$A$6,\"Month\",$T15,\"Delay reason\",Z$13)),\"\"),0)","v":""},{"$f":"IFERROR(IF(AND($T15>=$P$23,$T15<=$P$24),(GETPIVOTDATA(\"Value\",Pivots_LA!$A$6,\"Month\",$T15,\"Delay reason\",AA$13)),\"\"),0)","v":""},{"$f":"IFERROR(IF(AND($T15>=$P$23,$T15<=$P$24),(GETPIVOTDATA(\"Value\",Pivots_LA!$A$6,\"Month\",$T15,\"Delay reason\",AB$13)),\"\"),0)","v":""},{"$f":"IFERROR(IF(AND($T15>=$P$23,$T15<=$P$24),(GETPIVOTDATA(\"Value\",Pivots_LA!$A$6,\"Month\",$T15,\"Delay reason\",AC$13)),\"\"),0)","v":""},{"$f":"IFERROR(IF(AND($T15>=$P$23,$T15<=$P$24),(GETPIVOTDATA(\"Value\",Pivots_LA!$A$6,\"Month\",$T15,\"Delay reason\",AD$13)),\"\"),0)","v":""},{"$f":"IFERROR(IF(AND($T15>=$P$23,$T15<=$P$24),(GETPIVOTDATA(\"Value\",Pivots_LA!$A$6,\"Month\",$T15,\"Delay reason\",AE$13)),\"\"),0)","v":""},{"$f":"IFERROR(IF(AND($T15>=$P$23,$T15<=$P$24),(GETPIVOTDATA(\"Value\",Pivots_LA!$A$6,\"Month\",$T15,\"Delay reason\",AF$13)),\"\"),0)","v":""},{"$f":"COUNT(V15:AF15)","v":0}]
[null,"Chart number","Title",null,null,null,null,null,null,"Chart look-up ref",null,null,null,null,"Date start",20,null,null,3,"2018-04-01","(All)",{"$f":"IFERROR(IF(AND($T16>=$P$23,$T16<=$P$24),(GETPIVOTDATA(\"Value\",Pivots_LA!$A$6,\"Month\",$T16,\"Delay reason\",V$13)),\"\"),0)","v":""},{"$f":"IFERROR(IF(AND($T16>=$P$23,$T16<=$P$24),(GETPIVOTDATA(\"Value\",Pivots_LA!$A$6,\"Month\",$T16,\"Delay reason\",W$13)),\"\"),0)","v":""},{"$f":"IFERROR(IF(AND($T16>=$P$23,$T16<=$P$24),(GETPIVOTDATA(\"Value\",Pivots_LA!$A$6,\"Month\",$T16,\"Delay reason\",X$13)),\"\"),0)","v":""},{"$f":"IFERROR(IF(AND($T16>=$P$23,$T16<=$P$24),(GETPIVOTDATA(\"Value\",Pivots_LA!$A$6,\"Month\",$T16,\"Delay reason\",Y$13)),\"\"),0)","v":""},{"$f":"IFERROR(IF(AND($T16>=$P$23,$T16<=$P$24),(GETPIVOTDATA(\"Value\",Pivots_LA!$A$6,\"Month\",$T16,\"Delay reason\",Z$13)),\"\"),0)","v":""},{"$f":"IFERROR(IF(AND($T16>=$P$23,$T16<=$P$24),(GETPIVOTDATA(\"Value\",Pivots_LA!$A$6,\"Month\",$T16,\"Delay reason\",AA$13)),\"\"),0)","v":""},{"$f":"IFERROR(IF(AND($T16>=$P$23,$T16<=$P$24),(GETPIVOTDATA(\"Value\",Pivots_LA!$A$6,\"Month\",$T16,\"Delay reason\",AB$13)),\"\"),0)","v":""},{"$f":"IFERROR(IF(AND($T16>=$P$23,$T16<=$P$24),(GETPIVOTDATA(\"Value\",Pivots_LA!$A$6,\"Month\",$T16,\"Delay reason\",AC$13)),\"\"),0)","v":""},{"$f":"IFERROR(IF(AND($T16>=$P$23,$T16<=$P$24),(GETPIVOTDATA(\"Value\",Pivots_LA!$A$6,\"Month\",$T16,\"Delay reason\",AD$13)),\"\"),0)","v":""},{"$f":"IFERROR(IF(AND($T16>=$P$23,$T16<=$P$24),(GETPIVOTDATA(\"Value\",Pivots_LA!$A$6,\"Month\",$T16,\"Delay reason\",AE$13)),\"\"),0)","v":""},{"$f":"IFERROR(IF(AND($T16>=$P$23,$T16<=$P$24),(GETPIVOTDATA(\"Value\",Pivots_LA!$A$6,\"Month\",$T16,\"Delay reason\",AF$13)),\"\"),0)","v":""},0]
[null,1,"Local Authority Delayed reasons",null,null,null,null,null,null,null,null,null,null,null,"Date end",6,null,null,4,"2018-05-01","(All)",{"$f":"IFERROR(IF(AND($T17>=$P$23,$T17<=$P$24),(GETPIVOTDATA(\"Value\",Pivots_LA!$A$6,\"Month\",$T17,\"Delay reason\",V$13)),\"\"),0)","v":""},{"$f":"IFERROR(IF(AND($T17>=$P$23,$T17<=$P$24),(GETPIVOTDATA(\"Value\",Pivots_LA!$A$6,\"Month\",$T17,\"Delay reason\",W$13)),\"\"),0)","v":""},{"$f":"IFERROR(IF(AND($T17>=$P$23,$T17<=$P$24),(GETPIVOTDATA(\"Value\",Pivots_LA!$A$6,\"Month\",$T17,\"Delay reason\",X$13)),\"\"),0)","v":""},{"$f":"IFERROR(IF(AND($T17>=$P$23,$T17<=$P$24),(GETPIVOTDATA(\"Value\",Pivots_LA!$A$6,\"Month\",$T17,\"Delay reason\",Y$13)),\"\"),0)","v":""},{"$f":"IFERROR(IF(AND($T17>=$P$23,$T17<=$P$24),(GETPIVOTDATA(\"Value\",Pivots_LA!$A$6,\"Month\",$T17,\"Delay reason\",Z$13)),\"\"),0)","v":""},{"$f":"IFERROR(IF(AND($T17>=$P$23,$T17<=$P$24),(GETPIVOTDATA(\"Value\",Pivots_LA!$A$6,\"Month\",$T17,\"Delay reason\",AA$13)),\"\"),0)","v":""},{"$f":"IFERROR(IF(AND($T17>=$P$23,$T17<=$P$24),(GETPIVOTDATA(\"Value\",Pivots_LA!$A$6,\"Month\",$T17,\"Delay reason\",AB$13)),\"\"),0)","v":""},{"$f":"IFERROR(IF(AND($T17>=$P$23,$T17<=$P$24),(GETPIVOTDATA(\"Value\",Pivots_LA!$A$6,\"Month\",$T17,\"Delay reason\",AC$13)),\"\"),0)","v":""},{"$f":"IFERROR(IF(AND($T17>=$P$23,$T17<=$P$24),(GETPIVOTDATA(\"Value\",Pivots_LA!$A$6,\"Month\",$T17,\"Delay reason\",AD$13)),\"\"),0)","v":""},{"$f":"IFERROR(IF(AND($T17>=$P$23,$T17<=$P$24),(GETPIVOTDATA(\"Value\",Pivots_LA!$A$6,\"Month\",$T17,\"Delay reason\",AE$13)),\"\"),0)","v":""},{"$f":"IFERROR(IF(AND($T17>=$P$23,$T17<=$P$24),(GETPIVOTDATA(\"Value\",Pivots_LA!$A$6,\"Month\",$T17,\"Delay reason\",AF$13)),\"\"),0)","v":""},0]
[null,2,{"$f":"$J29","v":"E) Awaiting care package in own home"},null,null,null,null,null,null,{"$f":"VLOOKUP(C18,ReferenceSheet!$B$2:$C$12,2,0)","v":6},null,null,null,null,null,null,null,null,5,"2018-06-01","(All)",{"$f":"IFERROR(IF(AND($T18>=$P$23,$T18<=$P$24),(GETPIVOTDATA(\"Value\",Pivots_LA!$A$6,\"Month\",$T18,\"Delay reason\",V$13)),\"\"),0)","v":""},{"$f":"IFERROR(IF(AND($T18>=$P$23,$T18<=$P$24),(GETPIVOTDATA(\"Value\",Pivots_LA!$A$6,\"Month\",$T18,\"Delay reason\",W$13)),\"\"),0)","v":""},{"$f":"IFERROR(IF(AND($T18>=$P$23,$T18<=$P$24),(GETPIVOTDATA(\"Value\",Pivots_LA!$A$6,\"Month\",$T18,\"Delay reason\",X$13)),\"\"),0)","v":""},{"$f":"IFERROR(IF(AND($T18>=$P$23,$T18<=$P$24),(GETPIVOTDATA(\"Value\",Pivots_LA!$A$6,\"Month\",$T18,\"Delay reason\",Y$13)),\"\"),0)","v":""},{"$f":"IFERROR(IF(AND($T18>=$P$23,$T18<=$P$24),(GETPIVOTDATA(\"Value\",Pivots_LA!$A$6,\"Month\",$T18,\"Delay reason\",Z$13)),\"\"),0)","v":""},{"$f":"IFERROR(IF(AND($T18>=$P$23,$T18<=$P$24),(GETPIVOTDATA(\"Value\",Pivots_LA!$A$6,\"Month\",$T18,\"Delay reason\",AA$13)),\"\"),0)","v":""},{"$f":"IFERROR(IF(AND($T18>=$P$23,$T18<=$P$24),(GETPIVOTDATA(\"Value\",Pivots_LA!$A$6,\"Month\",$T18,\"Delay reason\",AB$13)),\"\"),0)","v":""},{"$f":"IFERROR(IF(AND($T18>=$P$23,$T18<=$P$24),(GETPIVOTDATA(\"Value\",Pivots_LA!$A$6,\"Month\",$T18,\"Delay reason\",AC$13)),\"\"),0)","v":""},{"$f":"IFERROR(IF(AND($T18>=$P$23,$T18<=$P$24),(GETPIVOTDATA(\"Value\",Pivots_LA!$A$6,\"Month\",$T18,\"Delay reason\",AD$13)),\"\"),0)","v":""},{"$f":"IFERROR(IF(AND($T18>=$P$23,$T18<=$P$24),(GETPIVOTDATA(\"Value\",Pivots_LA!$A$6,\"Month\",$T18,\"Delay reason\",AE$13)),\"\"),0)","v":""},{"$f":"IFERROR(IF(AND($T18>=$P$23,$T18<=$P$24),(GETPIVOTDATA(\"Value\",Pivots_LA!$A$6,\"Month\",$T18,\"Delay reason\",AF$13)),\"\"),0)","v":""},0]
[null,3,{"$f":"$J30","v":"C) Awaiting further non-acute NHS care (including intermediate care, rehabilitation services etc)"},null,null,null,null,null,null,3,null,null,null,null,"Offset end date",{"$f":"P16-1","v":19},null,null,6,"2018-07-01","(All)",{"$f":"IFERROR(IF(AND($T19>=$P$23,$T19<=$P$24),(GETPIVOTDATA(\"Value\",Pivots_LA!$A$6,\"Month\",$T19,\"Delay reason\",V$13)),\"\"),0)","v":""},{"$f":"IFERROR(IF(AND($T19>=$P$23,$T19<=$P$24),(GETPIVOTDATA(\"Value\",Pivots_LA!$A$6,\"Month\",$T19,\"Delay reason\",W$13)),\"\"),0)","v":""},{"$f":"IFERROR(IF(AND($T19>=$P$23,$T19<=$P$24),(GETPIVOTDATA(\"Value\",Pivots_LA!$A$6,\"Month\",$T19,\"Delay reason\",X$13)),\"\"),0)","v":""},{"$f":"IFERROR(IF(AND($T19>=$P$23,$T19<=$P$24),(GETPIVOTDATA(\"Value\",Pivots_LA!$A$6,\"Month\",$T19,\"Delay reason\",Y$13)),\"\"),0)","v":""},{"$f":"IFERROR(IF(AND($T19>=$P$23,$T19<=$P$24),(GETPIVOTDATA(\"Value\",Pivots_LA!$A$6,\"Month\",$T19,\"Delay reason\",Z$13)),\"\"),0)","v":""},{"$f":"IFERROR(IF(AND($T19>=$P$23,$T19<=$P$24),(GETPIVOTDATA(\"Value\",Pivots_LA!$A$6,\"Month\",$T19,\"Delay reason\",AA$13)),\"\"),0)","v":""},{"$f":"IFERROR(IF(AND($T19>=$P$23,$T19<=$P$24),(GETPIVOTDATA(\"Value\",Pivots_LA!$A$6,\"Month\",$T19,\"Delay reason\",AB$13)),\"\"),0)","v":""},{"$f":"IFERROR(IF(AND($T19>=$P$23,$T19<=$P$24),(GETPIVOTDATA(\"Value\",Pivots_LA!$A$6,\"Month\",$T19,\"Delay reason\",AC$13)),\"\"),0)","v":""},{"$f":"IFERROR(IF(AND($T19>=$P$23,$T19<=$P$24),(GETPIVOTDATA(\"Value\",Pivots_LA!$A$6,\"Month\",$T19,\"Delay reason\",AD$13)),\"\"),0)","v":""},{"$f":"IFERROR(IF(AND($T19>=$P$23,$T19<=$P$24),(GETPIVOTDATA(\"Value\",Pivots_LA!$A$6,\"Month\",$T19,\"Delay reason\",AE$13)),\"\"),0)","v":""},{"$f":"IFERROR(IF(AND($T19>=$P$23,$T19<=$P$24),(GETPIVOTDATA(\"Value\",Pivots_LA!$A$6,\"Month\",$T19,\"Delay reason\",AF$13)),\"\"),0)","v":""},0]
[null,4,{"$f":"$J31","v":"Dii) Awaiting nursing home placement or availability"},null,null,null,null,null,null,{"$f":"VLOOKUP(C20,ReferenceSheet!$B$2:$C$12,2,0)","v":5},null,null,null,null,"Count",26,null,null,7,"2018-08-01","(All)",{"$f":"IFERROR(IF(AND($T20>=$P$23,$T20<=$P$24),(GETPIVOTDATA(\"Value\",Pivots_LA!$A$6,\"Month\",$T20,\"Delay reason\",V$13)),\"\"),0)","v":""},{"$f":"IFERROR(IF(AND($T20>=$P$23,$T20<=$P$24),(GETPIVOTDATA(\"Value\",Pivots_LA!$A$6,\"Month\",$T20,\"Delay reason\",W$13)),\"\"),0)","v":""},{"$f":"IFERROR(IF(AND($T20>=$P$23,$T20<=$P$24),(GETPIVOTDATA(\"Value\",Pivots_LA!$A$6,\"Month\",$T20,\"Delay reason\",X$13)),\"\"),0)","v":""},{"$f":"IFERROR(IF(AND($T20>=$P$23,$T20<=$P$24),(GETPIVOTDATA(\"Value\",Pivots_LA!$A$6,\"Month\",$T20,\"Delay reason\",Y$13)),\"\"),0)","v":""},{"$f":"IFERROR(IF(AND($T20>=$P$23,$T20<=$P$24),(GETPIVOTDATA(\"Value\",Pivots_LA!$A$6,\"Month\",$T20,\"Delay reason\",Z$13)),\"\"),0)","v":""},{"$f":"IFERROR(IF(AND($T20>=$P$23,$T20<=$P$24),(GETPIVOTDATA(\"Value\",Pivots_LA!$A$6,\"Month\",$T20,\"Delay reason\",AA$13)),\"\"),0)","v":""},{"$f":"IFERROR(IF(AND($T20>=$P$23,$T20<=$P$24),(GETPIVOTDATA(\"Value\",Pivots_LA!$A$6,\"Month\",$T20,\"Delay reason\",AB$13)),\"\"),0)","v":""},{"$f":"IFERROR(IF(AND($T20>=$P$23,$T20<=$P$24),(GETPIVOTDATA(\"Value\",Pivots_LA!$A$6,\"Month\",$T20,\"Delay reason\",AC$13)),\"\"),0)","v":""},{"$f":"IFERROR(IF(AND($T20>=$P$23,$T20<=$P$24),(GETPIVOTDATA(\"Value\",Pivots_LA!$A$6,\"Month\",$T20,\"Delay reason\",AD$13)),\"\"),0)","v":""},{"$f":"IFERROR(IF(AND($T20>=$P$23,$T20<=$P$24),(GETPIVOTDATA(\"Value\",Pivots_LA!$A$6,\"Month\",$T20,\"Delay reason\",AE$13)),\"\"),0)","v":""},{"$f":"IFERROR(IF(AND($T20>=$P$23,$T20<=$P$24),(GETPIVOTDATA(\"Value\",Pivots_LA!$A$6,\"Month\",$T20,\"Delay reason\",AF$13)),\"\"),0)","v":""},0]
[null,5,{"$f":"$J32","v":"A) Awaiting completion of assessment"},null,null,null,null,null,null,{"$f":"VLOOKUP(C21,ReferenceSheet!$B$2:$C$12,2,0)","v":1},null,null,null,null,"Height",{"$f":"P20-P16","v":6},null,null,8,"2018-09-01","(All)",{"$f":"IFERROR(IF(AND($T21>=$P$23,$T21<=$P$24),(GETPIVOTDATA(\"Value\",Pivots_LA!$A$6,\"Month\",$T21,\"Delay reason\",V$13)),\"\"),0)","v":""},{"$f":"IFERROR(IF(AND($T21>=$P$23,$T21<=$P$24),(GETPIVOTDATA(\"Value\",Pivots_LA!$A$6,\"Month\",$T21,\"Delay reason\",W$13)),\"\"),0)","v":""},{"$f":"IFERROR(IF(AND($T21>=$P$23,$T21<=$P$24),(GETPIVOTDATA(\"Value\",Pivots_LA!$A$6,\"Month\",$T21,\"Delay reason\",X$13)),\"\"),0)","v":""},{"$f":"IFERROR(IF(AND($T21>=$P$23,$T21<=$P$24),(GETPIVOTDATA(\"Value\",Pivots_LA!$A$6,\"Month\",$T21,\"Delay reason\",Y$13)),\"\"),0)","v":""},{"$f":"IFERROR(IF(AND($T21>=$P$23,$T21<=$P$24),(GETPIVOTDATA(\"Value\",Pivots_LA!$A$6,\"Month\",$T21,\"Delay reason\",Z$13)),\"\"),0)","v":""},{"$f":"IFERROR(IF(AND($T21>=$P$23,$T21<=$P$24),(GETPIVOTDATA(\"Value\",Pivots_LA!$A$6,\"Month\",$T21,\"Delay reason\",AA$13)),\"\"),0)","v":""},{"$f":"IFERROR(IF(AND($T21>=$P$23,$T21<=$P$24),(GETPIVOTDATA(\"Value\",Pivots_LA!$A$6,\"Month\",$T21,\"Delay reason\",AB$13)),\"\"),0)","v":""},{"$f":"IFERROR(IF(AND($T21>=$P$23,$T21<=$P$24),(GETPIVOTDATA(\"Value\",Pivots_LA!$A$6,\"Month\",$T21,\"Delay reason\",AC$13)),\"\"),0)","v":""},{"$f":"IFERROR(IF(AND($T21>=$P$23,$T21<=$P$24),(GETPIVOTDATA(\"Value\",Pivots_LA!$A$6,\"Month\",$T21,\"Delay reason\",AD$13)),\"\"),0)","v":""},{"$f":"IFERROR(IF(AND($T21>=$P$23,$T21<=$P$24),(GETPIVOTDATA(\"Value\",Pivots_LA!$A$6,\"Month\",$T21,\"Delay reason\",AE$13)),\"\"),0)","v":""},{"$f":"IFERROR(IF(AND($T21>=$P$23,$T21<=$P$24),(GETPIVOTDATA(\"Value\",Pivots_LA!$A$6,\"Month\",$T21,\"Delay reason\",AF$13)),\"\"),0)","v":""},0]
[null,6,{"$f":"HLOOKUP(J22,V12:AF39,2,0)","v":"A) Awaiting completion of assessment"},null,null,null,null,null,null,1,null,null,null,null,null,null,null,null,9,"2018-10-01","(All)",{"$f":"IFERROR(IF(AND($T22>=$P$23,$T22<=$P$24),(GETPIVOTDATA(\"Value\",Pivots_LA!$A$6,\"Month\",$T22,\"Delay reason\",V$13)),\"\"),0)","v":""},{"$f":"IFERROR(IF(AND($T22>=$P$23,$T22<=$P$24),(GETPIVOTDATA(\"Value\",Pivots_LA!$A$6,\"Month\",$T22,\"Delay reason\",W$13)),\"\"),0)","v":""},{"$f":"IFERROR(IF(AND($T22>=$P$23,$T22<=$P$24),(GETPIVOTDATA(\"Value\",Pivots_LA!$A$6,\"Month\",$T22,\"Delay reason\",X$13)),\"\"),0)","v":""},{"$f":"IFERROR(IF(AND($T22>=$P$23,$T22<=$P$24),(GETPIVOTDATA(\"Value\",Pivots_LA!$A$6,\"Month\",$T22,\"Delay reason\",Y$13)),\"\"),0)","v":""},{"$f":"IFERROR(IF(AND($T22>=$P$23,$T22<=$P$24),(GETPIVOTDATA(\"Value\",Pivots_LA!$A$6,\"Month\",$T22,\"Delay reason\",Z$13)),\"\"),0)","v":""},{"$f":"IFERROR(IF(AND($T22>=$P$23,$T22<=$P$24),(GETPIVOTDATA(\"Value\",Pivots_LA!$A$6,\"Month\",$T22,\"Delay reason\",AA$13)),\"\"),0)","v":""},{"$f":"IFERROR(IF(AND($T22>=$P$23,$T22<=$P$24),(GETPIVOTDATA(\"Value\",Pivots_LA!$A$6,\"Month\",$T22,\"Delay reason\",AB$13)),\"\"),0)","v":""},{"$f":"IFERROR(IF(AND($T22>=$P$23,$T22<=$P$24),(GETPIVOTDATA(\"Value\",Pivots_LA!$A$6,\"Month\",$T22,\"Delay reason\",AC$13)),\"\"),0)","v":""},{"$f":"IFERROR(IF(AND($T22>=$P$23,$T22<=$P$24),(GETPIVOTDATA(\"Value\",Pivots_LA!$A$6,\"Month\",$T22,\"Delay reason\",AD$13)),\"\"),0)","v":""},{"$f":"IFERROR(IF(AND($T22>=$P$23,$T22<=$P$24),(GETPIVOTDATA(\"Value\",Pivots_LA!$A$6,\"Month\",$T22,\"Delay reason\",AE$13)),\"\"),0)","v":""},{"$f":"IFERROR(IF(AND($T22>=$P$23,$T22<=$P$24),(GETPIVOTDATA(\"Value\",Pivots_LA!$A$6,\"Month\",$T22,\"Delay reason\",AF$13)),\"\"),0)","v":""},0]
[null,null,null,null,null,null,null,null,null,null,null,null,null,{"$f":"P16","v":20},"Start date",{"$f":"VLOOKUP(N23,S14:T38,2,0)","v":"2019-09-01"},null,null,10,"2018-11-01","(All)",{"$f":"IFERROR(IF(AND($T23>=$P$23,$T23<=$P$24),(GETPIVOTDATA(\"Value\",Pivots_LA!$A$6,\"Month\",$T23,\"Delay reason\",V$13)),\"\"),0)","v":""},{"$f":"IFERROR(IF(AND($T23>=$P$23,$T23<=$P$24),(GETPIVOTDATA(\"Value\",Pivots_LA!$A$6,\"Month\",$T23,\"Delay reason\",W$13)),\"\"),0)","v":""},{"$f":"IFERROR(IF(AND($T23>=$P$23,$T23<=$P$24),(GETPIVOTDATA(\"Value\",Pivots_LA!$A$6,\"Month\",$T23,\"Delay reason\",X$13)),\"\"),0)","v":""},{"$f":"IFERROR(IF(AND($T23>=$P$23,$T23<=$P$24),(GETPIVOTDATA(\"Value\",Pivots_LA!$A$6,\"Month\",$T23,\"Delay reason\",Y$13)),\"\"),0)","v":""},{"$f":"IFERROR(IF(AND($T23>=$P$23,$T23<=$P$24),(GETPIVOTDATA(\"Value\",Pivots_LA!$A$6,\"Month\",$T23,\"Delay reason\",Z$13)),\"\"),0)","v":""},{"$f":"IFERROR(IF(AND($T23>=$P$23,$T23<=$P$24),(GETPIVOTDATA(\"Value\",Pivots_LA!$A$6,\"Month\",$T23,\"Delay reason\",AA$13)),\"\"),0)","v":""},{"$f":"IFERROR(IF(AND($T23>=$P$23,$T23<=$P$24),(GETPIVOTDATA(\"Value\",Pivots_LA!$A$6,\"Month\",$T23,\"Delay reason\",AB$13)),\"\"),0)","v":""},{"$f":"IFERROR(IF(AND($T23>=$P$23,$T23<=$P$24),(GETPIVOTDATA(\"Value\",Pivots_LA!$A$6,\"Month\",$T23,\"Delay reason\",AC$13)),\"\"),0)","v":""},{"$f":"IFERROR(IF(AND($T23>=$P$23,$T23<=$P$24),(GETPIVOTDATA(\"Value\",Pivots_LA!$A$6,\"Month\",$T23,\"Delay reason\",AD$13)),\"\"),0)","v":""},{"$f":"IFERROR(IF(AND($T23>=$P$23,$T23<=$P$24),(GETPIVOTDATA(\"Value\",Pivots_LA!$A$6,\"Month\",$T23,\"Delay reason\",AE$13)),\"\"),0)","v":""},{"$f":"IFERROR(IF(AND($T23>=$P$23,$T23<=$P$24),(GETPIVOTDATA(\"Value\",Pivots_LA!$A$6,\"Month\",$T23,\"Delay reason\",AF$13)),\"\"),0)","v":""},0]
[null,null,null,null,null,null,null,null,null,null,null,null,null,{"$f":"IF((P17+P19)>25,25,(P17+P19))","v":25},"End date",{"$f":"VLOOKUP(N24,S14:T38,2,0)","v":"2020-02-01"},null,null,11,"2018-12-01","(All)",{"$f":"IFERROR(IF(AND($T24>=$P$23,$T24<=$P$24),(GETPIVOTDATA(\"Value\",Pivots_LA!$A$6,\"Month\",$T24,\"Delay reason\",V$13)),\"\"),0)","v":""},{"$f":"IFERROR(IF(AND($T24>=$P$23,$T24<=$P$24),(GETPIVOTDATA(\"Value\",Pivots_LA!$A$6,\"Month\",$T24,\"Delay reason\",W$13)),\"\"),0)","v":""},{"$f":"IFERROR(IF(AND($T24>=$P$23,$T24<=$P$24),(GETPIVOTDATA(\"Value\",Pivots_LA!$A$6,\"Month\",$T24,\"Delay reason\",X$13)),\"\"),0)","v":""},{"$f":"IFERROR(IF(AND($T24>=$P$23,$T24<=$P$24),(GETPIVOTDATA(\"Value\",Pivots_LA!$A$6,\"Month\",$T24,\"Delay reason\",Y$13)),\"\"),0)","v":""},{"$f":"IFERROR(IF(AND($T24>=$P$23,$T24<=$P$24),(GETPIVOTDATA(\"Value\",Pivots_LA!$A$6,\"Month\",$T24,\"Delay reason\",Z$13)),\"\"),0)","v":""},{"$f":"IFERROR(IF(AND($T24>=$P$23,$T24<=$P$24),(GETPIVOTDATA(\"Value\",Pivots_LA!$A$6,\"Month\",$T24,\"Delay reason\",AA$13)),\"\"),0)","v":""},{"$f":"IFERROR(IF(AND($T24>=$P$23,$T24<=$P$24),(GETPIVOTDATA(\"Value\",Pivots_LA!$A$6,\"Month\",$T24,\"Delay reason\",AB$13)),\"\"),0)","v":""},{"$f":"IFERROR(IF(AND($T24>=$P$23,$T24<=$P$24),(GETPIVOTDATA(\"Value\",Pivots_LA!$A$6,\"Month\",$T24,\"Delay reason\",AC$13)),\"\"),0)","v":""},{"$f":"IFERROR(IF(AND($T24>=$P$23,$T24<=$P$24),(GETPIVOTDATA(\"Value\",Pivots_LA!$A$6,\"Month\",$T24,\"Delay reason\",AD$13)),\"\"),0)","v":""},{"$f":"IFERROR(IF(AND($T24>=$P$23,$T24<=$P$24),(GETPIVOTDATA(\"Value\",Pivots_LA!$A$6,\"Month\",$T24,\"Delay reason\",AE$13)),\"\"),0)","v":""},{"$f":"IFERROR(IF(AND($T24>=$P$23,$T24<=$P$24),(GETPIVOTDATA(\"Value\",Pivots_LA!$A$6,\"Month\",$T24,\"Delay reason\",AF$13)),\"\"),0)","v":""},0]
[null,null,null,null,null,null,null,null,null,null,null,null,null,null,null,null,null,null,12,"2019-01-01","(All)",{"$f":"IFERROR(IF(AND($T25>=$P$23,$T25<=$P$24),(GETPIVOTDATA(\"Value\",Pivots_LA!$A$6,\"Month\",$T25,\"Delay reason\",V$13)),\"\"),0)","v":""},{"$f":"IFERROR(IF(AND($T25>=$P$23,$T25<=$P$24),(GETPIVOTDATA(\"Value\",Pivots_LA!$A$6,\"Month\",$T25,\"Delay reason\",W$13)),\"\"),0)","v":""},{"$f":"IFERROR(IF(AND($T25>=$P$23,$T25<=$P$24),(GETPIVOTDATA(\"Value\",Pivots_LA!$A$6,\"Month\",$T25,\"Delay reason\",X$13)),\"\"),0)","v":""},{"$f":"IFERROR(IF(AND($T25>=$P$23,$T25<=$P$24),(GETPIVOTDATA(\"Value\",Pivots_LA!$A$6,\"Month\",$T25,\"Delay reason\",Y$13)),\"\"),0)","v":""},{"$f":"IFERROR(IF(AND($T25>=$P$23,$T25<=$P$24),(GETPIVOTDATA(\"Value\",Pivots_LA!$A$6,\"Month\",$T25,\"Delay reason\",Z$13)),\"\"),0)","v":""},{"$f":"IFERROR(IF(AND($T25>=$P$23,$T25<=$P$24),(GETPIVOTDATA(\"Value\",Pivots_LA!$A$6,\"Month\",$T25,\"Delay reason\",AA$13)),\"\"),0)","v":""},{"$f":"IFERROR(IF(AND($T25>=$P$23,$T25<=$P$24),(GETPIVOTDATA(\"Value\",Pivots_LA!$A$6,\"Month\",$T25,\"Delay reason\",AB$13)),\"\"),0)","v":""},{"$f":"IFERROR(IF(AND($T25>=$P$23,$T25<=$P$24),(GETPIVOTDATA(\"Value\",Pivots_LA!$A$6,\"Month\",$T25,\"Delay reason\",AC$13)),\"\"),0)","v":""},{"$f":"IFERROR(IF(AND($T25>=$P$23,$T25<=$P$24),(GETPIVOTDATA(\"Value\",Pivots_LA!$A$6,\"Month\",$T25,\"Delay reason\",AD$13)),\"\"),0)","v":""},{"$f":"IFERROR(IF(AND($T25>=$P$23,$T25<=$P$24),(GETPIVOTDATA(\"Value\",Pivots_LA!$A$6,\"Month\",$T25,\"Delay reason\",AE$13)),\"\"),0)","v":""},{"$f":"IFERROR(IF(AND($T25>=$P$23,$T25<=$P$24),(GETPIVOTDATA(\"Value\",Pivots_LA!$A$6,\"Month\",$T25,\"Delay reason\",AF$13)),\"\"),0)","v":""},0]
[null,{"$f":"C17","v":"Local Authority Delayed reasons"},null,null,null,null,null,null,null,null,null,null,null,null,null,null,null,null,13,"2019-02-01","(All)",{"$f":"IFERROR(IF(AND($T26>=$P$23,$T26<=$P$24),(GETPIVOTDATA(\"Value\",Pivots_LA!$A$6,\"Month\",$T26,\"Delay reason\",V$13)),\"\"),0)","v":""},{"$f":"IFERROR(IF(AND($T26>=$P$23,$T26<=$P$24),(GETPIVOTDATA(\"Value\",Pivots_LA!$A$6,\"Month\",$T26,\"Delay reason\",W$13)),\"\"),0)","v":""},{"$f":"IFERROR(IF(AND($T26>=$P$23,$T26<=$P$24),(GETPIVOTDATA(\"Value\",Pivots_LA!$A$6,\"Month\",$T26,\"Delay reason\",X$13)),\"\"),0)","v":""},{"$f":"IFERROR(IF(AND($T26>=$P$23,$T26<=$P$24),(GETPIVOTDATA(\"Value\",Pivots_LA!$A$6,\"Month\",$T26,\"Delay reason\",Y$13)),\"\"),0)","v":""},{"$f":"IFERROR(IF(AND($T26>=$P$23,$T26<=$P$24),(GETPIVOTDATA(\"Value\",Pivots_LA!$A$6,\"Month\",$T26,\"Delay reason\",Z$13)),\"\"),0)","v":""},{"$f":"IFERROR(IF(AND($T26>=$P$23,$T26<=$P$24),(GETPIVOTDATA(\"Value\",Pivots_LA!$A$6,\"Month\",$T26,\"Delay reason\",AA$13)),\"\"),0)","v":""},{"$f":"IFERROR(IF(AND($T26>=$P$23,$T26<=$P$24),(GETPIVOTDATA(\"Value\",Pivots_LA!$A$6,\"Month\",$T26,\"Delay reason\",AB$13)),\"\"),0)","v":""},{"$f":"IFERROR(IF(AND($T26>=$P$23,$T26<=$P$24),(GETPIVOTDATA(\"Value\",Pivots_LA!$A$6,\"Month\",$T26,\"Delay reason\",AC$13)),\"\"),0)","v":""},{"$f":"IFERROR(IF(AND($T26>=$P$23,$T26<=$P$24),(GETPIVOTDATA(\"Value\",Pivots_LA!$A$6,\"Month\",$T26,\"Delay reason\",AD$13)),\"\"),0)","v":""},{"$f":"IFERROR(IF(AND($T26>=$P$23,$T26<=$P$24),(GETPIVOTDATA(\"Value\",Pivots_LA!$A$6,\"Month\",$T26,\"Delay reason\",AE$13)),\"\"),0)","v":""},{"$f":"IFERROR(IF(AND($T26>=$P$23,$T26<=$P$24),(GETPIVOTDATA(\"Value\",Pivots_LA!$A$6,\"Month\",$T26,\"Delay reason\",AF$13)),\"\"),0)","v":""},0]
[null,1,{"$f":"ROW()","v":27},null,null,"Table to rank data",null,null,null,null,null,null,null,null,null,null,null,null,14,"2019-03-01","(All)",{"$f":"IFERROR(IF(AND($T27>=$P$23,$T27<=$P$24),(GETPIVOTDATA(\"Value\",Pivots_LA!$A$6,\"Month\",$T27,\"Delay reason\",V$13)),\"\"),0)","v":""},{"$f":"IFERROR(IF(AND($T27>=$P$23,$T27<=$P$24),(GETPIVOTDATA(\"Value\",Pivots_LA!$A$6,\"Month\",$T27,\"Delay reason\",W$13)),\"\"),0)","v":""},{"$f":"IFERROR(IF(AND($T27>=$P$23,$T27<=$P$24),(GETPIVOTDATA(\"Value\",Pivots_LA!$A$6,\"Month\",$T27,\"Delay reason\",X$13)),\"\"),0)","v":""},{"$f":"IFERROR(IF(AND($T27>=$P$23,$T27<=$P$24),(GETPIVOTDATA(\"Value\",Pivots_LA!$A$6,\"Month\",$T27,\"Delay reason\",Y$13)),\"\"),0)","v":""},{"$f":"IFERROR(IF(AND($T27>=$P$23,$T27<=$P$24),(GETPIVOTDATA(\"Value\",Pivots_LA!$A$6,\"Month\",$T27,\"Delay reason\",Z$13)),\"\"),0)","v":""},{"$f":"IFERROR(IF(AND($T27>=$P$23,$T27<=$P$24),(GETPIVOTDATA(\"Value\",Pivots_LA!$A$6,\"Month\",$T27,\"Delay reason\",AA$13)),\"\"),0)","v":""},{"$f":"IFERROR(IF(AND($T27>=$P$23,$T27<=$P$24),(GETPIVOTDATA(\"Value\",Pivots_LA!$A$6,\"Month\",$T27,\"Delay reason\",AB$13)),\"\"),0)","v":""},{"$f":"IFERROR(IF(AND($T27>=$P$23,$T27<=$P$24),(GETPIVOTDATA(\"Value\",Pivots_LA!$A$6,\"Month\",$T27,\"Delay reason\",AC$13)),\"\"),0)","v":""},{"$f":"IFERROR(IF(AND($T27>=$P$23,$T27<=$P$24),(GETPIVOTDATA(\"Value\",Pivots_LA!$A$6,\"Month\",$T27,\"Delay reason\",AD$13)),\"\"),0)","v":""},{"$f":"IFERROR(IF(AND($T27>=$P$23,$T27<=$P$24),(GETPIVOTDATA(\"Value\",Pivots_LA!$A$6,\"Month\",$T27,\"Delay reason\",AE$13)),\"\"),0)","v":""},{"$f":"IFERROR(IF(AND($T27>=$P$23,$T27<=$P$24),(GETPIVOTDATA(\"Value\",Pivots_LA!$A$6,\"Month\",$T27,\"Delay reason\",AF$13)),\"\"),0)","v":""},0]
[null,"Month",null,null,null,"Summed days by action","equal rank","Adjusted score","Final Rank","Ranked Actions","ranked delay",null,null,"Cuml total","Culm %",null,"Chart set up",null,15,"2019-04-01","(All)",{"$f":"IFERROR(IF(AND($T28>=$P$23,$T28<=$P$24),(GETPIVOTDATA(\"Value\",Pivots_LA!$A$6,\"Month\",$T28,\"Delay reason\",V$13)),\"\"),0)","v":""},{"$f":"IFERROR(IF(AND($T28>=$P$23,$T28<=$P$24),(GETPIVOTDATA(\"Value\",Pivots_LA!$A$6,\"Month\",$T28,\"Delay reason\",W$13)),\"\"),0)","v":""},{"$f":"IFERROR(IF(AND($T28>=$P$23,$T28<=$P$24),(GETPIVOTDATA(\"Value\",Pivots_LA!$A$6,\"Month\",$T28,\"Delay reason\",X$13)),\"\"),0)","v":""},{"$f":"IFERROR(IF(AND($T28>=$P$23,$T28<=$P$24),(GETPIVOTDATA(\"Value\",Pivots_LA!$A$6,\"Month\",$T28,\"Delay reason\",Y$13)),\"\"),0)","v":""},{"$f":"IFERROR(IF(AND($T28>=$P$23,$T28<=$P$24),(GETPIVOTDATA(\"Value\",Pivots_LA!$A$6,\"Month\",$T28,\"Delay reason\",Z$13)),\"\"),0)","v":""},{"$f":"IFERROR(IF(AND($T28>=$P$23,$T28<=$P$24),(GETPIVOTDATA(\"Value\",Pivots_LA!$A$6,\"Month\",$T28,\"Delay reason\",AA$13)),\"\"),0)","v":""},{"$f":"IFERROR(IF(AND($T28>=$P$23,$T28<=$P$24),(GETPIVOTDATA(\"Value\",Pivots_LA!$A$6,\"Month\",$T28,\"Delay reason\",AB$13)),\"\"),0)","v":""},{"$f":"IFERROR(IF(AND($T28>=$P$23,$T28<=$P$24),(GETPIVOTDATA(\"Value\",Pivots_LA!$A$6,\"Month\",$T28,\"Delay reason\",AC$13)),\"\"),0)","v":""},{"$f":"IFERROR(IF(AND($T28>=$P$23,$T28<=$P$24),(GETPIVOTDATA(\"Value\",Pivots_LA!$A$6,\"Month\",$T28,\"Delay reason\",AD$13)),\"\"),0)","v":""},{"$f":"IFERROR(IF(AND($T28>=$P$23,$T28<=$P$24),(GETPIVOTDATA(\"Value\",Pivots_LA!$A$6,\"Month\",$T28,\"Delay reason\",AE$13)),\"\"),0)","v":""},{"$f":"IFERROR(IF(AND($T28>=$P$23,$T28<=$P$24),(GETPIVOTDATA(\"Value\",Pivots_LA!$A$6,\"Month\",$T28,\"Delay reason\",AF$13)),\"\"),0)","v":""},0]
[null,null,"A) Awaiting completion of assessment",{"$f":"IFERROR(HLOOKUP(C29,$V$13:$AF$39,27,TRUE),\"\")","v":114984},null,1,{"$f":"COUNTIF($D$29:$D$39,$D29)","v":1},{"$f":"IF(G29>1,D29+ROW()*0.001,D29)","v":114984},{"$f":"RANK(H29,$H$29:$H$39)","v":4},{"$f":"INDEX($C$29:$C$39,MATCH(F29,$I$29:$I$39,0))","v":"E) Awaiting care package in own home"},{"$f":"INDEX($D$29:$D$39,MATCH(F29,$I$29:$I$39,0))","v":191086},null,null,{"$f":"K29","v":191086},{"$f":"N29/$N$39","v":0.21054661288207754},null,null,null,16,"2019-05-01","(All)",{"$f":"IFERROR(IF(AND($T29>=$P$23,$T29<=$P$24),(GETPIVOTDATA(\"Value\",Pivots_LA!$A$6,\"Month\",$T29,\"Delay reason\",V$13)),\"\"),0)","v":""},{"$f":"IFERROR(IF(AND($T29>=$P$23,$T29<=$P$24),(GETPIVOTDATA(\"Value\",Pivots_LA!$A$6,\"Month\",$T29,\"Delay reason\",W$13)),\"\"),0)","v":""},{"$f":"IFERROR(IF(AND($T29>=$P$23,$T29<=$P$24),(GETPIVOTDATA(\"Value\",Pivots_LA!$A$6,\"Month\",$T29,\"Delay reason\",X$13)),\"\"),0)","v":""},{"$f":"IFERROR(IF(AND($T29>=$P$23,$T29<=$P$24),(GETPIVOTDATA(\"Value\",Pivots_LA!$A$6,\"Month\",$T29,\"Delay reason\",Y$13)),\"\"),0)","v":""},{"$f":"IFERROR(IF(AND($T29>=$P$23,$T29<=$P$24),(GETPIVOTDATA(\"Value\",Pivots_LA!$A$6,\"Month\",$T29,\"Delay reason\",Z$13)),\"\"),0)","v":""},{"$f":"IFERROR(IF(AND($T29>=$P$23,$T29<=$P$24),(GETPIVOTDATA(\"Value\",Pivots_LA!$A$6,\"Month\",$T29,\"Delay reason\",AA$13)),\"\"),0)","v":""},{"$f":"IFERROR(IF(AND($T29>=$P$23,$T29<=$P$24),(GETPIVOTDATA(\"Value\",Pivots_LA!$A$6,\"Month\",$T29,\"Delay reason\",AB$13)),\"\"),0)","v":""},{"$f":"IFERROR(IF(AND($T29>=$P$23,$T29<=$P$24),(GETPIVOTDATA(\"Value\",Pivots_LA!$A$6,\"Month\",$T29,\"Delay reason\",AC$13)),\"\"),0)","v":""},{"$f":"IFERROR(IF(AND($T29>=$P$23,$T29<=$P$24),(GETPIVOTDATA(\"Value\",Pivots_LA!$A$6,\"Month\",$T29,\"Delay reason\",AD$13)),\"\"),0)","v":""},{"$f":"IFERROR(IF(AND($T29>=$P$23,$T29<=$P$24),(GETPIVOTDATA(\"Value\",Pivots_LA!$A$6,\"Month\",$T29,\"Delay reason\",AE$13)),\"\"),0)","v":""},{"$f":"IFERROR(IF(AND($T29>=$P$23,$T29<=$P$24),(GETPIVOTDATA(\"Value\",Pivots_LA!$A$6,\"Month\",$T29,\"Delay reason\",AF$13)),\"\"),0)","v":""},0]
[null,null,"B) Awaiting public funding",{"$f":"IFERROR(HLOOKUP(C30,$V$13:$AF$39,27,TRUE),\"\")","v":24925},null,2,{"$f":"COUNTIF($D$29:$D$39,$D30)","v":1},{"$f":"IF(G30>1,D30+ROW()*0.001,D30)","v":24925},{"$f":"RANK(H30,$H$29:$H$39)","v":8},{"$f":"INDEX($C$29:$C$39,MATCH(F30,$I$29:$I$39,0))","v":"C) Awaiting further non-acute NHS care (including intermediate care, rehabilitation services etc)"},{"$f":"INDEX($D$29:$D$39,MATCH(F30,$I$29:$I$39,0))","v":158921},null,null,{"$f":"N29+K30","v":350007},{"$f":"N30/$N$39","v":0.38565247236855299},null,"Maximum",{"$f":"MAX(D29:D39)","v":191086},17,"2019-06-01","(All)",{"$f":"IFERROR(IF(AND($T30>=$P$23,$T30<=$P$24),(GETPIVOTDATA(\"Value\",Pivots_LA!$A$6,\"Month\",$T30,\"Delay reason\",V$13)),\"\"),0)","v":""},{"$f":"IFERROR(IF(AND($T30>=$P$23,$T30<=$P$24),(GETPIVOTDATA(\"Value\",Pivots_LA!$A$6,\"Month\",$T30,\"Delay reason\",W$13)),\"\"),0)","v":""},{"$f":"IFERROR(IF(AND($T30>=$P$23,$T30<=$P$24),(GETPIVOTDATA(\"Value\",Pivots_LA!$A$6,\"Month\",$T30,\"Delay reason\",X$13)),\"\"),0)","v":""},{"$f":"IFERROR(IF(AND($T30>=$P$23,$T30<=$P$24),(GETPIVOTDATA(\"Value\",Pivots_LA!$A$6,\"Month\",$T30,\"Delay reason\",Y$13)),\"\"),0)","v":""},{"$f":"IFERROR(IF(AND($T30>=$P$23,$T30<=$P$24),(GETPIVOTDATA(\"Value\",Pivots_LA!$A$6,\"Month\",$T30,\"Delay reason\",Z$13)),\"\"),0)","v":""},{"$f":"IFERROR(IF(AND($T30>=$P$23,$T30<=$P$24),(GETPIVOTDATA(\"Value\",Pivots_LA!$A$6,\"Month\",$T30,\"Delay reason\",AA$13)),\"\"),0)","v":""},{"$f":"IFERROR(IF(AND($T30>=$P$23,$T30<=$P$24),(GETPIVOTDATA(\"Value\",Pivots_LA!$A$6,\"Month\",$T30,\"Delay reason\",AB$13)),\"\"),0)","v":""},{"$f":"IFERROR(IF(AND($T30>=$P$23,$T30<=$P$24),(GETPIVOTDATA(\"Value\",Pivots_LA!$A$6,\"Month\",$T30,\"Delay reason\",AC$13)),\"\"),0)","v":""},{"$f":"IFERROR(IF(AND($T30>=$P$23,$T30<=$P$24),(GETPIVOTDATA(\"Value\",Pivots_LA!$A$6,\"Month\",$T30,\"Delay reason\",AD$13)),\"\"),0)","v":""},{"$f":"IFERROR(IF(AND($T30>=$P$23,$T30<=$P$24),(GETPIVOTDATA(\"Value\",Pivots_LA!$A$6,\"Month\",$T30,\"Delay reason\",AE$13)),\"\"),0)","v":""},{"$f":"IFERROR(IF(AND($T30>=$P$23,$T30<=$P$24),(GETPIVOTDATA(\"Value\",Pivots_LA!$A$6,\"Month\",$T30,\"Delay reason\",AF$13)),\"\"),0)","v":""},0]
[null,null,"C) Awaiting further non-acute NHS care (including intermediate care, rehabilitation services etc)",158921,null,3,{"$f":"COUNTIF($D$29:$D$39,$D31)","v":1},158921,2,{"$f":"INDEX($C$29:$C$39,MATCH(F31,$I$29:$I$39,0))","v":"Dii) Awaiting nursing home placement or availability"},120335,null,null,{"$f":"N30+K31","v":470342},{"$f":"N31/$N$39","v":0.51824264988634494},null,"Max Y axis",{"$f":"ROUNDUP(R30/10000,0)*10000","v":200000},18,"2019-07-01","(All)",{"$f":"IFERROR(IF(AND($T31>=$P$23,$T31<=$P$24),(GETPIVOTDATA(\"Value\",Pivots_LA!$A$6,\"Month\",$T31,\"Delay reason\",V$13)),\"\"),0)","v":""},{"$f":"IFERROR(IF(AND($T31>=$P$23,$T31<=$P$24),(GETPIVOTDATA(\"Value\",Pivots_LA!$A$6,\"Month\",$T31,\"Delay reason\",W$13)),\"\"),0)","v":""},{"$f":"IFERROR(IF(AND($T31>=$P$23,$T31<=$P$24),(GETPIVOTDATA(\"Value\",Pivots_LA!$A$6,\"Month\",$T31,\"Delay reason\",X$13)),\"\"),0)","v":""},{"$f":"IFERROR(IF(AND($T31>=$P$23,$T31<=$P$24),(GETPIVOTDATA(\"Value\",Pivots_LA!$A$6,\"Month\",$T31,\"Delay reason\",Y$13)),\"\"),0)","v":""},{"$f":"IFERROR(IF(AND($T31>=$P$23,$T31<=$P$24),(GETPIVOTDATA(\"Value\",Pivots_LA!$A$6,\"Month\",$T31,\"Delay reason\",Z$13)),\"\"),0)","v":""},{"$f":"IFERROR(IF(AND($T31>=$P$23,$T31<=$P$24),(GETPIVOTDATA(\"Value\",Pivots_LA!$A$6,\"Month\",$T31,\"Delay reason\",AA$13)),\"\"),0)","v":""},{"$f":"IFERROR(IF(AND($T31>=$P$23,$T31<=$P$24),(GETPIVOTDATA(\"Value\",Pivots_LA!$A$6,\"Month\",$T31,\"Delay reason\",AB$13)),\"\"),0)","v":""},{"$f":"IFERROR(IF(AND($T31>=$P$23,$T31<=$P$24),(GETPIVOTDATA(\"Value\",Pivots_LA!$A$6,\"Month\",$T31,\"Delay reason\",AC$13)),\"\"),0)","v":""},{"$f":"IFERROR(IF(AND($T31>=$P$23,$T31<=$P$24),(GETPIVOTDATA(\"Value\",Pivots_LA!$A$6,\"Month\",$T31,\"Delay reason\",AD$13)),\"\"),0)","v":""},{"$f":"IFERROR(IF(AND($T31>=$P$23,$T31<=$P$24),(GETPIVOTDATA(\"Value\",Pivots_LA!$A$6,\"Month\",$T31,\"Delay reason\",AE$13)),\"\"),0)","v":""},{"$f":"IFERROR(IF(AND($T31>=$P$23,$T31<=$P$24),(GETPIVOTDATA(\"Value\",Pivots_LA!$A$6,\"Month\",$T31,\"Delay reason\",AF$13)),\"\"),0)","v":""},0]
[null,null,"Di) Awaiting residential home placement or availability",108382,null,4,1,108382,5,"A) Awaiting completion of assessment",114984,null,null,585326,0.64493686995287425,null,"interval",{"$f":"IF(MOD(R31/1000,5)=0,R31/5,IF(MOD(R31/1000,4)=0,R31/4,IF(MOD(R31/1000,6)=0,R31/6,IF(MOD(R31/1000,3)=0,R31/3,ROUNDUP(R31/1000/5,0)*1000))))","v":40000},19,"2019-08-01","(All)",{"$f":"IFERROR(IF(AND($T32>=$P$23,$T32<=$P$24),(GETPIVOTDATA(\"Value\",Pivots_LA!$A$6,\"Month\",$T32,\"Delay reason\",V$13)),\"\"),0)","v":""},{"$f":"IFERROR(IF(AND($T32>=$P$23,$T32<=$P$24),(GETPIVOTDATA(\"Value\",Pivots_LA!$A$6,\"Month\",$T32,\"Delay reason\",W$13)),\"\"),0)","v":""},{"$f":"IFERROR(IF(AND($T32>=$P$23,$T32<=$P$24),(GETPIVOTDATA(\"Value\",Pivots_LA!$A$6,\"Month\",$T32,\"Delay reason\",X$13)),\"\"),0)","v":""},{"$f":"IFERROR(IF(AND($T32>=$P$23,$T32<=$P$24),(GETPIVOTDATA(\"Value\",Pivots_LA!$A$6,\"Month\",$T32,\"Delay reason\",Y$13)),\"\"),0)","v":""},{"$f":"IFERROR(IF(AND($T32>=$P$23,$T32<=$P$24),(GETPIVOTDATA(\"Value\",Pivots_LA!$A$6,\"Month\",$T32,\"Delay reason\",Z$13)),\"\"),0)","v":""},{"$f":"IFERROR(IF(AND($T32>=$P$23,$T32<=$P$24),(GETPIVOTDATA(\"Value\",Pivots_LA!$A$6,\"Month\",$T32,\"Delay reason\",AA$13)),\"\"),0)","v":""},{"$f":"IFERROR(IF(AND($T32>=$P$23,$T32<=$P$24),(GETPIVOTDATA(\"Value\",Pivots_LA!$A$6,\"Month\",$T32,\"Delay reason\",AB$13)),\"\"),0)","v":""},{"$f":"IFERROR(IF(AND($T32>=$P$23,$T32<=$P$24),(GETPIVOTDATA(\"Value\",Pivots_LA!$A$6,\"Month\",$T32,\"Delay reason\",AC$13)),\"\"),0)","v":""},{"$f":"IFERROR(IF(AND($T32>=$P$23,$T32<=$P$24),(GETPIVOTDATA(\"Value\",Pivots_LA!$A$6,\"Month\",$T32,\"Delay reason\",AD$13)),\"\"),0)","v":""},{"$f":"IFERROR(IF(AND($T32>=$P$23,$T32<=$P$24),(GETPIVOTDATA(\"Value\",Pivots_LA!$A$6,\"Month\",$T32,\"Delay reason\",AE$13)),\"\"),0)","v":""},{"$f":"IFERROR(IF(AND($T32>=$P$23,$T32<=$P$24),(GETPIVOTDATA(\"Value\",Pivots_LA!$A$6,\"Month\",$T32,\"Delay reason\",AF$13)),\"\"),0)","v":""},0]
[null,null,"Dii) Awaiting nursing home placement or availability",120335,null,5,1,120335,3,"Di) Awaiting residential home placement or availability",108382,null,null,693708,0.76435672801356591,null,null,null,20,"2019-09-01","(All)",{"$f":"IFERROR(IF(AND($T33>=$P$23,$T33<=$P$24),(GETPIVOTDATA(\"Value\",Pivots_LA!$A$6,\"Month\",$T33,\"Delay reason\",V$13)),\"\"),0)","v":19480},{"$f":"IFERROR(IF(AND($T33>=$P$23,$T33<=$P$24),(GETPIVOTDATA(\"Value\",Pivots_LA!$A$6,\"Month\",$T33,\"Delay reason\",W$13)),\"\"),0)","v":4126},{"$f":"IFERROR(IF(AND($T33>=$P$23,$T33<=$P$24),(GETPIVOTDATA(\"Value\",Pivots_LA!$A$6,\"Month\",$T33,\"Delay reason\",X$13)),\"\"),0)","v":24335},{"$f":"IFERROR(IF(AND($T33>=$P$23,$T33<=$P$24),(GETPIVOTDATA(\"Value\",Pivots_LA!$A$6,\"Month\",$T33,\"Delay reason\",Y$13)),\"\"),0)","v":17478},{"$f":"IFERROR(IF(AND($T33>=$P$23,$T33<=$P$24),(GETPIVOTDATA(\"Value\",Pivots_LA!$A$6,\"Month\",$T33,\"Delay reason\",Z$13)),\"\"),0)","v":19432},{"$f":"IFERROR(IF(AND($T33>=$P$23,$T33<=$P$24),(GETPIVOTDATA(\"Value\",Pivots_LA!$A$6,\"Month\",$T33,\"Delay reason\",AA$13)),\"\"),0)","v":31736},{"$f":"IFERROR(IF(AND($T33>=$P$23,$T33<=$P$24),(GETPIVOTDATA(\"Value\",Pivots_LA!$A$6,\"Month\",$T33,\"Delay reason\",AB$13)),\"\"),0)","v":4171},{"$f":"IFERROR(IF(AND($T33>=$P$23,$T33<=$P$24),(GETPIVOTDATA(\"Value\",Pivots_LA!$A$6,\"Month\",$T33,\"Delay reason\",AC$13)),\"\"),0)","v":18580},{"$f":"IFERROR(IF(AND($T33>=$P$23,$T33<=$P$24),(GETPIVOTDATA(\"Value\",Pivots_LA!$A$6,\"Month\",$T33,\"Delay reason\",AD$13)),\"\"),0)","v":868},{"$f":"IFERROR(IF(AND($T33>=$P$23,$T33<=$P$24),(GETPIVOTDATA(\"Value\",Pivots_LA!$A$6,\"Month\",$T33,\"Delay reason\",AE$13)),\"\"),0)","v":6149},{"$f":"IFERROR(IF(AND($T33>=$P$23,$T33<=$P$24),(GETPIVOTDATA(\"Value\",Pivots_LA!$A$6,\"Month\",$T33,\"Delay reason\",AF$13)),\"\"),0)","v":1991},11]
[null,null,"E) Awaiting care package in own home",191086,null,6,1,191086,1,"G) Patient or family choice",103387,null,null,797095,0.87827288443548768,null,null,null,21,"2019-10-01","(All)",{"$f":"IFERROR(IF(AND($T34>=$P$23,$T34<=$P$24),(GETPIVOTDATA(\"Value\",Pivots_LA!$A$6,\"Month\",$T34,\"Delay reason\",V$13)),\"\"),0)","v":18437},{"$f":"IFERROR(IF(AND($T34>=$P$23,$T34<=$P$24),(GETPIVOTDATA(\"Value\",Pivots_LA!$A$6,\"Month\",$T34,\"Delay reason\",W$13)),\"\"),0)","v":4199},{"$f":"IFERROR(IF(AND($T34>=$P$23,$T34<=$P$24),(GETPIVOTDATA(\"Value\",Pivots_LA!$A$6,\"Month\",$T34,\"Delay reason\",X$13)),\"\"),0)","v":26023},{"$f":"IFERROR(IF(AND($T34>=$P$23,$T34<=$P$24),(GETPIVOTDATA(\"Value\",Pivots_LA!$A$6,\"Month\",$T34,\"Delay reason\",Y$13)),\"\"),0)","v":18371},{"$f":"IFERROR(IF(AND($T34>=$P$23,$T34<=$P$24),(GETPIVOTDATA(\"Value\",Pivots_LA!$A$6,\"Month\",$T34,\"Delay reason\",Z$13)),\"\"),0)","v":21881},{"$f":"IFERROR(IF(AND($T34>=$P$23,$T34<=$P$24),(GETPIVOTDATA(\"Value\",Pivots_LA!$A$6,\"Month\",$T34,\"Delay reason\",AA$13)),\"\"),0)","v":31643},{"$f":"IFERROR(IF(AND($T34>=$P$23,$T34<=$P$24),(GETPIVOTDATA(\"Value\",Pivots_LA!$A$6,\"Month\",$T34,\"Delay reason\",AB$13)),\"\"),0)","v":4557},{"$f":"IFERROR(IF(AND($T34>=$P$23,$T34<=$P$24),(GETPIVOTDATA(\"Value\",Pivots_LA!$A$6,\"Month\",$T34,\"Delay reason\",AC$13)),\"\"),0)","v":17896},{"$f":"IFERROR(IF(AND($T34>=$P$23,$T34<=$P$24),(GETPIVOTDATA(\"Value\",Pivots_LA!$A$6,\"Month\",$T34,\"Delay reason\",AD$13)),\"\"),0)","v":1174},{"$f":"IFERROR(IF(AND($T34>=$P$23,$T34<=$P$24),(GETPIVOTDATA(\"Value\",Pivots_LA!$A$6,\"Month\",$T34,\"Delay reason\",AE$13)),\"\"),0)","v":6641},{"$f":"IFERROR(IF(AND($T34>=$P$23,$T34<=$P$24),(GETPIVOTDATA(\"Value\",Pivots_LA!$A$6,\"Month\",$T34,\"Delay reason\",AF$13)),\"\"),0)","v":1700},11]
[null,null,"F) Awaiting community equipment and adaptations",24754,null,7,1,24754,9,"I) Housing – patients not covered by NHS Care Act",41820,null,null,838915,0.92435192398170496,null,null,null,22,"2019-11-01","(All)",{"$f":"IFERROR(IF(AND($T35>=$P$23,$T35<=$P$24),(GETPIVOTDATA(\"Value\",Pivots_LA!$A$6,\"Month\",$T35,\"Delay reason\",V$13)),\"\"),0)","v":17952},{"$f":"IFERROR(IF(AND($T35>=$P$23,$T35<=$P$24),(GETPIVOTDATA(\"Value\",Pivots_LA!$A$6,\"Month\",$T35,\"Delay reason\",W$13)),\"\"),0)","v":4517},{"$f":"IFERROR(IF(AND($T35>=$P$23,$T35<=$P$24),(GETPIVOTDATA(\"Value\",Pivots_LA!$A$6,\"Month\",$T35,\"Delay reason\",X$13)),\"\"),0)","v":25116},{"$f":"IFERROR(IF(AND($T35>=$P$23,$T35<=$P$24),(GETPIVOTDATA(\"Value\",Pivots_LA!$A$6,\"Month\",$T35,\"Delay reason\",Y$13)),\"\"),0)","v":17148},{"$f":"IFERROR(IF(AND($T35>=$P$23,$T35<=$P$24),(GETPIVOTDATA(\"Value\",Pivots_LA!$A$6,\"Month\",$T35,\"Delay reason\",Z$13)),\"\"),0)","v":19885},{"$f":"IFERROR(IF(AND($T35>=$P$23,$T35<=$P$24),(GETPIVOTDATA(\"Value\",Pivots_LA!$A$6,\"Month\",$T35,\"Delay reason\",AA$13)),\"\"),0)","v":30071},{"$f":"IFERROR(IF(AND($T35>=$P$23,$T35<=$P$24),(GETPIVOTDATA(\"Value\",Pivots_LA!$A$6,\"Month\",$T35,\"Delay reason\",AB$13)),\"\"),0)","v":4033},{"$f":"IFERROR(IF(AND($T35>=$P$23,$T35<=$P$24),(GETPIVOTDATA(\"Value\",Pivots_LA!$A$6,\"Month\",$T35,\"Delay reason\",AC$13)),\"\"),0)","v":16505},{"$f":"IFERROR(IF(AND($T35>=$P$23,$T35<=$P$24),(GETPIVOTDATA(\"Value\",Pivots_LA!$A$6,\"Month\",$T35,\"Delay reason\",AD$13)),\"\"),0)","v":1299},{"$f":"IFERROR(IF(AND($T35>=$P$23,$T35<=$P$24),(GETPIVOTDATA(\"Value\",Pivots_LA!$A$6,\"Month\",$T35,\"Delay reason\",AE$13)),\"\"),0)","v":6350},{"$f":"IFERROR(IF(AND($T35>=$P$23,$T35<=$P$24),(GETPIVOTDATA(\"Value\",Pivots_LA!$A$6,\"Month\",$T35,\"Delay reason\",AF$13)),\"\"),0)","v":2090},11]
[null,null,"G) Patient or family choice",103387,null,8,1,103387,6,"B) Awaiting public funding",24925,null,null,863840,0.95181534006705815,null,null,null,23,"2019-12-01","(All)",{"$f":"IFERROR(IF(AND($T36>=$P$23,$T36<=$P$24),(GETPIVOTDATA(\"Value\",Pivots_LA!$A$6,\"Month\",$T36,\"Delay reason\",V$13)),\"\"),0)","v":18232},{"$f":"IFERROR(IF(AND($T36>=$P$23,$T36<=$P$24),(GETPIVOTDATA(\"Value\",Pivots_LA!$A$6,\"Month\",$T36,\"Delay reason\",W$13)),\"\"),0)","v":3743},{"$f":"IFERROR(IF(AND($T36>=$P$23,$T36<=$P$24),(GETPIVOTDATA(\"Value\",Pivots_LA!$A$6,\"Month\",$T36,\"Delay reason\",X$13)),\"\"),0)","v":25463},{"$f":"IFERROR(IF(AND($T36>=$P$23,$T36<=$P$24),(GETPIVOTDATA(\"Value\",Pivots_LA!$A$6,\"Month\",$T36,\"Delay reason\",Y$13)),\"\"),0)","v":18353},{"$f":"IFERROR(IF(AND($T36>=$P$23,$T36<=$P$24),(GETPIVOTDATA(\"Value\",Pivots_LA!$A$6,\"Month\",$T36,\"Delay reason\",Z$13)),\"\"),0)","v":19251},{"$f":"IFERROR(IF(AND($T36>=$P$23,$T36<=$P$24),(GETPIVOTDATA(\"Value\",Pivots_LA!$A$6,\"Month\",$T36,\"Delay reason\",AA$13)),\"\"),0)","v":31166},{"$f":"IFERROR(IF(AND($T36>=$P$23,$T36<=$P$24),(GETPIVOTDATA(\"Value\",Pivots_LA!$A$6,\"Month\",$T36,\"Delay reason\",AB$13)),\"\"),0)","v":3925},{"$f":"IFERROR(IF(AND($T36>=$P$23,$T36<=$P$24),(GETPIVOTDATA(\"Value\",Pivots_LA!$A$6,\"Month\",$T36,\"Delay reason\",AC$13)),\"\"),0)","v":16580},{"$f":"IFERROR(IF(AND($T36>=$P$23,$T36<=$P$24),(GETPIVOTDATA(\"Value\",Pivots_LA!$A$6,\"Month\",$T36,\"Delay reason\",AD$13)),\"\"),0)","v":1235},{"$f":"IFERROR(IF(AND($T36>=$P$23,$T36<=$P$24),(GETPIVOTDATA(\"Value\",Pivots_LA!$A$6,\"Month\",$T36,\"Delay reason\",AE$13)),\"\"),0)","v":7033},{"$f":"IFERROR(IF(AND($T36>=$P$23,$T36<=$P$24),(GETPIVOTDATA(\"Value\",Pivots_LA!$A$6,\"Month\",$T36,\"Delay reason\",AF$13)),\"\"),0)","v":2196},11]
[null,null,"H) Disputes",6811,null,9,1,6811,11,"F) Awaiting community equipment and adaptations",24754,null,null,888594,0.97909034114135418,null,null,null,24,"2020-01-01","(All)",{"$f":"IFERROR(IF(AND($T37>=$P$23,$T37<=$P$24),(GETPIVOTDATA(\"Value\",Pivots_LA!$A$6,\"Month\",$T37,\"Delay reason\",V$13)),\"\"),0)","v":20796},{"$f":"IFERROR(IF(AND($T37>=$P$23,$T37<=$P$24),(GETPIVOTDATA(\"Value\",Pivots_LA!$A$6,\"Month\",$T37,\"Delay reason\",W$13)),\"\"),0)","v":4228},{"$f":"IFERROR(IF(AND($T37>=$P$23,$T37<=$P$24),(GETPIVOTDATA(\"Value\",Pivots_LA!$A$6,\"Month\",$T37,\"Delay reason\",X$13)),\"\"),0)","v":29511},{"$f":"IFERROR(IF(AND($T37>=$P$23,$T37<=$P$24),(GETPIVOTDATA(\"Value\",Pivots_LA!$A$6,\"Month\",$T37,\"Delay reason\",Y$13)),\"\"),0)","v":19306},{"$f":"IFERROR(IF(AND($T37>=$P$23,$T37<=$P$24),(GETPIVOTDATA(\"Value\",Pivots_LA!$A$6,\"Month\",$T37,\"Delay reason\",Z$13)),\"\"),0)","v":19600},{"$f":"IFERROR(IF(AND($T37>=$P$23,$T37<=$P$24),(GETPIVOTDATA(\"Value\",Pivots_LA!$A$6,\"Month\",$T37,\"Delay reason\",AA$13)),\"\"),0)","v":34257},{"$f":"IFERROR(IF(AND($T37>=$P$23,$T37<=$P$24),(GETPIVOTDATA(\"Value\",Pivots_LA!$A$6,\"Month\",$T37,\"Delay reason\",AB$13)),\"\"),0)","v":4091},{"$f":"IFERROR(IF(AND($T37>=$P$23,$T37<=$P$24),(GETPIVOTDATA(\"Value\",Pivots_LA!$A$6,\"Month\",$T37,\"Delay reason\",AC$13)),\"\"),0)","v":17004},{"$f":"IFERROR(IF(AND($T37>=$P$23,$T37<=$P$24),(GETPIVOTDATA(\"Value\",Pivots_LA!$A$6,\"Month\",$T37,\"Delay reason\",AD$13)),\"\"),0)","v":1191},{"$f":"IFERROR(IF(AND($T37>=$P$23,$T37<=$P$24),(GETPIVOTDATA(\"Value\",Pivots_LA!$A$6,\"Month\",$T37,\"Delay reason\",AE$13)),\"\"),0)","v":7663},{"$f":"IFERROR(IF(AND($T37>=$P$23,$T37<=$P$24),(GETPIVOTDATA(\"Value\",Pivots_LA!$A$6,\"Month\",$T37,\"Delay reason\",AF$13)),\"\"),0)","v":2181},11]
[null,null,"I) Housing – patients not covered by NHS Care Act",41820,null,10,1,41820,7,"O) Other",12166,null,null,900760,0.99249535298064839,null,null,null,25,{"$f":"B69","v":"2020-02-01"},{"$f":"$C$12","v":"(All)"},{"$f":"IFERROR(IF(AND($T38>=$P$23,$T38<=$P$24),(GETPIVOTDATA(\"Value\",Pivots_LA!$A$6,\"Month\",$T38,\"Delay reason\",V$13)),\"\"),0)","v":20087},{"$f":"IFERROR(IF(AND($T38>=$P$23,$T38<=$P$24),(GETPIVOTDATA(\"Value\",Pivots_LA!$A$6,\"Month\",$T38,\"Delay reason\",W$13)),\"\"),0)","v":4112},{"$f":"IFERROR(IF(AND($T38>=$P$23,$T38<=$P$24),(GETPIVOTDATA(\"Value\",Pivots_LA!$A$6,\"Month\",$T38,\"Delay reason\",X$13)),\"\"),0)","v":28473},{"$f":"IFERROR(IF(AND($T38>=$P$23,$T38<=$P$24),(GETPIVOTDATA(\"Value\",Pivots_LA!$A$6,\"Month\",$T38,\"Delay reason\",Y$13)),\"\"),0)","v":17726},{"$f":"IFERROR(IF(AND($T38>=$P$23,$T38<=$P$24),(GETPIVOTDATA(\"Value\",Pivots_LA!$A$6,\"Month\",$T38,\"Delay reason\",Z$13)),\"\"),0)","v":20286},{"$f":"IFERROR(IF(AND($T38>=$P$23,$T38<=$P$24),(GETPIVOTDATA(\"Value\",Pivots_LA!$A$6,\"Month\",$T38,\"Delay reason\",AA$13)),\"\"),0)","v":32213},{"$f":"IFERROR(IF(AND($T38>=$P$23,$T38<=$P$24),(GETPIVOTDATA(\"Value\",Pivots_LA!$A$6,\"Month\",$T38,\"Delay reason\",AB$13)),\"\"),0)","v":3977},{"$f":"IFERROR(IF(AND($T38>=$P$23,$T38<=$P$24),(GETPIVOTDATA(\"Value\",Pivots_LA!$A$6,\"Month\",$T38,\"Delay reason\",AC$13)),\"\"),0)","v":16822},{"$f":"IFERROR(IF(AND($T38>=$P$23,$T38<=$P$24),(GETPIVOTDATA(\"Value\",Pivots_LA!$A$6,\"Month\",$T38,\"Delay reason\",AD$13)),\"\"),0)","v":1044},{"$f":"IFERROR(IF(AND($T38>=$P$23,$T38<=$P$24),(GETPIVOTDATA(\"Value\",Pivots_LA!$A$6,\"Month\",$T38,\"Delay reason\",AE$13)),\"\"),0)","v":7984},{"$f":"IFERROR(IF(AND($T38>=$P$23,$T38<=$P$24),(GETPIVOTDATA(\"Value\",Pivots_LA!$A$6,\"Month\",$T38,\"Delay reason\",AF$13)),\"\"),0)","v":2008},11]
[null,null,"O) Other",12166,null,11,1,12166,10,"H) Disputes",6811,null,null,{"$f":"N38+K39","v":907571},1,null,null,null,null,"Total",null,{"$f":"SUM(V14:V38)","v":114984},{"$f":"SUM(W14:W38)","v":24925},{"$f":"SUM(X14:X38)","v":158921},108382,120335,191086,24754,103387,6811,41820,12166]
[]
[null,null,null,null,null,null,null,null,null,null,null,null,null,null,null,null,null,null,null,null,null,null,"RULES"]
[null,{"$f":"C18","v":"E) Awaiting care package in own home"},null,"Count IF data point is zero"]
[null,1,{"$f":"ROW()","v":43},{"$f":"COUNTIF(D45:D69,0)","v":0},null,null,null,"Upper","Lower",null,null,null,null,null,"Difference",null,"Sigma",null,null,null,null,null,"> 3","< 3 ",null,null,"7 points above/below mean",null,null,null,null,null,null,null,"Trend up/down",null,null,null,null,null,null,null,null,"chart 1"]
[null,"ID (Week no.)","Plot data","Data",null,null,"Mean","Control limits ","control limit (-3)",null,null,null,null,"Date","For. Roll avg","Cumul. Moving Avg.","2.66* MR","3.27*MR",null,null,null,null,"Count","Count","Above/below 3 sigma",null,"7 points > mean","Count of 7 point ","7 points above mean",null,"7 points <mean","Count of 7point ","7 points below mean",null,"Trend up",null,null,null,"Trend Down",null,null,null,null,"Concern","Improvement"]
[null,{"$f":"D9","v":"2018-02-01"},{"$f":"IFERROR(IF(GETPIVOTDATA(\"Value\",Pivots_LA!$A$6,\"Month\",$B45,\"Delay reason\",$C$18)=0,\"\",GETPIVOTDATA(\"Value\",Pivots_LA!$A$6,\"Month\",$B45,\"Delay reason\",$C$18)),NA())","v":30876},{"$f":"IFERROR(IF(C45=\"\",0,C45),\"\")","v":30876},null,null,{"$f":"AVERAGE($D$45:$D$69)","v":29736.44},{"$f":"IF($D$43>5,NA(),IF(D45=\"\",H44,G45+Q45))","v":34209.784166666665},{"$f":"IF($D$43>5,NA(),IF(D45=\"\",I44,G45-Q45))","v":25263.095833333333},null,null,null,null,{"$f":"B45","v":"2018-02-01"},null,{"$f":"IF(O45=\"\",P44,AVERAGE(IF($O$45:O$69<>\"\",$O$45:O$69)))","v":"Cumul. Moving Avg."},{"$f":"Q46","v":4473.3441666666668},{"$f":"R46","v":5499.1862499999997},null,null,null,null,{"$f":"IF($D$43>5,NA(),IF(C45>H45,MAX(W$44:$W44)+1,0))","v":0},{"$f":"IF($D$43>5,NA(),IF(C45<I45,MAX(W$44:$W44)+1,0))","v":0},{"$f":"IF(OR(W45>0,X45>0),C45,NA())","v":{"$error":"#N/A"}},null,{"$f":"IF($D$43>5,NA(), IF(C45>G45,1,0))","v":1},{"$f":"IFERROR(IF(AND(AB44=1,AA45=1),1,IF(SUM(AA45:AA51)>=7,1,0)),0)","v":0},{"$f":"IF(AB45=0,NA(),C45)","v":{"$error":"#N/A"}},null,{"$f":"IF($D$43>5,NA(), IF(C45<G45,1,0))","v":0},{"$f":"IFERROR(IF(AND(AF44=1,AE45=1),1,IF(SUM(AE45:AE51)>=7,1,0)),0)","v":0},{"$f":"IF(AF45=0,NA(),C45)","v":{"$error":"#N/A"}},null,{"$f":"IF($D$43>5,NA(),IF(C45>C44,1,0))","v":0},{"$f":"IF(AND(AJ44=1,AI45=1),1,IF(SUM(AI45:AI51)>=7,1,0))","v":0},{"$f":"IF(AJ45=0,NA(),C45)","v":{"$error":"#N/A"}},null,{"$f":"IF($D$43>5,NA(),IF(C45<C44,1,0))","v":1},{"$f":"IF(AND(AN44=1,AM45=1),1,IF(SUM(AM45:AM51)>=7,1,0))","v":0},{"$f":"IF(AN45=0,NA(),C45)","v":{"$error":"#N/A"}},null,null,{"$f":"IF(OR(W45>0,AB45>0,AJ45>0),C45,NA())","v":{"$error":"#N/A"}},{"$f":"IF(OR(X45>0,AF45>0,AN45>0),C45,NA())","v":{"$error":"#N/A"}}]
[null,{"$f":"IF(DAY(B45+31)=1,B45+31,B45+31-DAY(B45+31)+1)","v":"2018-03-01"},{"$f":"IFERROR(IF(GETPIVOTDATA(\"Value\",Pivots_LA!$A$6,\"Month\",$B46,\"Delay reason\",$C$18)=0,\"\",GETPIVOTDATA(\"Value\",Pivots_LA!$A$6,\"Month\",$B46,\"Delay reason\",$C$18)),NA())","v":33504},{"$f":"IFERROR(IF(C46=\"\",0,C46),\"\")","v":33504},null,null,{"$f":"AVERAGE($D$45:$D$69)","v":29736.44},34209.784166666665,25263.095833333333,null,null,null,null,"2018-03-01",{"$f":"IF(D45=\"\",\"\",IF(D46=\"\",\"\",ABS(D45-D46)))","v":2628},{"$f":"IF(O46=\"\",P45,AVERAGE(IF($O$45:O$69<>\"\",$O$45:O$69)))","v":1681.7083333333333},{"$f":"IF(ISERROR((P46*2.66)),Q47,(P46*2.66))","v":4473.3441666666668},{"$f":"$P46*3.27","v":5499.1862499999997},null,null,null,null,{"$f":"IF($D$43>5,NA(),IF(C46>H46,MAX(W$44:$W45)+1,0))","v":0},{"$f":"IF($D$43>5,NA(),IF(C46<I46,MAX(W$44:$W45)+1,0))","v":0},{"$f":"IF(OR(W46>0,X46>0),C46,NA())","v":{"$error":"#N/A"}},null,{"$f":"IF($D$43>5,NA(), IF(C46>G46,1,0))","v":1},{"$f":"IFERROR(IF(AND(AB45=1,AA46=1),1,IF(SUM(AA46:AA52)>=7,1,0)),0)","v":0},{"$f":"IF(AB46=0,NA(),C46)","v":{"$error":"#N/A"}},null,{"$f":"IF($D$43>5,NA(), IF(C46<G46,1,0))","v":0},{"$f":"IFERROR(IF(AND(AF45=1,AE46=1),1,IF(SUM(AE46:AE52)>=7,1,0)),0)","v":0},{"$f":"IF(AF46=0,NA(),C46)","v":{"$error":"#N/A"}},null,{"$f":"IF($D$43>5,NA(),IF(C46>C45,1,0))","v":1},{"$f":"IF(AND(AJ45=1,AI46=1),1,IF(SUM(AI46:AI52)>=7,1,0))","v":0},{"$f":"IF(AJ46=0,NA(),C46)","v":{"$error":"#N/A"}},null,{"$f":"IF($D$43>5,NA(),IF(C46<C45,1,0))","v":0},{"$f":"IF(AND(AN45=1,AM46=1),1,IF(SUM(AM46:AM52)>=7,1,0))","v":0},{"$f":"IF(AN46=0,NA(),C46)","v":{"$error":"#N/A"}},null,null,{"$f":"IF(OR(W46>0,AB46>0,AJ46>0),C46,NA())","v":{"$error":"#N/A"}},{"$f":"IF(OR(X46>0,AF46>0,AN46>0),C46,NA())","v":{"$error":"#N/A"}}]
[null,{"$f":"IF(DAY(B46+31)=1,B46+31,B46+31-DAY(B46+31)+1)","v":"2018-04-01"},{"$f":"IFERROR(IF(GETPIVOTDATA(\"Value\",Pivots_LA!$A$6,\"Month\",$B47,\"Delay reason\",$C$18)=0,\"\",GETPIVOTDATA(\"Value\",Pivots_LA!$A$6,\"Month\",$B47,\"Delay reason\",$C$18)),NA())","v":29458},29458,null,null,29736.44,34209.784166666665,25263.095833333333,null,null,null,null,"2018-04-01",{"$f":"IF(D46=\"\",\"\",IF(D47=\"\",\"\",ABS(D46-D47)))","v":4046},{"$f":"IF(O47=\"\",P46,AVERAGE(IF($O$45:O$69<>\"\",$O$45:O$69)))","v":1681.7083333333333},{"$f":"IF(ISERROR((P47*2.66)),Q48,(P47*2.66))","v":4473.3441666666668},{"$f":"$P47*3.27","v":5499.1862499999997},null,null,null,null,{"$f":"IF($D$43>5,NA(),IF(C47>H47,MAX(W$44:$W46)+1,0))","v":0},{"$f":"IF($D$43>5,NA(),IF(C47<I47,MAX(W$44:$W46)+1,0))","v":0},{"$error":"#N/A"},null,0,0,{"$error":"#N/A"},null,1,0,{"$error":"#N/A"},null,0,0,{"$error":"#N/A"},null,1,0,{"$error":"#N/A"},null,null,{"$error":"#N/A"},{"$error":"#N/A"}]
[null,"2018-05-01",{"$f":"IFERROR(IF(GETPIVOTDATA(\"Value\",Pivots_LA!$A$6,\"Month\",$B48,\"Delay reason\",$C$18)=0,\"\",GETPIVOTDATA(\"Value\",Pivots_LA!$A$6,\"Month\",$B48,\"Delay reason\",$C$18)),NA())","v":27442},27442,null,null,29736.44,34209.784166666665,25263.095833333333,null,null,null,null,"2018-05-01",2016,{"$f":"IF(O48=\"\",P47,AVERAGE(IF($O$45:O$69<>\"\",$O$45:O$69)))","v":1681.7083333333333},{"$f":"IF(ISERROR((P48*2.66)),Q49,(P48*2.66))","v":4473.3441666666668},{"$f":"$P48*3.27","v":5499.1862499999997},null,null,null,null,{"$f":"IF($D$43>5,NA(),IF(C48>H48,MAX(W$44:$W47)+1,0))","v":0},{"$f":"IF($D$43>5,NA(),IF(C48<I48,MAX(W$44:$W47)+1,0))","v":0},{"$error":"#N/A"},null,0,0,{"$error":"#N/A"},null,1,0,{"$error":"#N/A"},null,0,0,{"$error":"#N/A"},null,1,0,{"$error":"#N/A"},null,null,{"$error":"#N/A"},{"$error":"#N/A"}]
[null,"2018-06-01",{"$f":"IFERROR(IF(GETPIVOTDATA(\"Value\",Pivots_LA!$A$6,\"Month\",$B49,\"Delay reason\",$C$18)=0,\"\",GETPIVOTDATA(\"Value\",Pivots_LA!$A$6,\"Month\",$B49,\"Delay reason\",$C$18)),NA())","v":27978},27978,null,null,29736.44,34209.784166666665,25263.095833333333,null,null,null,null,"2018-06-01",536,{"$f":"IF(O49=\"\",P48,AVERAGE(IF($O$45:O$69<>\"\",$O$45:O$69)))","v":1681.7083333333333},{"$f":"IF(ISERROR((P49*2.66)),Q50,(P49*2.66))","v":4473.3441666666668},5499.1862499999997,null,null,null,null,{"$f":"IF($D$43>5,NA(),IF(C49>H49,MAX(W$44:$W48)+1,0))","v":0},{"$f":"IF($D$43>5,NA(),IF(C49<I49,MAX(W$44:$W48)+1,0))","v":0},{"$error":"#N/A"},null,0,0,{"$error":"#N/A"},null,1,0,{"$error":"#N/A"},null,1,0,{"$error":"#N/A"},null,0,0,{"$error":"#N/A"},null,null,{"$error":"#N/A"},{"$error":"#N/A"}]
[null,"2018-07-01",{"$f":"IFERROR(IF(GETPIVOTDATA(\"Value\",Pivots_LA!$A$6,\"Month\",$B50,\"Delay reason\",$C$18)=0,\"\",GETPIVOTDATA(\"Value\",Pivots_LA!$A$6,\"Month\",$B50,\"Delay reason\",$C$18)),NA())","v":30570},30570,null,null,29736.44,34209.784166666665,25263.095833333333,null,null,null,null,"2018-07-01",2592,{"$f":"IF(O50=\"\",P49,AVERAGE(IF($O$45:O$69<>\"\",$O$45:O$69)))","v":1681.7083333333333},4473.3441666666668,5499.1862499999997,null,null,null,null,{"$f":"IF($D$43>5,NA(),IF(C50>H50,MAX(W$44:$W49)+1,0))","v":0},{"$f":"IF($D$43>5,NA(),IF(C50<I50,MAX(W$44:$W49)+1,0))","v":0},{"$error":"#N/A"},null,1,0,{"$error":"#N/A"},null,0,0,{"$error":"#N/A"},null,1,0,{"$error":"#N/A"},null,0,0,{"$error":"#N/A"},null,null,{"$error":"#N/A"},{"$error":"#N/A"}]
[null,"2018-08-01",{"$f":"IFERROR(IF(GETPIVOTDATA(\"Value\",Pivots_LA!$A$6,\"Month\",$B51,\"Delay reason\",$C$18)=0,\"\",GETPIVOTDATA(\"Value\",Pivots_LA!$A$6,\"Month\",$B51,\"Delay reason\",$C$18)),NA())","v":31577},31577,null,null,29736.44,34209.784166666665,25263.095833333333,null,null,null,null,"2018-08-01",1007,{"$f":"IF(O51=\"\",P50,AVERAGE(IF($O$45:O$69<>\"\",$O$45:O$69)))","v":1681.7083333333333},4473.3441666666668,5499.1862499999997,null,null,null,null,{"$f":"IF($D$43>5,NA(),IF(C51>H51,MAX(W$44:$W50)+1,0))","v":0},{"$f":"IF($D$43>5,NA(),IF(C51<I51,MAX(W$44:$W50)+1,0))","v":0},{"$error":"#N/A"},null,1,0,{"$error":"#N/A"},null,0,0,{"$error":"#N/A"},null,1,0,{"$error":"#N/A"},null,0,0,{"$error":"#N/A"},null,null,{"$error":"#N/A"},{"$error":"#N/A"}]
[null,"2018-09-01",{"$f":"IFERROR(IF(GETPIVOTDATA(\"Value\",Pivots_LA!$A$6,\"Month\",$B52,\"Delay reason\",$C$18)=0,\"\",GETPIVOTDATA(\"Value\",Pivots_LA!$A$6,\"Month\",$B52,\"Delay reason\",$C$18)),NA())","v":31080},31080,null,null,29736.44,34209.784166666665,25263.095833333333,null,null,null,null,"2018-09-01",497,{"$f":"IF(O52=\"\",P51,AVERAGE(IF($O$45:O$69<>\"\",$O$45:O$69)))","v":1681.7083333333333},4473.3441666666668,5499.1862499999997,null,null,null,null,{"$f":"IF($D$43>5,NA(),IF(C52>H52,MAX(W$44:$W51)+1,0))","v":0},{"$f":"IF($D$43>5,NA(),IF(C52<I52,MAX(W$44:$W51)+1,0))","v":0},{"$error":"#N/A"},null,1,0,{"$error":"#N/A"},null,0,0,{"$error":"#N/A"},null,0,0,{"$error":"#N/A"},null,1,0,{"$error":"#N/A"},null,null,{"$error":"#N/A"},{"$error":"#N/A"}]
[null,"2018-10-01",{"$f":"IFERROR(IF(GETPIVOTDATA(\"Value\",Pivots_LA!$A$6,\"Month\",$B53,\"Delay reason\",$C$18)=0,\"\",GETPIVOTDATA(\"Value\",Pivots_LA!$A$6,\"Month\",$B53,\"Delay reason\",$C$18)),NA())","v":30807},30807,null,null,29736.44,34209.784166666665,25263.095833333333,null,null,null,null,"2018-10-01",273,{"$f":"IF(O53=\"\",P52,AVERAGE(IF($O$45:O$69<>\"\",$O$45:O$69)))","v":1681.7083333333333},4473.3441666666668,5499.1862499999997,null,null,null,null,{"$f":"IF($D$43>5,NA(),IF(C53>H53,MAX(W$44:$W52)+1,0))","v":0},{"$f":"IF($D$43>5,NA(),IF(C53<I53,MAX(W$44:$W52)+1,0))","v":0},{"$error":"#N/A"},null,1,0,{"$error":"#N/A"},null,0,0,{"$error":"#N/A"},null,0,0,{"$error":"#N/A"},null,1,0,{"$error":"#N/A"},null,null,{"$error":"#N/A"},{"$error":"#N/A"}]
[null,"2018-11-01",{"$f":"IFERROR(IF(GETPIVOTDATA(\"Value\",Pivots_LA!$A$6,\"Month\",$B54,\"Delay reason\",$C$18)=0,\"\",GETPIVOTDATA(\"Value\",Pivots_LA!$A$6,\"Month\",$B54,\"Delay reason\",$C$18)),NA())","v":28822},28822,null,null,29736.44,34209.784166666665,25263.095833333333,null,null,null,null,"2018-11-01",1985,{"$f":"IF(O54=\"\",P53,AVERAGE(IF($O$45:O$69<>\"\",$O$45:O$69)))","v":1681.7083333333333},4473.3441666666668,5499.1862499999997,null,null,null,null,{"$f":"IF($D$43>5,NA(),IF(C54>H54,MAX(W$44:$W53)+1,0))","v":0},{"$f":"IF($D$43>5,NA(),IF(C54<I54,MAX(W$44:$W53)+1,0))","v":0},{"$error":"#N/A"},null,0,0,{"$error":"#N/A"},null,1,1,28822,null,0,0,{"$error":"#N/A"},null,1,0,{"$error":"#N/A"},null,null,{"$error":"#N/A"},28822]
[null,"2018-12-01",{"$f":"IFERROR(IF(GETPIVOTDATA(\"Value\",Pivots_LA!$A$6,\"Month\",$B55,\"Delay reason\",$C$18)=0,\"\",GETPIVOTDATA(\"Value\",Pivots_LA!$A$6,\"Month\",$B55,\"Delay reason\",$C$18)),NA())","v":27550},27550,null,null,29736.44,34209.784166666665,25263.095833333333,null,null,null,null,"2018-12-01",1272,{"$f":"IF(O55=\"\",P54,AVERAGE(IF($O$45:O$69<>\"\",$O$45:O$69)))","v":1681.7083333333333},4473.3441666666668,5499.1862499999997,null,null,null,null,{"$f":"IF($D$43>5,NA(),IF(C55>H55,MAX(W$44:$W54)+1,0))","v":0},{"$f":"IF($D$43>5,NA(),IF(C55<I55,MAX(W$44:$W54)+1,0))","v":0},{"$error":"#N/A"},null,0,0,{"$error":"#N/A"},null,1,1,27550,null,0,0,{"$error":"#N/A"},null,1,0,{"$error":"#N/A"},null,null,{"$error":"#N/A"},27550]
[null,"2019-01-01",{"$f":"IFERROR(IF(GETPIVOTDATA(\"Value\",Pivots_LA!$A$6,\"Month\",$B56,\"Delay reason\",$C$18)=0,\"\",GETPIVOTDATA(\"Value\",Pivots_LA!$A$6,\"Month\",$B56,\"Delay reason\",$C$18)),NA())","v":27733},27733,null,null,29736.44,34209.784166666665,25263.095833333333,null,null,null,null,"2019-01-01",183,{"$f":"IF(O56=\"\",P55,AVERAGE(IF($O$45:O$69<>\"\",$O$45:O$69)))","v":1681.7083333333333},4473.3441666666668,5499.1862499999997,null,null,null,null,{"$f":"IF($D$43>5,NA(),IF(C56>H56,MAX(W$44:$W55)+1,0))","v":0},{"$f":"IF($D$43>5,NA(),IF(C56<I56,MAX(W$44:$W55)+1,0))","v":0},{"$error":"#N/A"},null,0,0,{"$error":"#N/A"},null,1,1,27733,null,1,0,{"$error":"#N/A"},null,0,0,{"$error":"#N/A"},null,null,{"$error":"#N/A"},27733]
[null,"2019-02-01",{"$f":"IFERROR(IF(GETPIVOTDATA(\"Value\",Pivots_LA!$A$6,\"Month\",$B57,\"Delay reason\",$C$18)=0,\"\",GETPIVOTDATA(\"Value\",Pivots_LA!$A$6,\"Month\",$B57,\"Delay reason\",$C$18)),NA())","v":25350},25350,null,null,29736.44,34209.784166666665,25263.095833333333,null,null,null,null,"2019-02-01",2383,{"$f":"IF(O57=\"\",P56,AVERAGE(IF($O$45:O$69<>\"\",$O$45:O$69)))","v":1681.7083333333333},4473.3441666666668,5499.1862499999997,null,null,null,null,{"$f":"IF($D$43>5,NA(),IF(C57>H57,MAX(W$44:$W56)+1,0))","v":0},{"$f":"IF($D$43>5,NA(),IF(C57<I57,MAX(W$44:$W56)+1,0))","v":0},{"$error":"#N/A"},null,0,0,{"$error":"#N/A"},null,1,1,25350,null,0,0,{"$error":"#N/A"},null,1,0,{"$error":"#N/A"},null,null,{"$error":"#N/A"},25350]
[null,"2019-03-01",{"$f":"IFERROR(IF(GETPIVOTDATA(\"Value\",Pivots_LA!$A$6,\"Month\",$B58,\"Delay reason\",$C$18)=0,\"\",GETPIVOTDATA(\"Value\",Pivots_LA!$A$6,\"Month\",$B58,\"Delay reason\",$C$18)),NA())","v":28208},28208,null,null,29736.44,34209.784166666665,25263.095833333333,null,null,null,null,"2019-03-01",2858,{"$f":"IF(O58=\"\",P57,AVERAGE(IF($O$45:O$69<>\"\",$O$45:O$69)))","v":1681.7083333333333},4473.3441666666668,5499.1862499999997,null,null,null,null,{"$f":"IF($D$43>5,NA(),IF(C58>H58,MAX(W$44:$W57)+1,0))","v":0},{"$f":"IF($D$43>5,NA(),IF(C58<I58,MAX(W$44:$W57)+1,0))","v":0},{"$error":"#N/A"},null,0,0,{"$error":"#N/A"},null,1,1,28208,null,1,0,{"$error":"#N/A"},null,0,0,{"$error":"#N/A"},null,null,{"$error":"#N/A"},28208]
[null,"2019-04-01",{"$f":"IFERROR(IF(GETPIVOTDATA(\"Value\",Pivots_LA!$A$6,\"Month\",$B59,\"Delay reason\",$C$18)=0,\"\",GETPIVOTDATA(\"Value\",Pivots_LA!$A$6,\"Month\",$B59,\"Delay reason\",$C$18)),NA())","v":25051},25051,null,null,29736.44,34209.784166666665,25263.095833333333,null,null,null,null,"2019-04-01",3157,{"$f":"IF(O59=\"\",P58,AVERAGE(IF($O$45:O$69<>\"\",$O$45:O$69)))","v":1681.7083333333333},4473.3441666666668,5499.1862499999997,null,null,null,null,{"$f":"IF($D$43>5,NA(),IF(C59>H59,MAX(W$44:$W58)+1,0))","v":0},{"$f":"IF($D$43>5,NA(),IF(C59<I59,MAX(W$44:$W58)+1,0))","v":1},25051,null,0,0,{"$error":"#N/A"},null,1,1,25051,null,0,0,{"$error":"#N/A"},null,1,0,{"$error":"#N/A"},null,null,{"$error":"#N/A"},25051]
[null,"2019-05-01",{"$f":"IFERROR(IF(GETPIVOTDATA(\"Value\",Pivots_LA!$A$6,\"Month\",$B60,\"Delay reason\",$C$18)=0,\"\",GETPIVOTDATA(\"Value\",Pivots_LA!$A$6,\"Month\",$B60,\"Delay reason\",$C$18)),NA())","v":27428},27428,null,null,29736.44,34209.784166666665,25263.095833333333,null,null,null,null,"2019-05-01",2377,{"$f":"IF(O60=\"\",P59,AVERAGE(IF($O$45:O$69<>\"\",$O$45:O$69)))","v":1681.7083333333333},4473.3441666666668,5499.1862499999997,null,null,null,null,{"$f":"IF($D$43>5,NA(),IF(C60>H60,MAX(W$44:$W59)+1,0))","v":0},{"$f":"IF($D$43>5,NA(),IF(C60<I60,MAX(W$44:$W59)+1,0))","v":0},{"$error":"#N/A"},null,0,0,{"$error":"#N/A"},null,1,1,27428,null,1,0,{"$error":"#N/A"},null,0,0,{"$error":"#N/A"},null,null,{"$error":"#N/A"},27428]
[null,"2019-06-01",{"$f":"IFERROR(IF(GETPIVOTDATA(\"Value\",Pivots_LA!$A$6,\"Month\",$B61,\"Delay reason\",$C$18)=0,\"\",GETPIVOTDATA(\"Value\",Pivots_LA!$A$6,\"Month\",$B61,\"Delay reason\",$C$18)),NA())","v":27404},27404,null,null,29736.44,34209.784166666665,25263.095833333333,null,null,null,null,"2019-06-01",24,{"$f":"IF(O61=\"\",P60,AVERAGE(IF($O$45:O$69<>\"\",$O$45:O$69)))","v":1681.7083333333333},4473.3441666666668,5499.1862499999997,null,null,null,null,{"$f":"IF($D$43>5,NA(),IF(C61>H61,MAX(W$44:$W60)+1,0))","v":0},{"$f":"IF($D$43>5,NA(),IF(C61<I61,MAX(W$44:$W60)+1,0))","v":0},{"$error":"#N/A"},null,0,0,{"$error":"#N/A"},null,1,1,27404,null,0,0,{"$error":"#N/A"},null,1,0,{"$error":"#N/A"},null,null,{"$error":"#N/A"},27404]
[null,"2019-07-01",{"$f":"IFERROR(IF(GETPIVOTDATA(\"Value\",Pivots_LA!$A$6,\"Month\",$B62,\"Delay reason\",$C$18)=0,\"\",GETPIVOTDATA(\"Value\",Pivots_LA!$A$6,\"Month\",$B62,\"Delay reason\",$C$18)),NA())","v":29601},29601,null,null,29736.44,34209.784166666665,25263.095833333333,null,null,null,null,"2019-07-01",2197,{"$f":"IF(O62=\"\",P61,AVERAGE(IF($O$45:O$69<>\"\",$O$45:O$69)))","v":1681.7083333333333},4473.3441666666668,5499.1862499999997,null,null,null,null,{"$f":"IF($D$43>5,NA(),IF(C62>H62,MAX(W$44:$W61)+1,0))","v":0},{"$f":"IF($D$43>5,NA(),IF(C62<I62,MAX(W$44:$W61)+1,0))","v":0},{"$error":"#N/A"},null,0,0,{"$error":"#N/A"},null,1,{"$f":"IFERROR(IF(AND(AF61=1,AE62=1),1,IF(SUM(AE62:AE68)>=7,1,0)),0)","v":1},29601,null,1,0,{"$error":"#N/A"},null,0,0,{"$error":"#N/A"},null,null,{"$error":"#N/A"},29601]
[null,"2019-08-01",{"$f":"IFERROR(IF(GETPIVOTDATA(\"Value\",Pivots_LA!$A$6,\"Month\",$B63,\"Delay reason\",$C$18)=0,\"\",GETPIVOTDATA(\"Value\",Pivots_LA!$A$6,\"Month\",$B63,\"Delay reason\",$C$18)),NA())","v":31886},31886,null,null,29736.44,34209.784166666665,25263.095833333333,null,null,null,null,"2019-08-01",2285,{"$f":"IF(O63=\"\",P62,AVERAGE(IF($O$45:O$69<>\"\",$O$45:O$69)))","v":1681.7083333333333},4473.3441666666668,5499.1862499999997,null,null,null,null,{"$f":"IF($D$43>5,NA(),IF(C63>H63,MAX(W$44:$W62)+1,0))","v":0},{"$f":"IF($D$43>5,NA(),IF(C63<I63,MAX(W$44:$W62)+1,0))","v":0},{"$error":"#N/A"},null,1,1,31886,null,0,{"$f":"IFERROR(IF(AND(AF62=1,AE63=1),1,IF(SUM(AE63:AE69)>=7,1,0)),0)","v":0},{"$error":"#N/A"},null,1,0,{"$error":"#N/A"},null,0,0,{"$error":"#N/A"},null,null,31886,{"$error":"#N/A"}]
[null,"2019-09-01",{"$f":"IFERROR(IF(GETPIVOTDATA(\"Value\",Pivots_LA!$A$6,\"Month\",$B64,\"Delay reason\",$C$18)=0,\"\",GETPIVOTDATA(\"Value\",Pivots_LA!$A$6,\"Month\",$B64,\"Delay reason\",$C$18)),NA())","v":31736},31736,null,null,29736.44,34209.784166666665,25263.095833333333,null,null,null,null,"2019-09-01",150,{"$f":"IF(O64=\"\",P63,AVERAGE(IF($O$45:O$69<>\"\",$O$45:O$69)))","v":1681.7083333333333},4473.3441666666668,5499.1862499999997,null,null,null,null,{"$f":"IF($D$43>5,NA(),IF(C64>H64,MAX(W$44:$W63)+1,0))","v":0},{"$f":"IF($D$43>5,NA(),IF(C64<I64,MAX(W$44:$W63)+1,0))","v":0},{"$error":"#N/A"},null,1,{"$f":"IFERROR(IF(AND(AB63=1,AA64=1),1,IF(SUM(AA64:AA69)>=7,1,0)),0)","v":1},31736,null,0,{"$f":"IFERROR(IF(AND(AF63=1,AE64=1),1,IF(SUM(AE64:AE69)>=7,1,0)),0)","v":0},{"$error":"#N/A"},null,0,0,{"$error":"#N/A"},null,1,0,{"$error":"#N/A"},null,null,31736,{"$error":"#N/A"}]
[null,"2019-10-01",{"$f":"IFERROR(IF(GETPIVOTDATA(\"Value\",Pivots_LA!$A$6,\"Month\",$B65,\"Delay reason\",$C$18)=0,\"\",GETPIVOTDATA(\"Value\",Pivots_LA!$A$6,\"Month\",$B65,\"Delay reason\",$C$18)),NA())","v":31643},31643,null,null,29736.44,34209.784166666665,25263.095833333333,null,null,null,null,"2019-10-01",93,{"$f":"IF(O65=\"\",P64,AVERAGE(IF($O$45:O$69<>\"\",$O$45:O$69)))","v":1681.7083333333333},4473.3441666666668,5499.1862499999997,null,null,null,null,{"$f":"IF($D$43>5,NA(),IF(C65>H65,MAX(W$44:$W64)+1,0))","v":0},{"$f":"IF($D$43>5,NA(),IF(C65<I65,MAX(W$44:$W64)+1,0))","v":0},{"$error":"#N/A"},null,1,{"$f":"IFERROR(IF(AND(AB64=1,AA65=1),1,IF(SUM(AA65:AA69)>=7,1,0)),0)","v":1},31643,null,0,{"$f":"IFERROR(IF(AND(AF64=1,AE65=1),1,IF(SUM(AE65:AE69)>=7,1,0)),0)","v":0},{"$error":"#N/A"},null,0,0,{"$error":"#N/A"},null,1,{"$f":"IF(AND(AN64=1,AM65=1),1,IF(SUM(AM65:AM69)>=7,1,0))","v":0},{"$error":"#N/A"},null,null,31643,{"$error":"#N/A"}]
[null,"2019-11-01",{"$f":"IFERROR(IF(GETPIVOTDATA(\"Value\",Pivots_LA!$A$6,\"Month\",$B66,\"Delay reason\",$C$18)=0,\"\",GETPIVOTDATA(\"Value\",Pivots_LA!$A$6,\"Month\",$B66,\"Delay reason\",$C$18)),NA())","v":30071},30071,null,null,29736.44,34209.784166666665,25263.095833333333,null,null,null,null,"2019-11-01",1572,{"$f":"IF(O66=\"\",P65,AVERAGE(IF($O$45:O$69<>\"\",$O$45:O$69)))","v":1681.7083333333333},4473.3441666666668,5499.1862499999997,null,null,null,null,{"$f":"IF($D$43>5,NA(),IF(C66>H66,MAX(W$44:$W65)+1,0))","v":0},{"$f":"IF($D$43>5,NA(),IF(C66<I66,MAX(W$44:$W65)+1,0))","v":0},{"$error":"#N/A"},null,1,1,30071,null,0,{"$f":"IFERROR(IF(AND(AF65=1,AE66=1),1,IF(SUM(AE66:AE69)>=7,1,0)),0)","v":0},{"$error":"#N/A"},null,0,{"$f":"IF(AND(AJ65=1,AI66=1),1,IF(SUM(AI66:AI69)>=7,1,0))","v":0},{"$error":"#N/A"},null,1,{"$f":"IF(AND(AN65=1,AM66=1),1,IF(SUM(AM66:AM69)>=7,1,0))","v":0},{"$error":"#N/A"},null,null,30071,{"$error":"#N/A"}]
[null,"2019-12-01",{"$f":"IFERROR(IF(GETPIVOTDATA(\"Value\",Pivots_LA!$A$6,\"Month\",$B67,\"Delay reason\",$C$18)=0,\"\",GETPIVOTDATA(\"Value\",Pivots_LA!$A$6,\"Month\",$B67,\"Delay reason\",$C$18)),NA())","v":31166},31166,null,null,29736.44,34209.784166666665,25263.095833333333,null,null,null,null,"2019-12-01",1095,{"$f":"IF(O67=\"\",P66,AVERAGE(IF($O$45:O$69<>\"\",$O$45:O$69)))","v":1681.7083333333333},4473.3441666666668,5499.1862499999997,null,null,null,null,{"$f":"IF($D$43>5,NA(),IF(C67>H67,MAX(W$44:$W66)+1,0))","v":0},{"$f":"IF($D$43>5,NA(),IF(C67<I67,MAX(W$44:$W66)+1,0))","v":0},{"$error":"#N/A"},null,1,{"$f":"IFERROR(IF(AND(AB66=1,AA67=1),1,IF(SUM(AA67:AA69)>=7,1,0)),0)","v":1},31166,null,0,{"$f":"IFERROR(IF(AND(AF66=1,AE67=1),1,IF(SUM(AE67:AE69)>=7,1,0)),0)","v":0},{"$error":"#N/A"},null,1,{"$f":"IF(AND(AJ66=1,AI67=1),1,IF(SUM(AI67:AI69)>=7,1,0))","v":0},{"$error":"#N/A"},null,0,{"$f":"IF(AND(AN66=1,AM67=1),1,IF(SUM(AM67:AM69)>=7,1,0))","v":0},{"$error":"#N/A"},null,null,31166,{"$error":"#N/A"}]
[null,"2020-01-01",{"$f":"IFERROR(IF(GETPIVOTDATA(\"Value\",Pivots_LA!$A$6,\"Month\",$B68,\"Delay reason\",$C$18)=0,\"\",GETPIVOTDATA(\"Value\",Pivots_LA!$A$6,\"Month\",$B68,\"Delay reason\",$C$18)),NA())","v":34257},34257,null,null,29736.44,34209.784166666665,25263.095833333333,null,null,null,null,"2020-01-01",3091,{"$f":"IF(O68=\"\",P67,AVERAGE(IF($O$45:O$69<>\"\",$O$45:O$69)))","v":1681.7083333333333},4473.3441666666668,5499.1862499999997,null,null,null,null,{"$f":"IF($D$43>5,NA(),IF(C68>H68,MAX(W$44:$W67)+1,0))","v":1},{"$f":"IF($D$43>5,NA(),IF(C68<I68,MAX(W$44:$W67)+1,0))","v":0},34257,null,1,{"$f":"IFERROR(IF(AND(AB67=1,AA68=1),1,IF(SUM(AA68:AA69)>=7,1,0)),0)","v":1},34257,null,0,{"$f":"IFERROR(IF(AND(AF67=1,AE68=1),1,IF(SUM(AE68:AE69)>=7,1,0)),0)","v":0},{"$error":"#N/A"},null,1,{"$f":"IF(AND(AJ67=1,AI68=1),1,IF(SUM(AI68:AI69)>=7,1,0))","v":0},{"$error":"#N/A"},null,0,{"$f":"IF(AND(AN67=1,AM68=1),1,IF(SUM(AM68:AM69)>=7,1,0))","v":0},{"$error":"#N/A"},null,null,34257,{"$error":"#N/A"}]
[null,"2020-02-01",{"$f":"IFERROR(IF(GETPIVOTDATA(\"Value\",Pivots_LA!$A$6,\"Month\",$B69,\"Delay reason\",$C$18)=0,\"\",GETPIVOTDATA(\"Value\",Pivots_LA!$A$6,\"Month\",$B69,\"Delay reason\",$C$18)),NA())","v":32213},32213,null,null,29736.44,34209.784166666665,25263.095833333333,null,null,null,null,"2020-02-01",2044,{"$f":"IF(O69=\"\",P68,AVERAGE(IF($O$45:O$69<>\"\",$O$45:O$69)))","v":1681.7083333333333},{"$f":"IF(ISERROR((P69*2.66)),Q70,(P69*2.66))","v":4473.3441666666668},{"$f":"$P69*3.27","v":5499.1862499999997},null,null,null,null,{"$f":"IF($D$43>5,NA(),IF(C69>H69,MAX(W$44:$W68)+1,0))","v":0},{"$f":"IF($D$43>5,NA(),IF(C69<I69,MAX(W$44:$W68)+1,0))","v":0},{"$error":"#N/A"},null,{"$f":"IF($D$43>5,NA(), IF(C69>G69,1,0))","v":1},{"$f":"IFERROR(IF(AND(AB68=1,AA69=1),1,IF(SUM(AA69)>=7,1,0)),0)","v":1},32213,null,{"$f":"IF($D$43>5,NA(), IF(C69<G69,1,0))","v":0},{"$f":"IFERROR(IF(AND(AF68=1,AE69=1),1,IF(SUM(AE69)>=7,1,0)),0)","v":0},{"$error":"#N/A"},null,0,{"$f":"IF(AND(AJ68=1,AI69=1),1,IF(SUM(AI69)>=7,1,0))","v":0},{"$error":"#N/A"},null,1,{"$f":"IF(AND(AN68=1,AM69=1),1,IF(SUM(AM69)>=7,1,0))","v":0},{"$error":"#N/A"},null,null,{"$f":"IF(OR(W69>0,AB69>0,AJ69>0),C69,NA())","v":32213},{"$error":"#N/A"}]
[]
[null,{"$f":"C19","v":"C) Awaiting further non-acute NHS care (including intermediate care, rehabilitation services etc)"},null,"Count IF data point is zero"]
[null,2,{"$f":"ROW()","v":72},{"$f":"COUNTIF(D74:D98,0)","v":0},null,null,null,"Upper","Lower",null,null,null,null,null,"Difference",null,"Sigma",null,null,null,null,null,"> 3","< 3 ",null,null,"7 points above/below mean",null,null,null,null,null,null,null,"Trend up/down",null,null,null,null,null,null,null,null,"chart 2"]
[null,"ID (Week no.)","Plot data","Data",null,null,"Mean","Control limits ","control limit (-3)",null,null,null,null,"Date","For. Roll avg","Cumul. Moving Avg.","2.66* MR","3.27*MR",null,null,null,null,"Count","Count","Above/below 3 sigma",null,"7 points > mean","Count of 7 point ","7 points above mean",null,"7 points <mean","Count of 7point ","7 points below mean",null,"Trend up",null,null,null,"Trend Down",null,null,null,null,"Concern","Improvement"]
[null,{"$f":"D9","v":"2018-02-01"},{"$f":"IFERROR(IF(GETPIVOTDATA(\"Value\",Pivots_LA!$A$6,\"Month\",$B74,\"Delay reason\",$C$19)=0,\"\",GETPIVOTDATA(\"Value\",Pivots_LA!$A$6,\"Month\",$B74,\"Delay reason\",$C$19)),NA())","v":24647},{"$f":"IFERROR(IF(C74=\"\",0,C74),\"\")","v":24647},null,null,{"$f":"AVERAGE($D$74:$D$98)","v":24996.76},{"$f":"IF($D$72>5,NA(),IF(D74=\"\",H73,G74+Q74))","v":28716.105},{"$f":"IF($D$72>5,NA(),IF(D74=\"\",I73,G74-Q74))","v":21277.414999999997},null,null,null,null,{"$f":"B74","v":"2018-02-01"},null,{"$f":"IF(O74=\"\",P73,AVERAGE(IF($O$74:O$98<>\"\",$O$74:O$98)))","v":"Cumul. Moving Avg."},{"$f":"Q75","v":3719.3450000000003},{"$f":"R75","v":4572.2775000000001},null,null,null,null,{"$f":"IF($D$72>5,NA(),IF(C74>H74,MAX(W$73:$W73)+1,0))","v":0},{"$f":"IF($D$72>5,NA(),IF(C74<I74,MAX(W$73:$W73)+1,0))","v":0},{"$f":"IF(OR(W74>0,X74>0),C74,NA())","v":{"$error":"#N/A"}},null,{"$f":"IF($D$72>5,NA(), IF(C74>G74,1,0))","v":0},{"$f":"IFERROR(IF(AND(AB73=1,AA74=1),1,IF(SUM(AA74:AA80)>=7,1,0)),0)","v":0},{"$f":"IF(AB74=0,NA(),C74)","v":{"$error":"#N/A"}},null,{"$f":"IF($D$72>5,NA(), IF(C74<G74,1,0))","v":1},{"$f":"IFERROR(IF(AND(AF73=1,AE74=1),1,IF(SUM(AE74:AE80)>=7,1,0)),0)","v":0},{"$f":"IF(AF74=0,NA(),C74)","v":{"$error":"#N/A"}},null,{"$f":"IF($D$72>5,NA(),IF(C74>C73,1,0))","v":0},{"$f":"IF(AND(AJ73=1,AI74=1),1,IF(SUM(AI74:AI80)>=7,1,0))","v":0},{"$f":"IF(AJ74=0,NA(),C74)","v":{"$error":"#N/A"}},null,{"$f":"IF($D$72>5,NA(),IF(C74<C73,1,0))","v":1},{"$f":"IF(AND(AN73=1,AM74=1),1,IF(SUM(AM74:AM80)>=7,1,0))","v":0},{"$f":"IF(AN74=0,NA(),C74)","v":{"$error":"#N/A"}},null,null,{"$f":"IF(OR(W74>0,AB74>0,AJ74>0),C74,NA())","v":{"$error":"#N/A"}},{"$f":"IF(OR(X74>0,AF74>0,AN74>0),C74,NA())","v":{"$error":"#N/A"}}]
[null,{"$f":"IF(DAY(B74+31)=1,B74+31,B74+31-DAY(B74+31)+1)","v":"2018-03-01"},{"$f":"IFERROR(IF(GETPIVOTDATA(\"Value\",Pivots_LA!$A$6,\"Month\",$B75,\"Delay reason\",$C$19)=0,\"\",GETPIVOTDATA(\"Value\",Pivots_LA!$A$6,\"Month\",$B75,\"Delay reason\",$C$19)),NA())","v":29316},{"$f":"IFERROR(IF(C75=\"\",0,C75),\"\")","v":29316},null,null,{"$f":"AVERAGE($D$74:$D$98)","v":24996.76},{"$f":"IF($D$72>5,NA(),IF(D75=\"\",H74,G75+Q75))","v":28716.105},{"$f":"IF($D$72>5,NA(),IF(D75=\"\",I74,G75-Q75))","v":21277.414999999997},null,null,null,null,"2018-03-01",{"$f":"IF(D74=\"\",\"\",IF(D75=\"\",\"\",ABS(D74-D75)))","v":4669},{"$f":"IF(O75=\"\",P74,AVERAGE(IF($O$74:O$98<>\"\",$O$74:O$98)))","v":1398.25},{"$f":"IF(ISERROR((P75*2.66)),Q76,(P75*2.66))","v":3719.3450000000003},{"$f":"$P75*3.27","v":4572.2775000000001},null,null,null,null,{"$f":"IF($D$72>5,NA(),IF(C75>H75,MAX(W$73:$W74)+1,0))","v":1},{"$f":"IF($D$72>5,NA(),IF(C75<I75,MAX(W$73:$W74)+1,0))","v":0},{"$f":"IF(OR(W75>0,X75>0),C75,NA())","v":29316},null,{"$f":"IF($D$72>5,NA(), IF(C75>G75,1,0))","v":1},{"$f":"IFERROR(IF(AND(AB74=1,AA75=1),1,IF(SUM(AA75:AA81)>=7,1,0)),0)","v":0},{"$f":"IF(AB75=0,NA(),C75)","v":{"$error":"#N/A"}},null,{"$f":"IF($D$72>5,NA(), IF(C75<G75,1,0))","v":0},{"$f":"IFERROR(IF(AND(AF74=1,AE75=1),1,IF(SUM(AE75:AE81)>=7,1,0)),0)","v":0},{"$f":"IF(AF75=0,NA(),C75)","v":{"$error":"#N/A"}},null,{"$f":"IF($D$72>5,NA(),IF(C75>C74,1,0))","v":1},{"$f":"IF(AND(AJ74=1,AI75=1),1,IF(SUM(AI75:AI81)>=7,1,0))","v":0},{"$f":"IF(AJ75=0,NA(),C75)","v":{"$error":"#N/A"}},null,{"$f":"IF($D$72>5,NA(),IF(C75<C74,1,0))","v":0},{"$f":"IF(AND(AN74=1,AM75=1),1,IF(SUM(AM75:AM81)>=7,1,0))","v":0},{"$f":"IF(AN75=0,NA(),C75)","v":{"$error":"#N/A"}},null,null,{"$f":"IF(OR(W75>0,AB75>0,AJ75>0),C75,NA())","v":29316},{"$f":"IF(OR(X75>0,AF75>0,AN75>0),C75,NA())","v":{"$error":"#N/A"}}]
[null,{"$f":"IF(DAY(B75+31)=1,B75+31,B75+31-DAY(B75+31)+1)","v":"2018-04-01"},{"$f":"IFERROR(IF(GETPIVOTDATA(\"Value\",Pivots_LA!$A$6,\"Month\",$B76,\"Delay reason\",$C$19)=0,\"\",GETPIVOTDATA(\"Value\",Pivots_LA!$A$6,\"Month\",$B76,\"Delay reason\",$C$19)),NA())","v":26700},26700,null,null,24996.76,28716.105,21277.414999999997,null,null,null,null,"2018-04-01",{"$f":"IF(D75=\"\",\"\",IF(D76=\"\",\"\",ABS(D75-D76)))","v":2616},{"$f":"IF(O76=\"\",P75,AVERAGE(IF($O$74:O$98<>\"\",$O$74:O$98)))","v":1398.25},{"$f":"IF(ISERROR((P76*2.66)),Q77,(P76*2.66))","v":3719.3450000000003},{"$f":"$P76*3.27","v":4572.2775000000001},null,null,null,null,{"$f":"IF($D$72>5,NA(),IF(C76>H76,MAX(W$73:$W75)+1,0))","v":0},{"$f":"IF($D$72>5,NA(),IF(C76<I76,MAX(W$73:$W75)+1,0))","v":0},{"$error":"#N/A"},null,1,0,{"$error":"#N/A"},null,0,0,{"$error":"#N/A"},null,0,0,{"$error":"#N/A"},null,1,0,{"$error":"#N/A"},null,null,{"$error":"#N/A"},{"$error":"#N/A"}]
[null,"2018-05-01",{"$f":"IFERROR(IF(GETPIVOTDATA(\"Value\",Pivots_LA!$A$6,\"Month\",$B77,\"Delay reason\",$C$19)=0,\"\",GETPIVOTDATA(\"Value\",Pivots_LA!$A$6,\"Month\",$B77,\"Delay reason\",$C$19)),NA())","v":24841},24841,null,null,24996.76,28716.105,21277.414999999997,null,null,null,null,"2018-05-01",1859,{"$f":"IF(O77=\"\",P76,AVERAGE(IF($O$74:O$98<>\"\",$O$74:O$98)))","v":1398.25},{"$f":"IF(ISERROR((P77*2.66)),Q78,(P77*2.66))","v":3719.3450000000003},{"$f":"$P77*3.27","v":4572.2775000000001},null,null,null,null,{"$f":"IF($D$72>5,NA(),IF(C77>H77,MAX(W$73:$W76)+1,0))","v":0},{"$f":"IF($D$72>5,NA(),IF(C77<I77,MAX(W$73:$W76)+1,0))","v":0},{"$error":"#N/A"},null,0,0,{"$error":"#N/A"},null,1,1,24841,null,0,0,{"$error":"#N/A"},null,1,0,{"$error":"#N/A"},null,null,{"$error":"#N/A"},24841]
[null,"2018-06-01",{"$f":"IFERROR(IF(GETPIVOTDATA(\"Value\",Pivots_LA!$A$6,\"Month\",$B78,\"Delay reason\",$C$19)=0,\"\",GETPIVOTDATA(\"Value\",Pivots_LA!$A$6,\"Month\",$B78,\"Delay reason\",$C$19)),NA())","v":22953},22953,null,null,24996.76,28716.105,21277.414999999997,null,null,null,null,"2018-06-01",1888,{"$f":"IF(O78=\"\",P77,AVERAGE(IF($O$74:O$98<>\"\",$O$74:O$98)))","v":1398.25},{"$f":"IF(ISERROR((P78*2.66)),Q79,(P78*2.66))","v":3719.3450000000003},4572.2775000000001,null,null,null,null,{"$f":"IF($D$72>5,NA(),IF(C78>H78,MAX(W$73:$W77)+1,0))","v":0},{"$f":"IF($D$72>5,NA(),IF(C78<I78,MAX(W$73:$W77)+1,0))","v":0},{"$error":"#N/A"},null,0,0,{"$error":"#N/A"},null,1,1,22953,null,0,0,{"$error":"#N/A"},null,1,0,{"$error":"#N/A"},null,null,{"$error":"#N/A"},22953]
[null,"2018-07-01",{"$f":"IFERROR(IF(GETPIVOTDATA(\"Value\",Pivots_LA!$A$6,\"Month\",$B79,\"Delay reason\",$C$19)=0,\"\",GETPIVOTDATA(\"Value\",Pivots_LA!$A$6,\"Month\",$B79,\"Delay reason\",$C$19)),NA())","v":24166},24166,null,null,24996.76,28716.105,21277.414999999997,null,null,null,null,"2018-07-01",1213,{"$f":"IF(O79=\"\",P78,AVERAGE(IF($O$74:O$98<>\"\",$O$74:O$98)))","v":1398.25},3719.3450000000003,4572.2775000000001,null,null,null,null,{"$f":"IF($D$72>5,NA(),IF(C79>H79,MAX(W$73:$W78)+1,0))","v":0},{"$f":"IF($D$72>5,NA(),IF(C79<I79,MAX(W$73:$W78)+1,0))","v":0},{"$error":"#N/A"},null,0,0,{"$error":"#N/A"},null,1,1,24166,null,1,0,{"$error":"#N/A"},null,0,0,{"$error":"#N/A"},null,null,{"$error":"#N/A"},24166]
[null,"2018-08-01",{"$f":"IFERROR(IF(GETPIVOTDATA(\"Value\",Pivots_LA!$A$6,\"Month\",$B80,\"Delay reason\",$C$19)=0,\"\",GETPIVOTDATA(\"Value\",Pivots_LA!$A$6,\"Month\",$B80,\"Delay reason\",$C$19)),NA())","v":24797},24797,null,null,24996.76,28716.105,21277.414999999997,null,null,null,null,"2018-08-01",631,{"$f":"IF(O80=\"\",P79,AVERAGE(IF($O$74:O$98<>\"\",$O$74:O$98)))","v":1398.25},3719.3450000000003,4572.2775000000001,null,null,null,null,{"$f":"IF($D$72>5,NA(),IF(C80>H80,MAX(W$73:$W79)+1,0))","v":0},{"$f":"IF($D$72>5,NA(),IF(C80<I80,MAX(W$73:$W79)+1,0))","v":0},{"$error":"#N/A"},null,0,0,{"$error":"#N/A"},null,1,1,24797,null,1,0,{"$error":"#N/A"},null,0,0,{"$error":"#N/A"},null,null,{"$error":"#N/A"},24797]
[null,"2018-09-01",{"$f":"IFERROR(IF(GETPIVOTDATA(\"Value\",Pivots_LA!$A$6,\"Month\",$B81,\"Delay reason\",$C$19)=0,\"\",GETPIVOTDATA(\"Value\",Pivots_LA!$A$6,\"Month\",$B81,\"Delay reason\",$C$19)),NA())","v":22400},22400,null,null,24996.76,28716.105,21277.414999999997,null,null,null,null,"2018-09-01",2397,{"$f":"IF(O81=\"\",P80,AVERAGE(IF($O$74:O$98<>\"\",$O$74:O$98)))","v":1398.25},3719.3450000000003,4572.2775000000001,null,null,null,null,{"$f":"IF($D$72>5,NA(),IF(C81>H81,MAX(W$73:$W80)+1,0))","v":0},{"$f":"IF($D$72>5,NA(),IF(C81<I81,MAX(W$73:$W80)+1,0))","v":0},{"$error":"#N/A"},null,0,0,{"$error":"#N/A"},null,1,1,22400,null,0,0,{"$error":"#N/A"},null,1,0,{"$error":"#N/A"},null,null,{"$error":"#N/A"},22400]
[null,"2018-10-01",{"$f":"IFERROR(IF(GETPIVOTDATA(\"Value\",Pivots_LA!$A$6,\"Month\",$B82,\"Delay reason\",$C$19)=0,\"\",GETPIVOTDATA(\"Value\",Pivots_LA!$A$6,\"Month\",$B82,\"Delay reason\",$C$19)),NA())","v":22411},22411,null,null,24996.76,28716.105,21277.414999999997,null,null,null,null,"2018-10-01",11,{"$f":"IF(O82=\"\",P81,AVERAGE(IF($O$74:O$98<>\"\",$O$74:O$98)))","v":1398.25},3719.3450000000003,4572.2775000000001,null,null,null,null,{"$f":"IF($D$72>5,NA(),IF(C82>H82,MAX(W$73:$W81)+1,0))","v":0},{"$f":"IF($D$72>5,NA(),IF(C82<I82,MAX(W$73:$W81)+1,0))","v":0},{"$error":"#N/A"},null,0,0,{"$error":"#N/A"},null,1,1,22411,null,1,0,{"$error":"#N/A"},null,0,0,{"$error":"#N/A"},null,null,{"$error":"#N/A"},22411]
[null,"2018-11-01",{"$f":"IFERROR(IF(GETPIVOTDATA(\"Value\",Pivots_LA!$A$6,\"Month\",$B83,\"Delay reason\",$C$19)=0,\"\",GETPIVOTDATA(\"Value\",Pivots_LA!$A$6,\"Month\",$B83,\"Delay reason\",$C$19)),NA())","v":21587},21587,null,null,24996.76,28716.105,21277.414999999997,null,null,null,null,"2018-11-01",824,{"$f":"IF(O83=\"\",P82,AVERAGE(IF($O$74:O$98<>\"\",$O$74:O$98)))","v":1398.25},3719.3450000000003,4572.2775000000001,null,null,null,null,{"$f":"IF($D$72>5,NA(),IF(C83>H83,MAX(W$73:$W82)+1,0))","v":0},{"$f":"IF($D$72>5,NA(),IF(C83<I83,MAX(W$73:$W82)+1,0))","v":0},{"$error":"#N/A"},null,0,0,{"$error":"#N/A"},null,1,1,21587,null,0,0,{"$error":"#N/A"},null,1,0,{"$error":"#N/A"},null,null,{"$error":"#N/A"},21587]
[null,"2018-12-01",{"$f":"IFERROR(IF(GETPIVOTDATA(\"Value\",Pivots_LA!$A$6,\"Month\",$B84,\"Delay reason\",$C$19)=0,\"\",GETPIVOTDATA(\"Value\",Pivots_LA!$A$6,\"Month\",$B84,\"Delay reason\",$C$19)),NA())","v":21361},21361,null,null,24996.76,28716.105,21277.414999999997,null,null,null,null,"2018-12-01",226,{"$f":"IF(O84=\"\",P83,AVERAGE(IF($O$74:O$98<>\"\",$O$74:O$98)))","v":1398.25},3719.3450000000003,4572.2775000000001,null,null,null,null,{"$f":"IF($D$72>5,NA(),IF(C84>H84,MAX(W$73:$W83)+1,0))","v":0},{"$f":"IF($D$72>5,NA(),IF(C84<I84,MAX(W$73:$W83)+1,0))","v":0},{"$error":"#N/A"},null,0,0,{"$error":"#N/A"},null,1,1,21361,null,0,0,{"$error":"#N/A"},null,1,0,{"$error":"#N/A"},null,null,{"$error":"#N/A"},21361]
[null,"2019-01-01",{"$f":"IFERROR(IF(GETPIVOTDATA(\"Value\",Pivots_LA!$A$6,\"Month\",$B85,\"Delay reason\",$C$19)=0,\"\",GETPIVOTDATA(\"Value\",Pivots_LA!$A$6,\"Month\",$B85,\"Delay reason\",$C$19)),NA())","v":24403},24403,null,null,24996.76,28716.105,21277.414999999997,null,null,null,null,"2019-01-01",3042,{"$f":"IF(O85=\"\",P84,AVERAGE(IF($O$74:O$98<>\"\",$O$74:O$98)))","v":1398.25},3719.3450000000003,4572.2775000000001,null,null,null,null,{"$f":"IF($D$72>5,NA(),IF(C85>H85,MAX(W$73:$W84)+1,0))","v":0},{"$f":"IF($D$72>5,NA(),IF(C85<I85,MAX(W$73:$W84)+1,0))","v":0},{"$error":"#N/A"},null,0,0,{"$error":"#N/A"},null,1,1,24403,null,1,0,{"$error":"#N/A"},null,0,0,{"$error":"#N/A"},null,null,{"$error":"#N/A"},24403]
[null,"2019-02-01",{"$f":"IFERROR(IF(GETPIVOTDATA(\"Value\",Pivots_LA!$A$6,\"Month\",$B86,\"Delay reason\",$C$19)=0,\"\",GETPIVOTDATA(\"Value\",Pivots_LA!$A$6,\"Month\",$B86,\"Delay reason\",$C$19)),NA())","v":24289},24289,null,null,24996.76,28716.105,21277.414999999997,null,null,null,null,"2019-02-01",114,{"$f":"IF(O86=\"\",P85,AVERAGE(IF($O$74:O$98<>\"\",$O$74:O$98)))","v":1398.25},3719.3450000000003,4572.2775000000001,null,null,null,null,{"$f":"IF($D$72>5,NA(),IF(C86>H86,MAX(W$73:$W85)+1,0))","v":0},{"$f":"IF($D$72>5,NA(),IF(C86<I86,MAX(W$73:$W85)+1,0))","v":0},{"$error":"#N/A"},null,0,0,{"$error":"#N/A"},null,1,1,24289,null,0,0,{"$error":"#N/A"},null,1,0,{"$error":"#N/A"},null,null,{"$error":"#N/A"},24289]
[null,"2019-03-01",{"$f":"IFERROR(IF(GETPIVOTDATA(\"Value\",Pivots_LA!$A$6,\"Month\",$B87,\"Delay reason\",$C$19)=0,\"\",GETPIVOTDATA(\"Value\",Pivots_LA!$A$6,\"Month\",$B87,\"Delay reason\",$C$19)),NA())","v":26458},26458,null,null,24996.76,28716.105,21277.414999999997,null,null,null,null,"2019-03-01",2169,{"$f":"IF(O87=\"\",P86,AVERAGE(IF($O$74:O$98<>\"\",$O$74:O$98)))","v":1398.25},3719.3450000000003,4572.2775000000001,null,null,null,null,{"$f":"IF($D$72>5,NA(),IF(C87>H87,MAX(W$73:$W86)+1,0))","v":0},{"$f":"IF($D$72>5,NA(),IF(C87<I87,MAX(W$73:$W86)+1,0))","v":0},{"$error":"#N/A"},null,1,0,{"$error":"#N/A"},null,0,0,{"$error":"#N/A"},null,1,0,{"$error":"#N/A"},null,0,0,{"$error":"#N/A"},null,null,{"$error":"#N/A"},{"$error":"#N/A"}]
[null,"2019-04-01",{"$f":"IFERROR(IF(GETPIVOTDATA(\"Value\",Pivots_LA!$A$6,\"Month\",$B88,\"Delay reason\",$C$19)=0,\"\",GETPIVOTDATA(\"Value\",Pivots_LA!$A$6,\"Month\",$B88,\"Delay reason\",$C$19)),NA())","v":25624},25624,null,null,24996.76,28716.105,21277.414999999997,null,null,null,null,"2019-04-01",834,{"$f":"IF(O88=\"\",P87,AVERAGE(IF($O$74:O$98<>\"\",$O$74:O$98)))","v":1398.25},3719.3450000000003,4572.2775000000001,null,null,null,null,{"$f":"IF($D$72>5,NA(),IF(C88>H88,MAX(W$73:$W87)+1,0))","v":0},{"$f":"IF($D$72>5,NA(),IF(C88<I88,MAX(W$73:$W87)+1,0))","v":0},{"$error":"#N/A"},null,1,0,{"$error":"#N/A"},null,0,0,{"$error":"#N/A"},null,0,0,{"$error":"#N/A"},null,1,0,{"$error":"#N/A"},null,null,{"$error":"#N/A"},{"$error":"#N/A"}]
[null,"2019-05-01",{"$f":"IFERROR(IF(GETPIVOTDATA(\"Value\",Pivots_LA!$A$6,\"Month\",$B89,\"Delay reason\",$C$19)=0,\"\",GETPIVOTDATA(\"Value\",Pivots_LA!$A$6,\"Month\",$B89,\"Delay reason\",$C$19)),NA())","v":26157},26157,null,null,24996.76,28716.105,21277.414999999997,null,null,null,null,"2019-05-01",533,{"$f":"IF(O89=\"\",P88,AVERAGE(IF($O$74:O$98<>\"\",$O$74:O$98)))","v":1398.25},3719.3450000000003,4572.2775000000001,null,null,null,null,{"$f":"IF($D$72>5,NA(),IF(C89>H89,MAX(W$73:$W88)+1,0))","v":0},{"$f":"IF($D$72>5,NA(),IF(C89<I89,MAX(W$73:$W88)+1,0))","v":0},{"$error":"#N/A"},null,1,0,{"$error":"#N/A"},null,0,0,{"$error":"#N/A"},null,1,0,{"$error":"#N/A"},null,0,0,{"$error":"#N/A"},null,null,{"$error":"#N/A"},{"$error":"#N/A"}]
[null,"2019-06-01",{"$f":"IFERROR(IF(GETPIVOTDATA(\"Value\",Pivots_LA!$A$6,\"Month\",$B90,\"Delay reason\",$C$19)=0,\"\",GETPIVOTDATA(\"Value\",Pivots_LA!$A$6,\"Month\",$B90,\"Delay reason\",$C$19)),NA())","v":24654},24654,null,null,24996.76,28716.105,21277.414999999997,null,null,null,null,"2019-06-01",1503,{"$f":"IF(O90=\"\",P89,AVERAGE(IF($O$74:O$98<>\"\",$O$74:O$98)))","v":1398.25},3719.3450000000003,4572.2775000000001,null,null,null,null,{"$f":"IF($D$72>5,NA(),IF(C90>H90,MAX(W$73:$W89)+1,0))","v":0},{"$f":"IF($D$72>5,NA(),IF(C90<I90,MAX(W$73:$W89)+1,0))","v":0},{"$error":"#N/A"},null,0,0,{"$error":"#N/A"},null,1,0,{"$error":"#N/A"},null,0,0,{"$error":"#N/A"},null,1,0,{"$error":"#N/A"},null,null,{"$error":"#N/A"},{"$error":"#N/A"}]
[null,"2019-07-01",{"$f":"IFERROR(IF(GETPIVOTDATA(\"Value\",Pivots_LA!$A$6,\"Month\",$B91,\"Delay reason\",$C$19)=0,\"\",GETPIVOTDATA(\"Value\",Pivots_LA!$A$6,\"Month\",$B91,\"Delay reason\",$C$19)),NA())","v":24947},24947,null,null,24996.76,28716.105,21277.414999999997,null,null,null,null,"2019-07-01",293,{"$f":"IF(O91=\"\",P90,AVERAGE(IF($O$74:O$98<>\"\",$O$74:O$98)))","v":1398.25},3719.3450000000003,4572.2775000000001,null,null,null,null,{"$f":"IF($D$72>5,NA(),IF(C91>H91,MAX(W$73:$W90)+1,0))","v":0},{"$f":"IF($D$72>5,NA(),IF(C91<I91,MAX(W$73:$W90)+1,0))","v":0},{"$error":"#N/A"},null,0,0,{"$error":"#N/A"},null,1,{"$f":"IFERROR(IF(AND(AF90=1,AE91=1),1,IF(SUM(AE91:AE97)>=7,1,0)),0)","v":0},{"$error":"#N/A"},null,1,0,{"$error":"#N/A"},null,0,0,{"$error":"#N/A"},null,null,{"$error":"#N/A"},{"$error":"#N/A"}]
[null,"2019-08-01",{"$f":"IFERROR(IF(GETPIVOTDATA(\"Value\",Pivots_LA!$A$6,\"Month\",$B92,\"Delay reason\",$C$19)=0,\"\",GETPIVOTDATA(\"Value\",Pivots_LA!$A$6,\"Month\",$B92,\"Delay reason\",$C$19)),NA())","v":24287},24287,null,null,24996.76,28716.105,21277.414999999997,null,null,null,null,"2019-08-01",660,{"$f":"IF(O92=\"\",P91,AVERAGE(IF($O$74:O$98<>\"\",$O$74:O$98)))","v":1398.25},3719.3450000000003,4572.2775000000001,null,null,null,null,{"$f":"IF($D$72>5,NA(),IF(C92>H92,MAX(W$73:$W91)+1,0))","v":0},{"$f":"IF($D$72>5,NA(),IF(C92<I92,MAX(W$73:$W91)+1,0))","v":0},{"$error":"#N/A"},null,0,0,{"$error":"#N/A"},null,1,{"$f":"IFERROR(IF(AND(AF91=1,AE92=1),1,IF(SUM(AE92:AE98)>=7,1,0)),0)","v":0},{"$error":"#N/A"},null,0,0,{"$error":"#N/A"},null,1,0,{"$error":"#N/A"},null,null,{"$error":"#N/A"},{"$error":"#N/A"}]
[null,"2019-09-01",{"$f":"IFERROR(IF(GETPIVOTDATA(\"Value\",Pivots_LA!$A$6,\"Month\",$B93,\"Delay reason\",$C$19)=0,\"\",GETPIVOTDATA(\"Value\",Pivots_LA!$A$6,\"Month\",$B93,\"Delay reason\",$C$19)),NA())","v":24335},24335,null,null,24996.76,28716.105,21277.414999999997,null,null,null,null,"2019-09-01",48,{"$f":"IF(O93=\"\",P92,AVERAGE(IF($O$74:O$98<>\"\",$O$74:O$98)))","v":1398.25},3719.3450000000003,4572.2775000000001,null,null,null,null,{"$f":"IF($D$72>5,NA(),IF(C93>H93,MAX(W$73:$W92)+1,0))","v":0},{"$f":"IF($D$72>5,NA(),IF(C93<I93,MAX(W$73:$W92)+1,0))","v":0},{"$error":"#N/A"},null,0,{"$f":"IFERROR(IF(AND(AB92=1,AA93=1),1,IF(SUM(AA93:AA98)>=7,1,0)),0)","v":0},{"$error":"#N/A"},null,1,{"$f":"IFERROR(IF(AND(AF92=1,AE93=1),1,IF(SUM(AE93:AE98)>=7,1,0)),0)","v":0},{"$error":"#N/A"},null,1,0,{"$error":"#N/A"},null,0,0,{"$error":"#N/A"},null,null,{"$error":"#N/A"},{"$error":"#N/A"}]
[null,"2019-10-01",{"$f":"IFERROR(IF(GETPIVOTDATA(\"Value\",Pivots_LA!$A$6,\"Month\",$B94,\"Delay reason\",$C$19)=0,\"\",GETPIVOTDATA(\"Value\",Pivots_LA!$A$6,\"Month\",$B94,\"Delay reason\",$C$19)),NA())","v":26023},26023,null,null,24996.76,28716.105,21277.414999999997,null,null,null,null,"2019-10-01",1688,{"$f":"IF(O94=\"\",P93,AVERAGE(IF($O$74:O$98<>\"\",$O$74:O$98)))","v":1398.25},3719.3450000000003,4572.2775000000001,null,null,null,null,{"$f":"IF($D$72>5,NA(),IF(C94>H94,MAX(W$73:$W93)+1,0))","v":0},{"$f":"IF($D$72>5,NA(),IF(C94<I94,MAX(W$73:$W93)+1,0))","v":0},{"$error":"#N/A"},null,1,{"$f":"IFERROR(IF(AND(AB93=1,AA94=1),1,IF(SUM(AA94:AA98)>=7,1,0)),0)","v":0},{"$error":"#N/A"},null,0,{"$f":"IFERROR(IF(AND(AF93=1,AE94=1),1,IF(SUM(AE94:AE98)>=7,1,0)),0)","v":0},{"$error":"#N/A"},null,1,0,{"$error":"#N/A"},null,0,0,{"$error":"#N/A"},null,null,{"$error":"#N/A"},{"$error":"#N/A"}]
[null,"2019-11-01",{"$f":"IFERROR(IF(GETPIVOTDATA(\"Value\",Pivots_LA!$A$6,\"Month\",$B95,\"Delay reason\",$C$19)=0,\"\",GETPIVOTDATA(\"Value\",Pivots_LA!$A$6,\"Month\",$B95,\"Delay reason\",$C$19)),NA())","v":25116},25116,null,null,24996.76,28716.105,21277.414999999997,null,null,null,null,"2019-11-01",907,{"$f":"IF(O95=\"\",P94,AVERAGE(IF($O$74:O$98<>\"\",$O$74:O$98)))","v":1398.25},3719.3450000000003,4572.2775000000001,null,null,null,null,{"$f":"IF($D$72>5,NA(),IF(C95>H95,MAX(W$73:$W94)+1,0))","v":0},{"$f":"IF($D$72>5,NA(),IF(C95<I95,MAX(W$73:$W94)+1,0))","v":0},{"$error":"#N/A"},null,1,{"$f":"IFERROR(IF(AND(AB94=1,AA95=1),1,IF(SUM(AA95:AA101)>=7,1,0)),0)","v":0},{"$error":"#N/A"},null,0,{"$f":"IFERROR(IF(AND(AF94=1,AE95=1),1,IF(SUM(AE95:AE98)>=7,1,0)),0)","v":0},{"$error":"#N/A"},null,0,{"$f":"IF(AND(AJ94=1,AI95=1),1,IF(SUM(AI95:AI98)>=7,1,0))","v":0},{"$error":"#N/A"},null,1,{"$f":"IF(AND(AN94=1,AM95=1),1,IF(SUM(AM95:AM98)>=7,1,0))","v":0},{"$error":"#N/A"},null,null,{"$error":"#N/A"},{"$error":"#N/A"}]
[null,"2019-12-01",{"$f":"IFERROR(IF(GETPIVOTDATA(\"Value\",Pivots_LA!$A$6,\"Month\",$B96,\"Delay reason\",$C$19)=0,\"\",GETPIVOTDATA(\"Value\",Pivots_LA!$A$6,\"Month\",$B96,\"Delay reason\",$C$19)),NA())","v":25463},25463,null,null,24996.76,28716.105,21277.414999999997,null,null,null,null,"2019-12-01",347,{"$f":"IF(O96=\"\",P95,AVERAGE(IF($O$74:O$98<>\"\",$O$74:O$98)))","v":1398.25},3719.3450000000003,4572.2775000000001,null,null,null,null,{"$f":"IF($D$72>5,NA(),IF(C96>H96,MAX(W$73:$W95)+1,0))","v":0},{"$f":"IF($D$72>5,NA(),IF(C96<I96,MAX(W$73:$W95)+1,0))","v":0},{"$error":"#N/A"},null,1,{"$f":"IFERROR(IF(AND(AB95=1,AA96=1),1,IF(SUM(AA96:AA98)>=7,1,0)),0)","v":0},{"$error":"#N/A"},null,0,{"$f":"IFERROR(IF(AND(AF95=1,AE96=1),1,IF(SUM(AE96:AE98)>=7,1,0)),0)","v":0},{"$error":"#N/A"},null,1,{"$f":"IF(AND(AJ95=1,AI96=1),1,IF(SUM(AI96:AI98)>=7,1,0))","v":0},{"$error":"#N/A"},null,0,{"$f":"IF(AND(AN95=1,AM96=1),1,IF(SUM(AM96:AM98)>=7,1,0))","v":0},{"$error":"#N/A"},null,null,{"$error":"#N/A"},{"$error":"#N/A"}]
[null,"2020-01-01",{"$f":"IFERROR(IF(GETPIVOTDATA(\"Value\",Pivots_LA!$A$6,\"Month\",$B97,\"Delay reason\",$C$19)=0,\"\",GETPIVOTDATA(\"Value\",Pivots_LA!$A$6,\"Month\",$B97,\"Delay reason\",$C$19)),NA())","v":29511},29511,null,null,24996.76,28716.105,21277.414999999997,null,null,null,null,{"$f":"B97","v":"2020-01-01"},4048,{"$f":"IF(O97=\"\",P96,AVERAGE(IF($O$74:O$98<>\"\",$O$74:O$98)))","v":1398.25},3719.3450000000003,4572.2775000000001,null,null,null,null,{"$f":"IF($D$72>5,NA(),IF(C97>H97,MAX(W$73:$W96)+1,0))","v":2},{"$f":"IF($D$72>5,NA(),IF(C97<I97,MAX(W$73:$W96)+1,0))","v":0},29511,null,1,{"$f":"IFERROR(IF(AND(AB96=1,AA97=1),1,IF(SUM(AA97:AA98)>=7,1,0)),0)","v":0},{"$error":"#N/A"},null,0,{"$f":"IFERROR(IF(AND(AF96=1,AE97=1),1,IF(SUM(AE97:AE98)>=7,1,0)),0)","v":0},{"$error":"#N/A"},null,1,{"$f":"IF(AND(AJ96=1,AI97=1),1,IF(SUM(AI97:AI98)>=7,1,0))","v":0},{"$error":"#N/A"},null,0,{"$f":"IF(AND(AN96=1,AM97=1),1,IF(SUM(AM97:AM98)>=7,1,0))","v":0},{"$error":"#N/A"},null,null,29511,{"$error":"#N/A"}]
[null,"2020-02-01",{"$f":"IFERROR(IF(GETPIVOTDATA(\"Value\",Pivots_LA!$A$6,\"Month\",$B98,\"Delay reason\",$C$19)=0,\"\",GETPIVOTDATA(\"Value\",Pivots_LA!$A$6,\"Month\",$B98,\"Delay reason\",$C$19)),NA())","v":28473},28473,null,null,24996.76,28716.105,21277.414999999997,null,null,null,null,{"$f":"B98","v":"2020-02-01"},{"$f":"IF(D97=\"\",\"\",IF(D98=\"\",\"\",ABS(D97-D98)))","v":1038},{"$f":"IF(O98=\"\",P97,AVERAGE(IF($O$74:O$98<>\"\",$O$74:O$98)))","v":1398.25},{"$f":"IF(ISERROR((P98*2.66)),Q99,(P98*2.66))","v":3719.3450000000003},{"$f":"$P98*3.27","v":4572.2775000000001},null,null,null,null,{"$f":"IF($D$72>5,NA(),IF(C98>H98,MAX(W$73:$W97)+1,0))","v":0},{"$f":"IF($D$72>5,NA(),IF(C98<I98,MAX(W$73:$W97)+1,0))","v":0},{"$error":"#N/A"},null,1,{"$f":"IFERROR(IF(AND(AB97=1,AA98=1),1,IF(SUM(AA98)>=7,1,0)),0)","v":0},{"$error":"#N/A"},null,0,{"$f":"IFERROR(IF(AND(AF97=1,AE98=1),1,IF(SUM(AE98)>=7,1,0)),0)","v":0},{"$error":"#N/A"},null,0,{"$f":"IF(AND(AJ97=1,AI98=1),1,IF(SUM(AI98)>=7,1,0))","v":0},{"$error":"#N/A"},null,1,{"$f":"IF(AND(AN97=1,AM98=1),1,IF(SUM(AM98)>=7,1,0))","v":0},{"$error":"#N/A"},null,null,{"$f":"IF(OR(W98>0,AB98>0,AJ98>0),C98,NA())","v":{"$error":"#N/A"}},{"$error":"#N/A"}]
[]
[null,{"$f":"C20","v":"Dii) Awaiting nursing home placement or availability"},null,"Count IF data point is zero"]
[null,{"$f":"B33","v":0},{"$f":"ROW()","v":101},{"$f":"COUNTIF(D103:D127,0)","v":0},null,null,null,"Upper","Lower",null,null,null,null,null,"Difference",null,"Sigma",null,null,null,null,null,"> 3","< 3 ",null,null,"7 points above/below mean",null,null,null,null,null,null,null,"Trend up/down",null,null,null,null,null,null,null,null,"chart 3"]
[null,"ID (Week no.)","Plot data","Data",null,null,"Mean","Control limits ","control limit (-3)",null,null,null,null,"Date","For. Roll avg","Cumul. Moving Avg.","2.66* MR","3.27*MR",null,null,null,null,"Count","Count","Above/below 3 sigma",null,"7 points > mean","Count of 7 point ","7 points above mean",null,"7 points <mean","Count of 7point ","7 points below mean",null,"Trend up",null,null,null,"Trend Down",null,null,null,null,"Concern","Improvement"]
[null,{"$f":"D9","v":"2018-02-01"},{"$f":"IFERROR(IF(GETPIVOTDATA(\"Value\",Pivots_LA!$A$6,\"Month\",$B103,\"Delay reason\",$C$20)=0,\"\",GETPIVOTDATA(\"Value\",Pivots_LA!$A$6,\"Month\",$B103,\"Delay reason\",$C$20)),NA())","v":19461},{"$f":"IFERROR(IF(C103=\"\",0,C103),\"\")","v":19461},null,null,{"$f":"AVERAGE($D$103:$D$127)","v":19275},{"$f":"IF($D$101>5,NA(),IF(D103=\"\",H102,G103+Q103))","v":21669.997500000001},{"$f":"IF($D$101>5,NA(),IF(D103=\"\",I102,G103-Q103))","v":16880.002499999999},null,null,null,null,{"$f":"B103","v":"2018-02-01"},null,{"$f":"IF(O103=\"\",P102,AVERAGE(IF($O$103:O$127<>\"\",$O$103:O$127)))","v":"Cumul. Moving Avg."},{"$f":"Q104","v":2394.9974999999999},{"$f":"R104","v":2944.2262500000002},null,null,null,null,{"$f":"IF($D$101>5,NA(),IF(C103>H103,MAX(W$102:$W102)+1,0))","v":0},{"$f":"IF($D$101>5,NA(),IF(C103<I103,MAX(W$102:$W102)+1,0))","v":0},{"$f":"IF(OR(W103>0,X103>0),C103,NA())","v":{"$error":"#N/A"}},null,{"$f":"IF($D$101>5,NA(), IF(C103>G103,1,0))","v":1},{"$f":"IFERROR(IF(AND(AB102=1,AA103=1),1,IF(SUM(AA103:AA109)>=7,1,0)),0)","v":0},{"$f":"IF(AB103=0,NA(),C103)","v":{"$error":"#N/A"}},null,{"$f":"IF($D$101>5,NA(), IF(C103<G103,1,0))","v":0},{"$f":"IFERROR(IF(AND(AF102=1,AE103=1),1,IF(SUM(AE103:AE109)>=7,1,0)),0)","v":0},{"$f":"IF(AF103=0,NA(),C103)","v":{"$error":"#N/A"}},null,{"$f":"IF($D$101>5,NA(),IF(C103>C102,1,0))","v":0},{"$f":"IF(AND(AJ102=1,AI103=1),1,IF(SUM(AI103:AI109)>=7,1,0))","v":0},{"$f":"IF(AJ103=0,NA(),C103)","v":{"$error":"#N/A"}},null,{"$f":"IF($D$101>5,NA(),IF(C103<C102,1,0))","v":1},{"$f":"IF(AND(AN102=1,AM103=1),1,IF(SUM(AM103:AM109)>=7,1,0))","v":0},{"$f":"IF(AN103=0,NA(),C103)","v":{"$error":"#N/A"}},null,null,{"$f":"IF(OR(W103>0,AB103>0,AJ103>0),C103,NA())","v":{"$error":"#N/A"}},{"$f":"IF(OR(X103>0,AF103>0,AN103>0),C103,NA())","v":{"$error":"#N/A"}}]
[null,{"$f":"IF(DAY(B103+31)=1,B103+31,B103+31-DAY(B103+31)+1)","v":"2018-03-01"},{"$f":"IFERROR(IF(GETPIVOTDATA(\"Value\",Pivots_LA!$A$6,\"Month\",$B104,\"Delay reason\",$C$20)=0,\"\",GETPIVOTDATA(\"Value\",Pivots_LA!$A$6,\"Month\",$B104,\"Delay reason\",$C$20)),NA())","v":20569},{"$f":"IFERROR(IF(C104=\"\",0,C104),\"\")","v":20569},null,null,{"$f":"AVERAGE($D$103:$D$127)","v":19275},{"$f":"IF($D$101>5,NA(),IF(D104=\"\",H103,G104+Q104))","v":21669.997500000001},{"$f":"IF($D$101>5,NA(),IF(D104=\"\",I103,G104-Q104))","v":16880.002499999999},null,null,null,null,"2018-03-01",{"$f":"IF(D103=\"\",\"\",IF(D104=\"\",\"\",ABS(D103-D104)))","v":1108},{"$f":"IF(O104=\"\",P103,AVERAGE(IF($O$103:O$127<>\"\",$O$103:O$127)))","v":900.375},{"$f":"IF(ISERROR((P104*2.66)),Q105,(P104*2.66))","v":2394.9974999999999},{"$f":"$P104*3.27","v":2944.2262500000002},null,null,null,null,{"$f":"IF($D$101>5,NA(),IF(C104>H104,MAX(W$102:$W103)+1,0))","v":0},{"$f":"IF($D$101>5,NA(),IF(C104<I104,MAX(W$102:$W103)+1,0))","v":0},{"$f":"IF(OR(W104>0,X104>0),C104,NA())","v":{"$error":"#N/A"}},null,{"$f":"IF($D$101>5,NA(), IF(C104>G104,1,0))","v":1},{"$f":"IFERROR(IF(AND(AB103=1,AA104=1),1,IF(SUM(AA104:AA110)>=7,1,0)),0)","v":0},{"$f":"IF(AB104=0,NA(),C104)","v":{"$error":"#N/A"}},null,{"$f":"IF($D$101>5,NA(), IF(C104<G104,1,0))","v":0},{"$f":"IFERROR(IF(AND(AF103=1,AE104=1),1,IF(SUM(AE104:AE110)>=7,1,0)),0)","v":0},{"$f":"IF(AF104=0,NA(),C104)","v":{"$error":"#N/A"}},null,{"$f":"IF($D$101>5,NA(),IF(C104>C103,1,0))","v":1},{"$f":"IF(AND(AJ103=1,AI104=1),1,IF(SUM(AI104:AI109)>=6,1,0))","v":0},{"$f":"IF(AJ104=0,NA(),C104)","v":{"$error":"#N/A"}},null,{"$f":"IF($D$101>5,NA(),IF(C104<C103,1,0))","v":0},{"$f":"IF(AND(AN103=1,AM104=1),1,IF(SUM(AM104:AM110)>=7,1,0))","v":0},{"$f":"IF(AN104=0,NA(),C104)","v":{"$error":"#N/A"}},null,null,{"$f":"IF(OR(W104>0,AB104>0,AJ104>0),C104,NA())","v":{"$error":"#N/A"}},{"$f":"IF(OR(X104>0,AF104>0,AN104>0),C104,NA())","v":{"$error":"#N/A"}}]
[null,{"$f":"IF(DAY(B104+31)=1,B104+31,B104+31-DAY(B104+31)+1)","v":"2018-04-01"},{"$f":"IFERROR(IF(GETPIVOTDATA(\"Value\",Pivots_LA!$A$6,\"Month\",$B105,\"Delay reason\",$C$20)=0,\"\",GETPIVOTDATA(\"Value\",Pivots_LA!$A$6,\"Month\",$B105,\"Delay reason\",$C$20)),NA())","v":19803},19803,null,null,19275,21669.997500000001,16880.002499999999,null,null,null,null,"2018-04-01",{"$f":"IF(D104=\"\",\"\",IF(D105=\"\",\"\",ABS(D104-D105)))","v":766},{"$f":"IF(O105=\"\",P104,AVERAGE(IF($O$103:O$127<>\"\",$O$103:O$127)))","v":900.375},{"$f":"IF(ISERROR((P105*2.66)),Q106,(P105*2.66))","v":2394.9974999999999},{"$f":"$P105*3.27","v":2944.2262500000002},null,null,null,null,{"$f":"IF($D$101>5,NA(),IF(C105>H105,MAX(W$102:$W104)+1,0))","v":0},{"$f":"IF($D$101>5,NA(),IF(C105<I105,MAX(W$102:$W104)+1,0))","v":0},{"$error":"#N/A"},null,1,0,{"$error":"#N/A"},null,0,0,{"$error":"#N/A"},null,0,0,{"$error":"#N/A"},null,1,0,{"$error":"#N/A"},null,null,{"$error":"#N/A"},{"$error":"#N/A"}]
[null,"2018-05-01",{"$f":"IFERROR(IF(GETPIVOTDATA(\"Value\",Pivots_LA!$A$6,\"Month\",$B106,\"Delay reason\",$C$20)=0,\"\",GETPIVOTDATA(\"Value\",Pivots_LA!$A$6,\"Month\",$B106,\"Delay reason\",$C$20)),NA())","v":19173},19173,null,null,19275,21669.997500000001,16880.002499999999,null,null,null,null,"2018-05-01",630,{"$f":"IF(O106=\"\",P105,AVERAGE(IF($O$103:O$127<>\"\",$O$103:O$127)))","v":900.375},{"$f":"IF(ISERROR((P106*2.66)),Q107,(P106*2.66))","v":2394.9974999999999},{"$f":"$P106*3.27","v":2944.2262500000002},null,null,null,null,{"$f":"IF($D$101>5,NA(),IF(C106>H106,MAX(W$102:$W105)+1,0))","v":0},{"$f":"IF($D$101>5,NA(),IF(C106<I106,MAX(W$102:$W105)+1,0))","v":0},{"$error":"#N/A"},null,0,0,{"$error":"#N/A"},null,1,0,{"$error":"#N/A"},null,0,0,{"$error":"#N/A"},null,1,0,{"$error":"#N/A"},null,null,{"$error":"#N/A"},{"$error":"#N/A"}]
[null,"2018-06-01",{"$f":"IFERROR(IF(GETPIVOTDATA(\"Value\",Pivots_LA!$A$6,\"Month\",$B107,\"Delay reason\",$C$20)=0,\"\",GETPIVOTDATA(\"Value\",Pivots_LA!$A$6,\"Month\",$B107,\"Delay reason\",$C$20)),NA())","v":18511},18511,null,null,19275,21669.997500000001,16880.002499999999,null,null,null,null,"2018-06-01",662,{"$f":"IF(O107=\"\",P106,AVERAGE(IF($O$103:O$127<>\"\",$O$103:O$127)))","v":900.375},{"$f":"IF(ISERROR((P107*2.66)),Q108,(P107*2.66))","v":2394.9974999999999},2944.2262500000002,null,null,null,null,{"$f":"IF($D$101>5,NA(),IF(C107>H107,MAX(W$102:$W106)+1,0))","v":0},{"$f":"IF($D$101>5,NA(),IF(C107<I107,MAX(W$102:$W106)+1,0))","v":0},{"$error":"#N/A"},null,0,0,{"$error":"#N/A"},null,1,0,{"$error":"#N/A"},null,0,0,{"$error":"#N/A"},null,1,0,{"$error":"#N/A"},null,null,{"$error":"#N/A"},{"$error":"#N/A"}]
[null,"2018-07-01",{"$f":"IFERROR(IF(GETPIVOTDATA(\"Value\",Pivots_LA!$A$6,\"Month\",$B108,\"Delay reason\",$C$20)=0,\"\",GETPIVOTDATA(\"Value\",Pivots_LA!$A$6,\"Month\",$B108,\"Delay reason\",$C$20)),NA())","v":19331},19331,null,null,19275,21669.997500000001,16880.002499999999,null,null,null,null,"2018-07-01",820,{"$f":"IF(O108=\"\",P107,AVERAGE(IF($O$103:O$127<>\"\",$O$103:O$127)))","v":900.375},2394.9974999999999,2944.2262500000002,null,null,null,null,{"$f":"IF($D$101>5,NA(),IF(C108>H108,MAX(W$102:$W107)+1,0))","v":0},{"$f":"IF($D$101>5,NA(),IF(C108<I108,MAX(W$102:$W107)+1,0))","v":0},{"$error":"#N/A"},null,1,0,{"$error":"#N/A"},null,0,0,{"$error":"#N/A"},null,1,0,{"$error":"#N/A"},null,0,0,{"$error":"#N/A"},null,null,{"$error":"#N/A"},{"$error":"#N/A"}]
[null,"2018-08-01",{"$f":"IFERROR(IF(GETPIVOTDATA(\"Value\",Pivots_LA!$A$6,\"Month\",$B109,\"Delay reason\",$C$20)=0,\"\",GETPIVOTDATA(\"Value\",Pivots_LA!$A$6,\"Month\",$B109,\"Delay reason\",$C$20)),NA())","v":20672},20672,null,null,19275,21669.997500000001,16880.002499999999,null,null,null,null,"2018-08-01",1341,{"$f":"IF(O109=\"\",P108,AVERAGE(IF($O$103:O$127<>\"\",$O$103:O$127)))","v":900.375},2394.9974999999999,2944.2262500000002,null,null,null,null,{"$f":"IF($D$101>5,NA(),IF(C109>H109,MAX(W$102:$W108)+1,0))","v":0},{"$f":"IF($D$101>5,NA(),IF(C109<I109,MAX(W$102:$W108)+1,0))","v":0},{"$error":"#N/A"},null,1,0,{"$error":"#N/A"},null,0,0,{"$error":"#N/A"},null,1,0,{"$error":"#N/A"},null,0,0,{"$error":"#N/A"},null,null,{"$error":"#N/A"},{"$error":"#N/A"}]
[null,"2018-09-01",{"$f":"IFERROR(IF(GETPIVOTDATA(\"Value\",Pivots_LA!$A$6,\"Month\",$B110,\"Delay reason\",$C$20)=0,\"\",GETPIVOTDATA(\"Value\",Pivots_LA!$A$6,\"Month\",$B110,\"Delay reason\",$C$20)),NA())","v":21063},21063,null,null,19275,21669.997500000001,16880.002499999999,null,null,null,null,"2018-09-01",391,{"$f":"IF(O110=\"\",P109,AVERAGE(IF($O$103:O$127<>\"\",$O$103:O$127)))","v":900.375},2394.9974999999999,2944.2262500000002,null,null,null,null,{"$f":"IF($D$101>5,NA(),IF(C110>H110,MAX(W$102:$W109)+1,0))","v":0},{"$f":"IF($D$101>5,NA(),IF(C110<I110,MAX(W$102:$W109)+1,0))","v":0},{"$error":"#N/A"},null,1,0,{"$error":"#N/A"},null,0,0,{"$error":"#N/A"},null,1,0,{"$error":"#N/A"},null,0,0,{"$error":"#N/A"},null,null,{"$error":"#N/A"},{"$error":"#N/A"}]
[null,"2018-10-01",{"$f":"IFERROR(IF(GETPIVOTDATA(\"Value\",Pivots_LA!$A$6,\"Month\",$B111,\"Delay reason\",$C$20)=0,\"\",GETPIVOTDATA(\"Value\",Pivots_LA!$A$6,\"Month\",$B111,\"Delay reason\",$C$20)),NA())","v":21062},21062,null,null,19275,21669.997500000001,16880.002499999999,null,null,null,null,"2018-10-01",1,{"$f":"IF(O111=\"\",P110,AVERAGE(IF($O$103:O$127<>\"\",$O$103:O$127)))","v":900.375},2394.9974999999999,2944.2262500000002,null,null,null,null,{"$f":"IF($D$101>5,NA(),IF(C111>H111,MAX(W$102:$W110)+1,0))","v":0},{"$f":"IF($D$101>5,NA(),IF(C111<I111,MAX(W$102:$W110)+1,0))","v":0},{"$error":"#N/A"},null,1,0,{"$error":"#N/A"},null,0,0,{"$error":"#N/A"},null,0,0,{"$error":"#N/A"},null,1,0,{"$error":"#N/A"},null,null,{"$error":"#N/A"},{"$error":"#N/A"}]
[null,"2018-11-01",{"$f":"IFERROR(IF(GETPIVOTDATA(\"Value\",Pivots_LA!$A$6,\"Month\",$B112,\"Delay reason\",$C$20)=0,\"\",GETPIVOTDATA(\"Value\",Pivots_LA!$A$6,\"Month\",$B112,\"Delay reason\",$C$20)),NA())","v":19943},19943,null,null,19275,21669.997500000001,16880.002499999999,null,null,null,null,"2018-11-01",1119,{"$f":"IF(O112=\"\",P111,AVERAGE(IF($O$103:O$127<>\"\",$O$103:O$127)))","v":900.375},2394.9974999999999,2944.2262500000002,null,null,null,null,{"$f":"IF($D$101>5,NA(),IF(C112>H112,MAX(W$102:$W111)+1,0))","v":0},{"$f":"IF($D$101>5,NA(),IF(C112<I112,MAX(W$102:$W111)+1,0))","v":0},{"$error":"#N/A"},null,1,0,{"$error":"#N/A"},null,0,0,{"$error":"#N/A"},null,0,0,{"$error":"#N/A"},null,1,0,{"$error":"#N/A"},null,null,{"$error":"#N/A"},{"$error":"#N/A"}]
[null,"2018-12-01",{"$f":"IFERROR(IF(GETPIVOTDATA(\"Value\",Pivots_LA!$A$6,\"Month\",$B113,\"Delay reason\",$C$20)=0,\"\",GETPIVOTDATA(\"Value\",Pivots_LA!$A$6,\"Month\",$B113,\"Delay reason\",$C$20)),NA())","v":18394},18394,null,null,19275,21669.997500000001,16880.002499999999,null,null,null,null,"2018-12-01",1549,{"$f":"IF(O113=\"\",P112,AVERAGE(IF($O$103:O$127<>\"\",$O$103:O$127)))","v":900.375},2394.9974999999999,2944.2262500000002,null,null,null,null,{"$f":"IF($D$101>5,NA(),IF(C113>H113,MAX(W$102:$W112)+1,0))","v":0},{"$f":"IF($D$101>5,NA(),IF(C113<I113,MAX(W$102:$W112)+1,0))","v":0},{"$error":"#N/A"},null,0,0,{"$error":"#N/A"},null,1,1,18394,null,0,0,{"$error":"#N/A"},null,1,0,{"$error":"#N/A"},null,null,{"$error":"#N/A"},18394]
[null,"2019-01-01",{"$f":"IFERROR(IF(GETPIVOTDATA(\"Value\",Pivots_LA!$A$6,\"Month\",$B114,\"Delay reason\",$C$20)=0,\"\",GETPIVOTDATA(\"Value\",Pivots_LA!$A$6,\"Month\",$B114,\"Delay reason\",$C$20)),NA())","v":17584},17584,null,null,19275,21669.997500000001,16880.002499999999,null,null,null,null,"2019-01-01",810,{"$f":"IF(O114=\"\",P113,AVERAGE(IF($O$103:O$127<>\"\",$O$103:O$127)))","v":900.375},2394.9974999999999,2944.2262500000002,null,null,null,null,{"$f":"IF($D$101>5,NA(),IF(C114>H114,MAX(W$102:$W113)+1,0))","v":0},{"$f":"IF($D$101>5,NA(),IF(C114<I114,MAX(W$102:$W113)+1,0))","v":0},{"$error":"#N/A"},null,0,0,{"$error":"#N/A"},null,1,1,17584,null,0,0,{"$error":"#N/A"},null,1,0,{"$error":"#N/A"},null,null,{"$error":"#N/A"},17584]
[null,"2019-02-01",{"$f":"IFERROR(IF(GETPIVOTDATA(\"Value\",Pivots_LA!$A$6,\"Month\",$B115,\"Delay reason\",$C$20)=0,\"\",GETPIVOTDATA(\"Value\",Pivots_LA!$A$6,\"Month\",$B115,\"Delay reason\",$C$20)),NA())","v":17459},17459,null,null,19275,21669.997500000001,16880.002499999999,null,null,null,null,"2019-02-01",125,{"$f":"IF(O115=\"\",P114,AVERAGE(IF($O$103:O$127<>\"\",$O$103:O$127)))","v":900.375},2394.9974999999999,2944.2262500000002,null,null,null,null,{"$f":"IF($D$101>5,NA(),IF(C115>H115,MAX(W$102:$W114)+1,0))","v":0},{"$f":"IF($D$101>5,NA(),IF(C115<I115,MAX(W$102:$W114)+1,0))","v":0},{"$error":"#N/A"},null,0,0,{"$error":"#N/A"},null,1,1,17459,null,0,0,{"$error":"#N/A"},null,1,0,{"$error":"#N/A"},null,null,{"$error":"#N/A"},17459]
[null,"2019-03-01",{"$f":"IFERROR(IF(GETPIVOTDATA(\"Value\",Pivots_LA!$A$6,\"Month\",$B116,\"Delay reason\",$C$20)=0,\"\",GETPIVOTDATA(\"Value\",Pivots_LA!$A$6,\"Month\",$B116,\"Delay reason\",$C$20)),NA())","v":18380},18380,null,null,19275,21669.997500000001,16880.002499999999,null,null,null,null,"2019-03-01",921,{"$f":"IF(O116=\"\",P115,AVERAGE(IF($O$103:O$127<>\"\",$O$103:O$127)))","v":900.375},2394.9974999999999,2944.2262500000002,null,null,null,null,{"$f":"IF($D$101>5,NA(),IF(C116>H116,MAX(W$102:$W115)+1,0))","v":0},{"$f":"IF($D$101>5,NA(),IF(C116<I116,MAX(W$102:$W115)+1,0))","v":0},{"$error":"#N/A"},null,0,0,{"$error":"#N/A"},null,1,1,18380,null,1,0,{"$error":"#N/A"},null,0,0,{"$error":"#N/A"},null,null,{"$error":"#N/A"},18380]
[null,"2019-04-01",{"$f":"IFERROR(IF(GETPIVOTDATA(\"Value\",Pivots_LA!$A$6,\"Month\",$B117,\"Delay reason\",$C$20)=0,\"\",GETPIVOTDATA(\"Value\",Pivots_LA!$A$6,\"Month\",$B117,\"Delay reason\",$C$20)),NA())","v":17100},17100,null,null,19275,21669.997500000001,16880.002499999999,null,null,null,null,"2019-04-01",1280,{"$f":"IF(O117=\"\",P116,AVERAGE(IF($O$103:O$127<>\"\",$O$103:O$127)))","v":900.375},2394.9974999999999,2944.2262500000002,null,null,null,null,{"$f":"IF($D$101>5,NA(),IF(C117>H117,MAX(W$102:$W116)+1,0))","v":0},{"$f":"IF($D$101>5,NA(),IF(C117<I117,MAX(W$102:$W116)+1,0))","v":0},{"$error":"#N/A"},null,0,0,{"$error":"#N/A"},null,1,1,17100,null,0,0,{"$error":"#N/A"},null,1,0,{"$error":"#N/A"},null,null,{"$error":"#N/A"},17100]
[null,"2019-05-01",{"$f":"IFERROR(IF(GETPIVOTDATA(\"Value\",Pivots_LA!$A$6,\"Month\",$B118,\"Delay reason\",$C$20)=0,\"\",GETPIVOTDATA(\"Value\",Pivots_LA!$A$6,\"Month\",$B118,\"Delay reason\",$C$20)),NA())","v":16902},16902,null,null,19275,21669.997500000001,16880.002499999999,null,null,null,null,"2019-05-01",198,{"$f":"IF(O118=\"\",P117,AVERAGE(IF($O$103:O$127<>\"\",$O$103:O$127)))","v":900.375},2394.9974999999999,2944.2262500000002,null,null,null,null,{"$f":"IF($D$101>5,NA(),IF(C118>H118,MAX(W$102:$W117)+1,0))","v":0},{"$f":"IF($D$101>5,NA(),IF(C118<I118,MAX(W$102:$W117)+1,0))","v":0},{"$error":"#N/A"},null,0,0,{"$error":"#N/A"},null,1,1,16902,null,0,0,{"$error":"#N/A"},null,1,0,{"$error":"#N/A"},null,null,{"$error":"#N/A"},16902]
[null,"2019-06-01",{"$f":"IFERROR(IF(GETPIVOTDATA(\"Value\",Pivots_LA!$A$6,\"Month\",$B119,\"Delay reason\",$C$20)=0,\"\",GETPIVOTDATA(\"Value\",Pivots_LA!$A$6,\"Month\",$B119,\"Delay reason\",$C$20)),NA())","v":17182},17182,null,null,19275,21669.997500000001,16880.002499999999,null,null,null,null,"2019-06-01",280,{"$f":"IF(O119=\"\",P118,AVERAGE(IF($O$103:O$127<>\"\",$O$103:O$127)))","v":900.375},2394.9974999999999,2944.2262500000002,null,null,null,null,{"$f":"IF($D$101>5,NA(),IF(C119>H119,MAX(W$102:$W118)+1,0))","v":0},{"$f":"IF($D$101>5,NA(),IF(C119<I119,MAX(W$102:$W118)+1,0))","v":0},{"$error":"#N/A"},null,0,0,{"$error":"#N/A"},null,1,1,17182,null,1,0,{"$error":"#N/A"},null,0,0,{"$error":"#N/A"},null,null,{"$error":"#N/A"},17182]
[null,"2019-07-01",{"$f":"IFERROR(IF(GETPIVOTDATA(\"Value\",Pivots_LA!$A$6,\"Month\",$B120,\"Delay reason\",$C$20)=0,\"\",GETPIVOTDATA(\"Value\",Pivots_LA!$A$6,\"Month\",$B120,\"Delay reason\",$C$20)),NA())","v":18897},18897,null,null,19275,21669.997500000001,16880.002499999999,null,null,null,null,"2019-07-01",1715,{"$f":"IF(O120=\"\",P119,AVERAGE(IF($O$103:O$127<>\"\",$O$103:O$127)))","v":900.375},2394.9974999999999,2944.2262500000002,null,null,null,null,{"$f":"IF($D$101>5,NA(),IF(C120>H120,MAX(W$102:$W119)+1,0))","v":0},{"$f":"IF($D$101>5,NA(),IF(C120<I120,MAX(W$102:$W119)+1,0))","v":0},{"$error":"#N/A"},null,0,0,{"$error":"#N/A"},null,1,{"$f":"IFERROR(IF(AND(AF119=1,AE120=1),1,IF(SUM(AE120:AE126)>=7,1,0)),0)","v":1},18897,null,1,0,{"$error":"#N/A"},null,0,0,{"$error":"#N/A"},null,null,{"$error":"#N/A"},18897]
[null,"2019-08-01",{"$f":"IFERROR(IF(GETPIVOTDATA(\"Value\",Pivots_LA!$A$6,\"Month\",$B121,\"Delay reason\",$C$20)=0,\"\",GETPIVOTDATA(\"Value\",Pivots_LA!$A$6,\"Month\",$B121,\"Delay reason\",$C$20)),NA())","v":20054},20054,null,null,19275,21669.997500000001,16880.002499999999,null,null,null,null,"2019-08-01",1157,{"$f":"IF(O121=\"\",P120,AVERAGE(IF($O$103:O$127<>\"\",$O$103:O$127)))","v":900.375},2394.9974999999999,2944.2262500000002,null,null,null,null,{"$f":"IF($D$101>5,NA(),IF(C121>H121,MAX(W$102:$W120)+1,0))","v":0},{"$f":"IF($D$101>5,NA(),IF(C121<I121,MAX(W$102:$W120)+1,0))","v":0},{"$error":"#N/A"},null,1,0,{"$error":"#N/A"},null,0,{"$f":"IFERROR(IF(AND(AF120=1,AE121=1),1,IF(SUM(AE121:AE127)>=7,1,0)),0)","v":0},{"$error":"#N/A"},null,1,0,{"$error":"#N/A"},null,0,0,{"$error":"#N/A"},null,null,{"$error":"#N/A"},{"$error":"#N/A"}]
[null,"2019-09-01",{"$f":"IFERROR(IF(GETPIVOTDATA(\"Value\",Pivots_LA!$A$6,\"Month\",$B122,\"Delay reason\",$C$20)=0,\"\",GETPIVOTDATA(\"Value\",Pivots_LA!$A$6,\"Month\",$B122,\"Delay reason\",$C$20)),NA())","v":19432},19432,null,null,{"$f":"AVERAGE($D$103:$D$127)","v":19275},21669.997500000001,16880.002499999999,null,null,null,null,"2019-09-01",622,{"$f":"IF(O122=\"\",P121,AVERAGE(IF($O$103:O$127<>\"\",$O$103:O$127)))","v":900.375},2394.9974999999999,2944.2262500000002,null,null,null,null,{"$f":"IF($D$101>5,NA(),IF(C122>H122,MAX(W$102:$W121)+1,0))","v":0},{"$f":"IF($D$101>5,NA(),IF(C122<I122,MAX(W$102:$W121)+1,0))","v":0},{"$error":"#N/A"},null,1,{"$f":"IFERROR(IF(AND(AB121=1,AA122=1),1,IF(SUM(AA122:AA127)>=7,1,0)),0)","v":0},{"$error":"#N/A"},null,0,{"$f":"IFERROR(IF(AND(AF121=1,AE122=1),1,IF(SUM(AE122:AE127)>=7,1,0)),0)","v":0},{"$error":"#N/A"},null,0,0,{"$error":"#N/A"},null,1,0,{"$error":"#N/A"},null,null,{"$error":"#N/A"},{"$error":"#N/A"}]
[null,"2019-10-01",{"$f":"IFERROR(IF(GETPIVOTDATA(\"Value\",Pivots_LA!$A$6,\"Month\",$B123,\"Delay reason\",$C$20)=0,\"\",GETPIVOTDATA(\"Value\",Pivots_LA!$A$6,\"Month\",$B123,\"Delay reason\",$C$20)),NA())","v":21881},21881,null,null,19275,21669.997500000001,16880.002499999999,null,null,null,null,"2019-10-01",2449,{"$f":"IF(O123=\"\",P122,AVERAGE(IF($O$103:O$127<>\"\",$O$103:O$127)))","v":900.375},2394.9974999999999,2944.2262500000002,null,null,null,null,{"$f":"IF($D$101>5,NA(),IF(C123>H123,MAX(W$102:$W122)+1,0))","v":1},{"$f":"IF($D$101>5,NA(),IF(C123<I123,MAX(W$102:$W122)+1,0))","v":0},21881,null,1,{"$f":"IFERROR(IF(AND(AB122=1,AA123=1),1,IF(SUM(AA123:AA127)>=7,1,0)),0)","v":0},{"$error":"#N/A"},null,0,{"$f":"IFERROR(IF(AND(AF122=1,AE123=1),1,IF(SUM(AE123:AE127)>=7,1,0)),0)","v":0},{"$error":"#N/A"},null,1,0,{"$error":"#N/A"},null,0,0,{"$error":"#N/A"},null,null,21881,{"$error":"#N/A"}]
[null,"2019-11-01",{"$f":"IFERROR(IF(GETPIVOTDATA(\"Value\",Pivots_LA!$A$6,\"Month\",$B124,\"Delay reason\",$C$20)=0,\"\",GETPIVOTDATA(\"Value\",Pivots_LA!$A$6,\"Month\",$B124,\"Delay reason\",$C$20)),NA())","v":19885},19885,null,null,19275,21669.997500000001,16880.002499999999,null,null,null,null,"2019-11-01",1996,{"$f":"IF(O124=\"\",P123,AVERAGE(IF($O$103:O$127<>\"\",$O$103:O$127)))","v":900.375},2394.9974999999999,2944.2262500000002,null,null,null,null,{"$f":"IF($D$101>5,NA(),IF(C124>H124,MAX(W$102:$W123)+1,0))","v":0},{"$f":"IF($D$101>5,NA(),IF(C124<I124,MAX(W$102:$W123)+1,0))","v":0},{"$error":"#N/A"},null,1,{"$f":"IFERROR(IF(AND(AB123=1,AA124=1),1,IF(SUM(AA124:AA130)>=7,1,0)),0)","v":0},{"$error":"#N/A"},null,0,{"$f":"IFERROR(IF(AND(AF123=1,AE124=1),1,IF(SUM(AE124:AE127)>=7,1,0)),0)","v":0},{"$error":"#N/A"},null,0,{"$f":"IF(AND(AJ123=1,AI124=1),1,IF(SUM(AI124:AI127)>=6,1,0))","v":0},{"$error":"#N/A"},null,1,{"$f":"IF(AND(AN123=1,AM124=1),1,IF(SUM(AM124:AM127)>=7,1,0))","v":0},{"$error":"#N/A"},null,null,{"$error":"#N/A"},{"$error":"#N/A"}]
[null,"2019-12-01",{"$f":"IFERROR(IF(GETPIVOTDATA(\"Value\",Pivots_LA!$A$6,\"Month\",$B125,\"Delay reason\",$C$20)=0,\"\",GETPIVOTDATA(\"Value\",Pivots_LA!$A$6,\"Month\",$B125,\"Delay reason\",$C$20)),NA())","v":19251},19251,null,null,19275,21669.997500000001,16880.002499999999,null,null,null,null,"2019-12-01",634,{"$f":"IF(O125=\"\",P124,AVERAGE(IF($O$103:O$127<>\"\",$O$103:O$127)))","v":900.375},2394.9974999999999,2944.2262500000002,null,null,null,null,{"$f":"IF($D$101>5,NA(),IF(C125>H125,MAX(W$102:$W124)+1,0))","v":0},{"$f":"IF($D$101>5,NA(),IF(C125<I125,MAX(W$102:$W124)+1,0))","v":0},{"$error":"#N/A"},null,0,{"$f":"IFERROR(IF(AND(AB124=1,AA125=1),1,IF(SUM(AA125:AA127)>=7,1,0)),0)","v":0},{"$error":"#N/A"},null,1,{"$f":"IFERROR(IF(AND(AF124=1,AE125=1),1,IF(SUM(AE125:AE127)>=7,1,0)),0)","v":0},{"$error":"#N/A"},null,0,{"$f":"IF(AND(AJ124=1,AI125=1),1,IF(SUM(AI125:AI127)>=6,1,0))","v":0},{"$error":"#N/A"},null,1,{"$f":"IF(AND(AN124=1,AM125=1),1,IF(SUM(AM125:AM127)>=7,1,0))","v":0},{"$error":"#N/A"},null,null,{"$error":"#N/A"},{"$error":"#N/A"}]
[null,"2020-01-01",{"$f":"IFERROR(IF(GETPIVOTDATA(\"Value\",Pivots_LA!$A$6,\"Month\",$B126,\"Delay reason\",$C$20)=0,\"\",GETPIVOTDATA(\"Value\",Pivots_LA!$A$6,\"Month\",$B126,\"Delay reason\",$C$20)),NA())","v":19600},19600,null,null,19275,21669.997500000001,16880.002499999999,null,null,null,null,{"$f":"B126","v":"2020-01-01"},349,{"$f":"IF(O126=\"\",P125,AVERAGE(IF($O$103:O$127<>\"\",$O$103:O$127)))","v":900.375},2394.9974999999999,2944.2262500000002,null,null,null,null,{"$f":"IF($D$101>5,NA(),IF(C126>H126,MAX(W$102:$W125)+1,0))","v":0},{"$f":"IF($D$101>5,NA(),IF(C126<I126,MAX(W$102:$W125)+1,0))","v":0},{"$error":"#N/A"},null,1,{"$f":"IFERROR(IF(AND(AB125=1,AA126=1),1,IF(SUM(AA126:AA127)>=7,1,0)),0)","v":0},{"$error":"#N/A"},null,0,{"$f":"IFERROR(IF(AND(AF125=1,AE126=1),1,IF(SUM(AE126:AE127)>=7,1,0)),0)","v":0},{"$error":"#N/A"},null,1,{"$f":"IF(AND(AJ125=1,AI126=1),1,IF(SUM(AI126:AI127)>=6,1,0))","v":0},{"$error":"#N/A"},null,0,{"$f":"IF(AND(AN125=1,AM126=1),1,IF(SUM(AM126:AM127)>=7,1,0))","v":0},{"$error":"#N/A"},null,null,{"$error":"#N/A"},{"$error":"#N/A"}]
[null,"2020-02-01",{"$f":"IFERROR(IF(GETPIVOTDATA(\"Value\",Pivots_LA!$A$6,\"Month\",$B127,\"Delay reason\",$C$20)=0,\"\",GETPIVOTDATA(\"Value\",Pivots_LA!$A$6,\"Month\",$B127,\"Delay reason\",$C$20)),NA())","v":20286},20286,null,null,19275,21669.997500000001,16880.002499999999,null,null,null,null,{"$f":"B127","v":"2020-02-01"},{"$f":"IF(D126=\"\",\"\",IF(D127=\"\",\"\",ABS(D126-D127)))","v":686},{"$f":"IF(O127=\"\",P126,AVERAGE(IF($O$103:O$127<>\"\",$O$103:O$127)))","v":900.375},{"$f":"IF(ISERROR((P127*2.66)),Q128,(P127*2.66))","v":2394.9974999999999},{"$f":"$P127*3.27","v":2944.2262500000002},null,null,null,null,{"$f":"IF($D$101>5,NA(),IF(C127>H127,MAX(W$102:$W126)+1,0))","v":0},{"$f":"IF($D$101>5,NA(),IF(C127<I127,MAX(W$102:$W126)+1,0))","v":0},{"$error":"#N/A"},null,1,{"$f":"IFERROR(IF(AND(AB126=1,AA127=1),1,IF(SUM(AA127)>=7,1,0)),0)","v":0},{"$error":"#N/A"},null,0,{"$f":"IFERROR(IF(AND(AF126=1,AE127=1),1,IF(SUM(AE127)>=7,1,0)),0)","v":0},{"$error":"#N/A"},null,1,{"$f":"IF(AND(AJ126=1,AI127=1),1,IF(SUM(AI127)>=6,1,0))","v":0},{"$error":"#N/A"},null,0,{"$f":"IF(AND(AN126=1,AM127=1),1,IF(SUM(AM127)>=7,1,0))","v":0},{"$error":"#N/A"},null,null,{"$f":"IF(OR(W127>0,AB127>0,AJ127>0),C127,NA())","v":{"$error":"#N/A"}},{"$error":"#N/A"}]
[]
[null,{"$f":"C21","v":"A) Awaiting completion of assessment"},null,"Count IF data point is zero"]
[null,{"$f":"B34","v":0},{"$f":"ROW()","v":130},{"$f":"COUNTIF(D132:D156,0)","v":0},null,null,null,"Upper","Lower",null,null,null,null,null,"Difference",null,"Sigma",null,null,null,null,null,"> 3","< 3 ",null,null,"7 points above/below mean",null,null,null,null,null,null,null,"Trend up/down",null,null,null,null,null,null,null,null,"chart 4"]
[null,"ID (Week no.)","Plot data","Data",null,null,"Mean","Control limits ","control limit (-3)",null,null,null,null,"Date","For. Roll avg","Cumul. Moving Avg.","2.66* MR","3.27*MR",null,null,null,null,"Count","Count","Above/below 3 sigma",null,"7 points > mean","Count of 7 point ","7 points above mean",null,"7 points <mean","Count of 7point ","7 points below mean",null,"Trend up",null,null,null,"Trend Down",null,null,null,null,"Concern","Improvement"]
[null,{"$f":"$D$9","v":"2018-02-01"},{"$f":"IFERROR(IF(GETPIVOTDATA(\"Value\",Pivots_LA!$A$6,\"Month\",$B132,\"Delay reason\",$C$21)=0,\"\",GETPIVOTDATA(\"Value\",Pivots_LA!$A$6,\"Month\",$B132,\"Delay reason\",$C$21)),NA())","v":17748},{"$f":"IFERROR(IF(C132=\"\",0,C132),\"\")","v":17748},null,null,{"$f":"AVERAGE($D$132:$D$156)","v":16831},{"$f":"IF($D$130>5,NA(),IF(D132=\"\",H131,G132+Q132))","v":19959.935833333333},{"$f":"IF($D$130>5,NA(),IF(D132=\"\",I131,G132-Q132))","v":13702.064166666667},null,null,null,null,{"$f":"B132","v":"2018-02-01"},null,{"$f":"IF(O132=\"\",P131,AVERAGE(IF($O$132:O$156<>\"\",$O$132:O$156)))","v":"Cumul. Moving Avg."},{"$f":"Q133","v":3128.9358333333339},{"$f":"R133","v":3846.4737500000001},null,null,null,null,{"$f":"IF($D$130>5,NA(),IF(C132>H132,MAX(W131:$W$131)+1,0))","v":0},{"$f":"IF($D$130>5,NA(),IF(C132<I132,MAX(W131:$W$131)+1,0))","v":0},{"$f":"IF(OR(W132>0,X132>0),C132,NA())","v":{"$error":"#N/A"}},null,{"$f":"IF($D$130>5,NA(), IF(C132>G132,1,0))","v":1},{"$f":"IFERROR(IF(AND(AB131=1,AA132=1),1,IF(SUM(AA132:AA138)>=7,1,0)),0)","v":0},{"$f":"IF(AB132=0,NA(),C132)","v":{"$error":"#N/A"}},null,{"$f":"IF($D$130>5,NA(), IF(C132<G132,1,0))","v":0},{"$f":"IFERROR(IF(AND(AF131=1,AE132=1),1,IF(SUM(AE132:AE138)>=7,1,0)),0)","v":0},{"$f":"IF(AF132=0,NA(),C132)","v":{"$error":"#N/A"}},null,{"$f":"IF($D$130>5,NA(),IF(C132>C131,1,0))","v":0},{"$f":"IF(AND(AJ131=1,AI132=1),1,IF(SUM(AI132:AI138)>=7,1,0))","v":0},{"$f":"IF(AJ132=0,NA(),C132)","v":{"$error":"#N/A"}},null,{"$f":"IF($D$130>5,NA(),IF(C132<C131,1,0))","v":1},{"$f":"IF(AND(AN131=1,AM132=1),1,IF(SUM(AM132:AM138)>=7,1,0))","v":0},{"$f":"IF(AN132=0,NA(),C132)","v":{"$error":"#N/A"}},null,null,{"$f":"IF(OR(W132>0,AB132>0,AJ132>0),C132,NA())","v":{"$error":"#N/A"}},{"$f":"IF(OR(X132>0,AF132>0,AN132>0),C132,NA())","v":{"$error":"#N/A"}}]
[null,{"$f":"IF(DAY(B132+31)=1,B132+31,B132+31-DAY(B132+31)+1)","v":"2018-03-01"},{"$f":"IFERROR(IF(GETPIVOTDATA(\"Value\",Pivots_LA!$A$6,\"Month\",$B133,\"Delay reason\",$C$21)=0,\"\",GETPIVOTDATA(\"Value\",Pivots_LA!$A$6,\"Month\",$B133,\"Delay reason\",$C$21)),NA())","v":18643},{"$f":"IFERROR(IF(C133=\"\",0,C133),\"\")","v":18643},null,null,{"$f":"AVERAGE($D$132:$D$156)","v":16831},{"$f":"IF($D$130>5,NA(),IF(D133=\"\",H132,G133+Q133))","v":19959.935833333333},{"$f":"IF($D$130>5,NA(),IF(D133=\"\",I132,G133-Q133))","v":13702.064166666667},null,null,null,null,"2018-03-01",{"$f":"IF(D132=\"\",\"\",IF(D133=\"\",\"\",ABS(D132-D133)))","v":895},{"$f":"IF(O133=\"\",P132,AVERAGE(IF($O$132:O$156<>\"\",$O$132:O$156)))","v":1176.2916666666667},{"$f":"IF(ISERROR((P133*2.66)),Q134,(P133*2.66))","v":3128.9358333333339},{"$f":"$P133*3.27","v":3846.4737500000001},null,null,null,null,{"$f":"IF($D$130>5,NA(),IF(C133>H133,MAX(W$131:$W132)+1,0))","v":0},{"$f":"IF($D$130>5,NA(),IF(C133<I133,MAX(W$131:$W132)+1,0))","v":0},{"$f":"IF(OR(W133>0,X133>0),C133,NA())","v":{"$error":"#N/A"}},null,{"$f":"IF($D$130>5,NA(), IF(C133>G133,1,0))","v":1},{"$f":"IFERROR(IF(AND(AB132=1,AA133=1),1,IF(SUM(AA133:AA139)>=7,1,0)),0)","v":0},{"$f":"IF(AB133=0,NA(),C133)","v":{"$error":"#N/A"}},null,{"$f":"IF($D$130>5,NA(), IF(C133<G133,1,0))","v":0},{"$f":"IFERROR(IF(AND(AF132=1,AE133=1),1,IF(SUM(AE133:AE139)>=7,1,0)),0)","v":0},{"$f":"IF(AF133=0,NA(),C133)","v":{"$error":"#N/A"}},null,{"$f":"IF($D$130>5,NA(),IF(C133>C132,1,0))","v":1},{"$f":"IF(AND(AJ132=1,AI133=1),1,IF(SUM(AI133:AI139)>=7,1,0))","v":0},{"$f":"IF(AJ133=0,NA(),C133)","v":{"$error":"#N/A"}},null,{"$f":"IF($D$130>5,NA(),IF(C133<C132,1,0))","v":0},{"$f":"IF(AND(AN132=1,AM133=1),1,IF(SUM(AM133:AM139)>=7,1,0))","v":0},{"$f":"IF(AN133=0,NA(),C133)","v":{"$error":"#N/A"}},null,null,{"$f":"IF(OR(W133>0,AB133>0,AJ133>0),C133,NA())","v":{"$error":"#N/A"}},{"$f":"IF(OR(X133>0,AF133>0,AN133>0),C133,NA())","v":{"$error":"#N/A"}}]
[null,{"$f":"IF(DAY(B133+31)=1,B133+31,B133+31-DAY(B133+31)+1)","v":"2018-04-01"},{"$f":"IFERROR(IF(GETPIVOTDATA(\"Value\",Pivots_LA!$A$6,\"Month\",$B134,\"Delay reason\",$C$21)=0,\"\",GETPIVOTDATA(\"Value\",Pivots_LA!$A$6,\"Month\",$B134,\"Delay reason\",$C$21)),NA())","v":16858},16858,null,null,16831,19959.935833333333,13702.064166666667,null,null,null,null,"2018-04-01",{"$f":"IF(D133=\"\",\"\",IF(D134=\"\",\"\",ABS(D133-D134)))","v":1785},{"$f":"IF(O134=\"\",P133,AVERAGE(IF($O$132:O$156<>\"\",$O$132:O$156)))","v":1176.2916666666667},{"$f":"IF(ISERROR((P134*2.66)),Q135,(P134*2.66))","v":3128.9358333333339},{"$f":"$P134*3.27","v":3846.4737500000001},null,null,null,null,{"$f":"IF($D$130>5,NA(),IF(C134>H134,MAX(W$131:$W133)+1,0))","v":0},{"$f":"IF($D$130>5,NA(),IF(C134<I134,MAX(W$131:$W133)+1,0))","v":0},{"$error":"#N/A"},null,1,0,{"$error":"#N/A"},null,0,0,{"$error":"#N/A"},null,0,0,{"$error":"#N/A"},null,1,0,{"$error":"#N/A"},null,null,{"$error":"#N/A"},{"$error":"#N/A"}]
[null,"2018-05-01",{"$f":"IFERROR(IF(GETPIVOTDATA(\"Value\",Pivots_LA!$A$6,\"Month\",$B135,\"Delay reason\",$C$21)=0,\"\",GETPIVOTDATA(\"Value\",Pivots_LA!$A$6,\"Month\",$B135,\"Delay reason\",$C$21)),NA())","v":16111},16111,null,null,16831,19959.935833333333,13702.064166666667,null,null,null,null,"2018-05-01",747,{"$f":"IF(O135=\"\",P134,AVERAGE(IF($O$132:O$156<>\"\",$O$132:O$156)))","v":1176.2916666666667},{"$f":"IF(ISERROR((P135*2.66)),Q136,(P135*2.66))","v":3128.9358333333339},{"$f":"$P135*3.27","v":3846.4737500000001},null,null,null,null,{"$f":"IF($D$130>5,NA(),IF(C135>H135,MAX(W$131:$W134)+1,0))","v":0},{"$f":"IF($D$130>5,NA(),IF(C135<I135,MAX(W$131:$W134)+1,0))","v":0},{"$error":"#N/A"},null,0,0,{"$error":"#N/A"},null,{"$f":"IF($D$130>5,NA(), IF(C135<G135,1,0))","v":1},0,{"$error":"#N/A"},null,0,0,{"$error":"#N/A"},null,1,0,{"$error":"#N/A"},null,null,{"$error":"#N/A"},{"$error":"#N/A"}]
[null,"2018-06-01",{"$f":"IFERROR(IF(GETPIVOTDATA(\"Value\",Pivots_LA!$A$6,\"Month\",$B136,\"Delay reason\",$C$21)=0,\"\",GETPIVOTDATA(\"Value\",Pivots_LA!$A$6,\"Month\",$B136,\"Delay reason\",$C$21)),NA())","v":15083},15083,null,null,16831,19959.935833333333,13702.064166666667,null,null,null,null,"2018-06-01",1028,{"$f":"IF(O136=\"\",P135,AVERAGE(IF($O$132:O$156<>\"\",$O$132:O$156)))","v":1176.2916666666667},{"$f":"IF(ISERROR((P136*2.66)),Q137,(P136*2.66))","v":3128.9358333333339},3846.4737500000001,null,null,null,null,{"$f":"IF($D$130>5,NA(),IF(C136>H136,MAX(W$131:$W135)+1,0))","v":0},{"$f":"IF($D$130>5,NA(),IF(C136<I136,MAX(W$131:$W135)+1,0))","v":0},{"$error":"#N/A"},null,0,0,{"$error":"#N/A"},null,1,0,{"$error":"#N/A"},null,0,0,{"$error":"#N/A"},null,1,0,{"$error":"#N/A"},null,null,{"$error":"#N/A"},{"$error":"#N/A"}]
[null,"2018-07-01",{"$f":"IFERROR(IF(GETPIVOTDATA(\"Value\",Pivots_LA!$A$6,\"Month\",$B137,\"Delay reason\",$C$21)=0,\"\",GETPIVOTDATA(\"Value\",Pivots_LA!$A$6,\"Month\",$B137,\"Delay reason\",$C$21)),NA())","v":15807},15807,null,null,16831,19959.935833333333,13702.064166666667,null,null,null,null,"2018-07-01",724,{"$f":"IF(O137=\"\",P136,AVERAGE(IF($O$132:O$156<>\"\",$O$132:O$156)))","v":1176.2916666666667},3128.9358333333339,3846.4737500000001,null,null,null,null,{"$f":"IF($D$130>5,NA(),IF(C137>H137,MAX(W$131:$W136)+1,0))","v":0},{"$f":"IF($D$130>5,NA(),IF(C137<I137,MAX(W$131:$W136)+1,0))","v":0},{"$error":"#N/A"},null,0,0,{"$error":"#N/A"},null,1,0,{"$error":"#N/A"},null,1,0,{"$error":"#N/A"},null,0,0,{"$error":"#N/A"},null,null,{"$error":"#N/A"},{"$error":"#N/A"}]
[null,"2018-08-01",{"$f":"IFERROR(IF(GETPIVOTDATA(\"Value\",Pivots_LA!$A$6,\"Month\",$B138,\"Delay reason\",$C$21)=0,\"\",GETPIVOTDATA(\"Value\",Pivots_LA!$A$6,\"Month\",$B138,\"Delay reason\",$C$21)),NA())","v":16740},16740,null,null,16831,19959.935833333333,13702.064166666667,null,null,null,null,"2018-08-01",933,{"$f":"IF(O138=\"\",P137,AVERAGE(IF($O$132:O$156<>\"\",$O$132:O$156)))","v":1176.2916666666667},3128.9358333333339,3846.4737500000001,null,null,null,null,{"$f":"IF($D$130>5,NA(),IF(C138>H138,MAX(W$131:$W137)+1,0))","v":0},{"$f":"IF($D$130>5,NA(),IF(C138<I138,MAX(W$131:$W137)+1,0))","v":0},{"$f":"IF(OR(W138>0,X138>0),C138,NA())","v":{"$error":"#N/A"}},null,0,0,{"$error":"#N/A"},null,1,0,{"$error":"#N/A"},null,1,0,{"$error":"#N/A"},null,0,0,{"$error":"#N/A"},null,null,{"$error":"#N/A"},{"$error":"#N/A"}]
[null,"2018-09-01",{"$f":"IFERROR(IF(GETPIVOTDATA(\"Value\",Pivots_LA!$A$6,\"Month\",$B139,\"Delay reason\",$C$21)=0,\"\",GETPIVOTDATA(\"Value\",Pivots_LA!$A$6,\"Month\",$B139,\"Delay reason\",$C$21)),NA())","v":17079},17079,null,null,16831,19959.935833333333,13702.064166666667,null,null,null,null,"2018-09-01",339,{"$f":"IF(O139=\"\",P138,AVERAGE(IF($O$132:O$156<>\"\",$O$132:O$156)))","v":1176.2916666666667},3128.9358333333339,{"$f":"$P139*3.27","v":3846.4737500000001},null,null,null,null,{"$f":"IF($D$130>5,NA(),IF(C139>H139,MAX(W$131:$W138)+1,0))","v":0},{"$f":"IF($D$130>5,NA(),IF(C139<I139,MAX(W$131:$W138)+1,0))","v":0},{"$error":"#N/A"},null,1,0,{"$error":"#N/A"},null,0,0,{"$error":"#N/A"},null,1,0,{"$error":"#N/A"},null,0,0,{"$error":"#N/A"},null,null,{"$error":"#N/A"},{"$error":"#N/A"}]
[null,"2018-10-01",{"$f":"IFERROR(IF(GETPIVOTDATA(\"Value\",Pivots_LA!$A$6,\"Month\",$B140,\"Delay reason\",$C$21)=0,\"\",GETPIVOTDATA(\"Value\",Pivots_LA!$A$6,\"Month\",$B140,\"Delay reason\",$C$21)),NA())","v":16538},16538,null,null,16831,19959.935833333333,13702.064166666667,null,null,null,null,"2018-10-01",541,{"$f":"IF(O140=\"\",P139,AVERAGE(IF($O$132:O$156<>\"\",$O$132:O$156)))","v":1176.2916666666667},3128.9358333333339,3846.4737500000001,null,null,null,null,{"$f":"IF($D$130>5,NA(),IF(C140>H140,MAX(W$131:$W139)+1,0))","v":0},{"$f":"IF($D$130>5,NA(),IF(C140<I140,MAX(W$131:$W139)+1,0))","v":0},{"$error":"#N/A"},null,0,0,{"$error":"#N/A"},null,1,1,16538,null,0,0,{"$error":"#N/A"},null,1,0,{"$error":"#N/A"},null,null,{"$error":"#N/A"},16538]
[null,"2018-11-01",{"$f":"IFERROR(IF(GETPIVOTDATA(\"Value\",Pivots_LA!$A$6,\"Month\",$B141,\"Delay reason\",$C$21)=0,\"\",GETPIVOTDATA(\"Value\",Pivots_LA!$A$6,\"Month\",$B141,\"Delay reason\",$C$21)),NA())","v":13739},13739,null,null,16831,19959.935833333333,13702.064166666667,null,null,null,null,"2018-11-01",2799,{"$f":"IF(O141=\"\",P140,AVERAGE(IF($O$132:O$156<>\"\",$O$132:O$156)))","v":1176.2916666666667},3128.9358333333339,3846.4737500000001,null,null,null,null,{"$f":"IF($D$130>5,NA(),IF(C141>H141,MAX(W$131:$W140)+1,0))","v":0},{"$f":"IF($D$130>5,NA(),IF(C141<I141,MAX(W$131:$W140)+1,0))","v":0},{"$error":"#N/A"},null,0,0,{"$error":"#N/A"},null,1,1,13739,null,0,0,{"$error":"#N/A"},null,1,0,{"$error":"#N/A"},null,null,{"$error":"#N/A"},13739]
[null,"2018-12-01",{"$f":"IFERROR(IF(GETPIVOTDATA(\"Value\",Pivots_LA!$A$6,\"Month\",$B142,\"Delay reason\",$C$21)=0,\"\",GETPIVOTDATA(\"Value\",Pivots_LA!$A$6,\"Month\",$B142,\"Delay reason\",$C$21)),NA())","v":13983},13983,null,null,16831,19959.935833333333,13702.064166666667,null,null,null,null,"2018-12-01",244,{"$f":"IF(O142=\"\",P141,AVERAGE(IF($O$132:O$156<>\"\",$O$132:O$156)))","v":1176.2916666666667},3128.9358333333339,3846.4737500000001,null,null,null,null,{"$f":"IF($D$130>5,NA(),IF(C142>H142,MAX(W$131:$W141)+1,0))","v":0},{"$f":"IF($D$130>5,NA(),IF(C142<I142,MAX(W$131:$W141)+1,0))","v":0},{"$error":"#N/A"},null,0,0,{"$error":"#N/A"},null,1,1,13983,null,1,0,{"$error":"#N/A"},null,0,0,{"$error":"#N/A"},null,null,{"$error":"#N/A"},13983]
[null,"2019-01-01",{"$f":"IFERROR(IF(GETPIVOTDATA(\"Value\",Pivots_LA!$A$6,\"Month\",$B143,\"Delay reason\",$C$21)=0,\"\",GETPIVOTDATA(\"Value\",Pivots_LA!$A$6,\"Month\",$B143,\"Delay reason\",$C$21)),NA())","v":15811},15811,null,null,16831,19959.935833333333,13702.064166666667,null,null,null,null,"2019-01-01",1828,{"$f":"IF(O143=\"\",P142,AVERAGE(IF($O$132:O$156<>\"\",$O$132:O$156)))","v":1176.2916666666667},3128.9358333333339,3846.4737500000001,null,null,null,null,{"$f":"IF($D$130>5,NA(),IF(C143>H143,MAX(W$131:$W142)+1,0))","v":0},{"$f":"IF($D$130>5,NA(),IF(C143<I143,MAX(W$131:$W142)+1,0))","v":0},{"$error":"#N/A"},null,0,0,{"$error":"#N/A"},null,1,1,15811,null,1,0,{"$error":"#N/A"},null,0,0,{"$error":"#N/A"},null,null,{"$error":"#N/A"},15811]
[null,"2019-02-01",{"$f":"IFERROR(IF(GETPIVOTDATA(\"Value\",Pivots_LA!$A$6,\"Month\",$B144,\"Delay reason\",$C$21)=0,\"\",GETPIVOTDATA(\"Value\",Pivots_LA!$A$6,\"Month\",$B144,\"Delay reason\",$C$21)),NA())","v":14266},14266,null,null,16831,19959.935833333333,13702.064166666667,null,null,null,null,"2019-02-01",1545,{"$f":"IF(O144=\"\",P143,AVERAGE(IF($O$132:O$156<>\"\",$O$132:O$156)))","v":1176.2916666666667},3128.9358333333339,3846.4737500000001,null,null,null,null,{"$f":"IF($D$130>5,NA(),IF(C144>H144,MAX(W$131:$W143)+1,0))","v":0},{"$f":"IF($D$130>5,NA(),IF(C144<I144,MAX(W$131:$W143)+1,0))","v":0},{"$error":"#N/A"},null,0,0,{"$error":"#N/A"},null,1,1,14266,null,0,0,{"$error":"#N/A"},null,1,0,{"$error":"#N/A"},null,null,{"$error":"#N/A"},14266]
[null,"2019-03-01",{"$f":"IFERROR(IF(GETPIVOTDATA(\"Value\",Pivots_LA!$A$6,\"Month\",$B145,\"Delay reason\",$C$21)=0,\"\",GETPIVOTDATA(\"Value\",Pivots_LA!$A$6,\"Month\",$B145,\"Delay reason\",$C$21)),NA())","v":15422},15422,null,null,16831,19959.935833333333,13702.064166666667,null,null,null,null,"2019-03-01",1156,{"$f":"IF(O145=\"\",P144,AVERAGE(IF($O$132:O$156<>\"\",$O$132:O$156)))","v":1176.2916666666667},3128.9358333333339,3846.4737500000001,null,null,null,null,{"$f":"IF($D$130>5,NA(),IF(C145>H145,MAX(W$131:$W144)+1,0))","v":0},{"$f":"IF($D$130>5,NA(),IF(C145<I145,MAX(W$131:$W144)+1,0))","v":0},{"$error":"#N/A"},null,0,0,{"$error":"#N/A"},null,1,1,15422,null,1,0,{"$error":"#N/A"},null,0,0,{"$error":"#N/A"},null,null,{"$error":"#N/A"},{"$f":"IF(OR(X145>0,AF145>0,AN145>0),C145,NA())","v":15422}]
[null,"2019-04-01",{"$f":"IFERROR(IF(GETPIVOTDATA(\"Value\",Pivots_LA!$A$6,\"Month\",$B146,\"Delay reason\",$C$21)=0,\"\",GETPIVOTDATA(\"Value\",Pivots_LA!$A$6,\"Month\",$B146,\"Delay reason\",$C$21)),NA())","v":15076},15076,null,null,16831,19959.935833333333,13702.064166666667,null,null,null,null,"2019-04-01",346,{"$f":"IF(O146=\"\",P145,AVERAGE(IF($O$132:O$156<>\"\",$O$132:O$156)))","v":1176.2916666666667},3128.9358333333339,3846.4737500000001,null,null,null,null,{"$f":"IF($D$130>5,NA(),IF(C146>H146,MAX(W$131:$W145)+1,0))","v":0},{"$f":"IF($D$130>5,NA(),IF(C146<I146,MAX(W$131:$W145)+1,0))","v":0},{"$error":"#N/A"},null,0,0,{"$error":"#N/A"},null,1,1,15076,null,0,0,{"$error":"#N/A"},null,1,0,{"$error":"#N/A"},null,null,{"$error":"#N/A"},15076]
[null,"2019-05-01",{"$f":"IFERROR(IF(GETPIVOTDATA(\"Value\",Pivots_LA!$A$6,\"Month\",$B147,\"Delay reason\",$C$21)=0,\"\",GETPIVOTDATA(\"Value\",Pivots_LA!$A$6,\"Month\",$B147,\"Delay reason\",$C$21)),NA())","v":17379},17379,null,null,16831,19959.935833333333,13702.064166666667,null,null,null,null,"2019-05-01",2303,{"$f":"IF(O147=\"\",P146,AVERAGE(IF($O$132:O$156<>\"\",$O$132:O$156)))","v":1176.2916666666667},3128.9358333333339,3846.4737500000001,null,null,null,null,{"$f":"IF($D$130>5,NA(),IF(C147>H147,MAX(W$131:$W146)+1,0))","v":0},{"$f":"IF($D$130>5,NA(),IF(C147<I147,MAX(W$131:$W146)+1,0))","v":0},{"$error":"#N/A"},null,1,0,{"$error":"#N/A"},null,0,0,{"$error":"#N/A"},null,1,0,{"$error":"#N/A"},null,0,0,{"$error":"#N/A"},null,null,{"$error":"#N/A"},{"$error":"#N/A"}]
[null,"2019-06-01",{"$f":"IFERROR(IF(GETPIVOTDATA(\"Value\",Pivots_LA!$A$6,\"Month\",$B148,\"Delay reason\",$C$21)=0,\"\",GETPIVOTDATA(\"Value\",Pivots_LA!$A$6,\"Month\",$B148,\"Delay reason\",$C$21)),NA())","v":15461},15461,null,null,16831,19959.935833333333,13702.064166666667,null,null,null,null,"2019-06-01",1918,{"$f":"IF(O148=\"\",P147,AVERAGE(IF($O$132:O$156<>\"\",$O$132:O$156)))","v":1176.2916666666667},3128.9358333333339,3846.4737500000001,null,null,null,null,{"$f":"IF($D$130>5,NA(),IF(C148>H148,MAX(W$131:$W147)+1,0))","v":0},{"$f":"IF($D$130>5,NA(),IF(C148<I148,MAX(W$131:$W147)+1,0))","v":0},{"$error":"#N/A"},null,0,0,{"$error":"#N/A"},null,1,0,{"$error":"#N/A"},null,0,0,{"$error":"#N/A"},null,1,0,{"$error":"#N/A"},null,null,{"$error":"#N/A"},{"$error":"#N/A"}]
[null,"2019-07-01",{"$f":"IFERROR(IF(GETPIVOTDATA(\"Value\",Pivots_LA!$A$6,\"Month\",$B149,\"Delay reason\",$C$21)=0,\"\",GETPIVOTDATA(\"Value\",Pivots_LA!$A$6,\"Month\",$B149,\"Delay reason\",$C$21)),NA())","v":16350},16350,null,null,16831,19959.935833333333,13702.064166666667,null,null,null,null,"2019-07-01",889,{"$f":"IF(O149=\"\",P148,AVERAGE(IF($O$132:O$156<>\"\",$O$132:O$156)))","v":1176.2916666666667},3128.9358333333339,3846.4737500000001,null,null,null,null,{"$f":"IF($D$130>5,NA(),IF(C149>H149,MAX(W$131:$W148)+1,0))","v":0},{"$f":"IF($D$130>5,NA(),IF(C149<I149,MAX(W$131:$W148)+1,0))","v":0},{"$error":"#N/A"},null,0,0,{"$error":"#N/A"},null,1,{"$f":"IFERROR(IF(AND(AF148=1,AE149=1),1,IF(SUM(AE149:AE155)>=7,1,0)),0)","v":0},{"$error":"#N/A"},null,1,0,{"$error":"#N/A"},null,0,0,{"$error":"#N/A"},null,null,{"$error":"#N/A"},{"$error":"#N/A"}]
[null,"2019-08-01",{"$f":"IFERROR(IF(GETPIVOTDATA(\"Value\",Pivots_LA!$A$6,\"Month\",$B150,\"Delay reason\",$C$21)=0,\"\",GETPIVOTDATA(\"Value\",Pivots_LA!$A$6,\"Month\",$B150,\"Delay reason\",$C$21)),NA())","v":17697},17697,null,null,16831,19959.935833333333,13702.064166666667,null,null,null,null,"2019-08-01",1347,{"$f":"IF(O150=\"\",P149,AVERAGE(IF($O$132:O$156<>\"\",$O$132:O$156)))","v":1176.2916666666667},3128.9358333333339,3846.4737500000001,null,null,null,null,{"$f":"IF($D$130>5,NA(),IF(C150>H150,MAX(W$131:$W149)+1,0))","v":0},{"$f":"IF($D$130>5,NA(),IF(C150<I150,MAX(W$131:$W149)+1,0))","v":0},{"$error":"#N/A"},null,1,1,17697,null,0,{"$f":"IFERROR(IF(AND(AF149=1,AE150=1),1,IF(SUM(AE150:AE156)>=7,1,0)),0)","v":0},{"$error":"#N/A"},null,1,0,{"$error":"#N/A"},null,0,0,{"$error":"#N/A"},null,null,17697,{"$error":"#N/A"}]
[null,"2019-09-01",{"$f":"IFERROR(IF(GETPIVOTDATA(\"Value\",Pivots_LA!$A$6,\"Month\",$B151,\"Delay reason\",$C$21)=0,\"\",GETPIVOTDATA(\"Value\",Pivots_LA!$A$6,\"Month\",$B151,\"Delay reason\",$C$21)),NA())","v":19480},19480,null,null,16831,19959.935833333333,13702.064166666667,null,null,null,null,"2019-09-01",1783,{"$f":"IF(O151=\"\",P150,AVERAGE(IF($O$132:O$156<>\"\",$O$132:O$156)))","v":1176.2916666666667},3128.9358333333339,3846.4737500000001,null,null,null,null,{"$f":"IF($D$130>5,NA(),IF(C151>H151,MAX(W$131:$W150)+1,0))","v":0},{"$f":"IF($D$130>5,NA(),IF(C151<I151,MAX(W$131:$W150)+1,0))","v":0},{"$error":"#N/A"},null,1,{"$f":"IFERROR(IF(AND(AB150=1,AA151=1),1,IF(SUM(AA151:AA156)>=7,1,0)),0)","v":1},19480,null,0,{"$f":"IFERROR(IF(AND(AF150=1,AE151=1),1,IF(SUM(AE151:AE156)>=7,1,0)),0)","v":0},{"$error":"#N/A"},null,1,{"$f":"IF(AND(AJ150=1,AI151=1),1,IF(SUM(AI151:AI156)>=7,1,0))","v":0},{"$error":"#N/A"},null,0,0,{"$error":"#N/A"},null,null,19480,{"$error":"#N/A"}]
[null,"2019-10-01",{"$f":"IFERROR(IF(GETPIVOTDATA(\"Value\",Pivots_LA!$A$6,\"Month\",$B152,\"Delay reason\",$C$21)=0,\"\",GETPIVOTDATA(\"Value\",Pivots_LA!$A$6,\"Month\",$B152,\"Delay reason\",$C$21)),NA())","v":18437},18437,null,null,16831,19959.935833333333,13702.064166666667,null,null,null,null,"2019-10-01",1043,{"$f":"IF(O152=\"\",P151,AVERAGE(IF($O$132:O$156<>\"\",$O$132:O$156)))","v":1176.2916666666667},3128.9358333333339,3846.4737500000001,null,null,null,null,{"$f":"IF($D$130>5,NA(),IF(C152>H152,MAX(W$131:$W151)+1,0))","v":0},{"$f":"IF($D$130>5,NA(),IF(C152<I152,MAX(W$131:$W151)+1,0))","v":0},{"$error":"#N/A"},null,1,{"$f":"IFERROR(IF(AND(AB151=1,AA152=1),1,IF(SUM(AA152:AA156)>=7,1,0)),0)","v":1},18437,null,0,{"$f":"IFERROR(IF(AND(AF151=1,AE152=1),1,IF(SUM(AE152:AE156)>=7,1,0)),0)","v":0},{"$error":"#N/A"},null,0,{"$f":"IF(AND(AJ151=1,AI152=1),1,IF(SUM(AI152:AI156)>=7,1,0))","v":0},{"$error":"#N/A"},null,1,{"$f":"IF(AND(AN151=1,AM152=1),1,IF(SUM(AM152:AM156)>=7,1,0))","v":0},{"$error":"#N/A"},null,null,18437,{"$error":"#N/A"}]
[null,"2019-11-01",{"$f":"IFERROR(IF(GETPIVOTDATA(\"Value\",Pivots_LA!$A$6,\"Month\",$B153,\"Delay reason\",$C$21)=0,\"\",GETPIVOTDATA(\"Value\",Pivots_LA!$A$6,\"Month\",$B153,\"Delay reason\",$C$21)),NA())","v":17952},17952,null,null,16831,19959.935833333333,13702.064166666667,null,null,null,null,"2019-11-01",485,{"$f":"IF(O153=\"\",P152,AVERAGE(IF($O$132:O$156<>\"\",$O$132:O$156)))","v":1176.2916666666667},3128.9358333333339,3846.4737500000001,null,null,null,null,{"$f":"IF($D$130>5,NA(),IF(C153>H153,MAX(W$131:$W152)+1,0))","v":0},{"$f":"IF($D$130>5,NA(),IF(C153<I153,MAX(W$131:$W152)+1,0))","v":0},{"$error":"#N/A"},null,1,{"$f":"IFERROR(IF(AND(AB152=1,AA153=1),1,IF(SUM(AA153:AA159)>=7,1,0)),0)","v":1},17952,null,0,{"$f":"IFERROR(IF(AND(AF152=1,AE153=1),1,IF(SUM(AE153:AE156)>=7,1,0)),0)","v":0},{"$error":"#N/A"},null,0,{"$f":"IF(AND(AJ152=1,AI153=1),1,IF(SUM(AI153:AI156)>=7,1,0))","v":0},{"$error":"#N/A"},null,1,{"$f":"IF(AND(AN152=1,AM153=1),1,IF(SUM(AM153:AM156)>=7,1,0))","v":0},{"$error":"#N/A"},null,null,17952,{"$error":"#N/A"}]
[null,"2019-12-01",{"$f":"IFERROR(IF(GETPIVOTDATA(\"Value\",Pivots_LA!$A$6,\"Month\",$B154,\"Delay reason\",$C$21)=0,\"\",GETPIVOTDATA(\"Value\",Pivots_LA!$A$6,\"Month\",$B154,\"Delay reason\",$C$21)),NA())","v":18232},18232,null,null,16831,19959.935833333333,13702.064166666667,null,null,null,null,"2019-12-01",280,{"$f":"IF(O154=\"\",P153,AVERAGE(IF($O$132:O$156<>\"\",$O$132:O$156)))","v":1176.2916666666667},3128.9358333333339,3846.4737500000001,null,null,null,null,{"$f":"IF($D$130>5,NA(),IF(C154>H154,MAX(W$131:$W153)+1,0))","v":0},{"$f":"IF($D$130>5,NA(),IF(C154<I154,MAX(W$131:$W153)+1,0))","v":0},{"$error":"#N/A"},null,1,{"$f":"IFERROR(IF(AND(AB153=1,AA154=1),1,IF(SUM(AA154:AA156)>=7,1,0)),0)","v":1},18232,null,0,{"$f":"IFERROR(IF(AND(AF153=1,AE154=1),1,IF(SUM(AE154:AE156)>=7,1,0)),0)","v":0},{"$error":"#N/A"},null,1,{"$f":"IF(AND(AJ153=1,AI154=1),1,IF(SUM(AI154:AI156)>=7,1,0))","v":0},{"$error":"#N/A"},null,0,{"$f":"IF(AND(AN153=1,AM154=1),1,IF(SUM(AM154:AM156)>=7,1,0))","v":0},{"$error":"#N/A"},null,null,18232,{"$error":"#N/A"}]
[null,"2020-01-01",{"$f":"IFERROR(IF(GETPIVOTDATA(\"Value\",Pivots_LA!$A$6,\"Month\",$B155,\"Delay reason\",$C$21)=0,\"\",GETPIVOTDATA(\"Value\",Pivots_LA!$A$6,\"Month\",$B155,\"Delay reason\",$C$21)),NA())","v":20796},20796,null,null,16831,19959.935833333333,13702.064166666667,null,null,null,null,{"$f":"B155","v":"2020-01-01"},2564,{"$f":"IF(O155=\"\",P154,AVERAGE(IF($O$132:O$156<>\"\",$O$132:O$156)))","v":1176.2916666666667},3128.9358333333339,3846.4737500000001,null,null,null,null,{"$f":"IF($D$130>5,NA(),IF(C155>H155,MAX(W$131:$W154)+1,0))","v":1},{"$f":"IF($D$130>5,NA(),IF(C155<I155,MAX(W$131:$W154)+1,0))","v":0},20796,null,1,{"$f":"IFERROR(IF(AND(AB154=1,AA155=1),1,IF(SUM(AA155:AA156)>=7,1,0)),0)","v":1},20796,null,0,{"$f":"IFERROR(IF(AND(AF154=1,AE155=1),1,IF(SUM(AE155:AE156)>=7,1,0)),0)","v":0},{"$error":"#N/A"},null,1,{"$f":"IF(AND(AJ154=1,AI155=1),1,IF(SUM(AI155:AI156)>=7,1,0))","v":0},{"$error":"#N/A"},null,0,{"$f":"IF(AND(AN154=1,AM155=1),1,IF(SUM(AM155:AM156)>=7,1,0))","v":0},{"$error":"#N/A"},null,null,20796,{"$error":"#N/A"}]
[null,"2020-02-01",{"$f":"IFERROR(IF(GETPIVOTDATA(\"Value\",Pivots_LA!$A$6,\"Month\",$B156,\"Delay reason\",$C$21)=0,\"\",GETPIVOTDATA(\"Value\",Pivots_LA!$A$6,\"Month\",$B156,\"Delay reason\",$C$21)),NA())","v":20087},20087,null,null,16831,19959.935833333333,13702.064166666667,null,null,null,null,{"$f":"B156","v":"2020-02-01"},{"$f":"IF(D155=\"\",\"\",IF(D156=\"\",\"\",ABS(D155-D156)))","v":709},{"$f":"IF(O156=\"\",P155,AVERAGE(IF($O$132:O$156<>\"\",$O$132:O$156)))","v":1176.2916666666667},{"$f":"IF(ISERROR((P156*2.66)),Q157,(P156*2.66))","v":3128.9358333333339},{"$f":"$P156*3.27","v":3846.4737500000001},null,null,null,null,{"$f":"IF($D$130>5,NA(),IF(C156>H156,MAX(W$131:$W155)+1,0))","v":2},{"$f":"IF($D$130>5,NA(),IF(C156<I156,MAX(W$131:$W155)+1,0))","v":0},20087,null,1,{"$f":"IFERROR(IF(AND(AB155=1,AA156=1),1,IF(SUM(AA156)>=7,1,0)),0)","v":1},20087,null,0,{"$f":"IFERROR(IF(AND(AF155=1,AE156=1),1,IF(SUM(AE156)>=7,1,0)),0)","v":0},{"$error":"#N/A"},null,0,{"$f":"IF(AND(AJ155=1,AI156=1),1,IF(SUM(AI156)>=7,1,0))","v":0},{"$error":"#N/A"},null,1,{"$f":"IF(AND(AN155=1,AM156=1),1,IF(SUM(AM156)>=7,1,0))","v":0},{"$error":"#N/A"},null,null,{"$f":"IF(OR(W156>0,AB156>0,AJ156>0),C156,NA())","v":20087},{"$error":"#N/A"}]
[]
[null,{"$f":"C22","v":"A) Awaiting completion of assessment"},null,"Count IF data point is zero"]
[null,{"$f":"B35","v":0},{"$f":"ROW()","v":159},{"$f":"COUNTIF(D161:D185,0)","v":0},null,null,null,"Upper","Lower",null,null,null,null,null,"Difference",null,"Sigma",null,null,null,null,null,"> 3","< 3 ",null,null,"7 points above/below mean",null,null,null,null,null,null,null,"Trend up/down",null,null,null,null,null,null,null,null,"chart 5"]
[null,"ID (Week no.)","Plot data","Data",null,null,"Mean","Control limits ","control limit (-3)",null,null,null,null,"Date","For. Roll avg","Cumul. Moving Avg.","2.66* MR","3.27*MR",null,null,null,null,"Count","Count","Above/below 3 sigma",null,"7 points > mean","Count of 7 point ","7 points above mean",null,"7 points <mean","Count of 7point ","7 points below mean",null,"Trend up",null,null,null,"Trend Down",null,null,null,null,"Concern","Improvement"]
[null,{"$f":"$D$9","v":"2018-02-01"},{"$f":"IFERROR(IF(GETPIVOTDATA(\"Value\",Pivots_LA!$A$6,\"Month\",$B161,\"Delay reason\",$C$22)=0,\"\",GETPIVOTDATA(\"Value\",Pivots_LA!$A$6,\"Month\",$B161,\"Delay reason\",$C$22)),NA())","v":17748},{"$f":"IFERROR(IF(C161=\"\",0,C161),\"\")","v":17748},null,null,{"$f":"AVERAGE($D$161:$D$185)","v":16831},{"$f":"IF($D$159>5,NA(),IF(D161=\"\",H160,G161+Q161))","v":19959.935833333333},{"$f":"IF($D$159>5,NA(),IF(D161=\"\",I160,G161-Q161))","v":13702.064166666667},null,null,null,null,{"$f":"B161","v":"2018-02-01"},null,{"$f":"IF(O161=\"\",P160,AVERAGE(IF($O$161:O$185<>\"\",$O$161:O$185)))","v":"Cumul. Moving Avg."},{"$f":"Q162","v":3128.9358333333339},{"$f":"R162","v":3846.4737500000001},null,null,null,null,{"$f":"IF($D$159>5,NA(),IF(C161>H161,MAX(W160:$W$160)+1,0))","v":0},{"$f":"IF($D$159>5,NA(),IF(C161<I161,MAX(W160:$W$160)+1,0))","v":0},{"$f":"IF(OR(W161>0,X161>0),C161,NA())","v":{"$error":"#N/A"}},null,{"$f":"IF($D$159>5,NA(), IF(C161>G161,1,0))","v":1},{"$f":"IFERROR(IF(AND(AB160=1,AA161=1),1,IF(SUM(AA161:AA167)>=7,1,0)),0)","v":0},{"$f":"IF(AB161=0,NA(),C161)","v":{"$error":"#N/A"}},null,{"$f":"IF($D$159>5,NA(), IF(C161<G161,1,0))","v":0},{"$f":"IFERROR(IF(AND(AF160=1,AE161=1),1,IF(SUM(AE161:AE167)>=7,1,0)),0)","v":0},{"$f":"IF(AF161=0,NA(),C161)","v":{"$error":"#N/A"}},null,{"$f":"IF($D$159>5,NA(),IF(C161>C160,1,0))","v":0},{"$f":"IF(AND(AJ160=1,AI161=1),1,IF(SUM(AI161:AI167)>=7,1,0))","v":0},{"$f":"IF(AJ161=0,NA(),C161)","v":{"$error":"#N/A"}},null,{"$f":"IF($D$159>5,NA(),IF(C161<C160,1,0))","v":1},{"$f":"IF(AND(AN160=1,AM161=1),1,IF(SUM(AM161:AM167)>=7,1,0))","v":0},{"$f":"IF(AN161=0,NA(),C161)","v":{"$error":"#N/A"}},null,null,{"$f":"IF(OR(W161>0,AB161>0,AJ161>0),C161,NA())","v":{"$error":"#N/A"}},{"$f":"IF(OR(X161>0,AF161>0,AN161>0),C161,NA())","v":{"$error":"#N/A"}}]
[null,{"$f":"IF(DAY(B161+31)=1,B161+31,B161+31-DAY(B161+31)+1)","v":"2018-03-01"},{"$f":"IFERROR(IF(GETPIVOTDATA(\"Value\",Pivots_LA!$A$6,\"Month\",$B162,\"Delay reason\",$C$22)=0,\"\",GETPIVOTDATA(\"Value\",Pivots_LA!$A$6,\"Month\",$B162,\"Delay reason\",$C$22)),NA())","v":18643},{"$f":"IFERROR(IF(C162=\"\",0,C162),\"\")","v":18643},null,null,{"$f":"AVERAGE($D$161:$D$185)","v":16831},{"$f":"IF($D$159>5,NA(),IF(D162=\"\",H161,G162+Q162))","v":19959.935833333333},{"$f":"IF($D$159>5,NA(),IF(D162=\"\",I161,G162-Q162))","v":13702.064166666667},null,null,null,null,"2018-03-01",{"$f":"IF(D161=\"\",\"\",IF(D162=\"\",\"\",ABS(D161-D162)))","v":895},{"$f":"IF(O162=\"\",P161,AVERAGE(IF($O$161:O$185<>\"\",$O$161:O$185)))","v":1176.2916666666667},{"$f":"IF(ISERROR((P162*2.66)),Q163,(P162*2.66))","v":3128.9358333333339},{"$f":"$P162*3.27","v":3846.4737500000001},null,null,null,null,{"$f":"IF($D$159>5,NA(),IF(C162>H162,MAX(W$160:$W161)+1,0))","v":0},{"$f":"IF($D$159>5,NA(),IF(C162<I162,MAX(W$160:$W161)+1,0))","v":0},{"$f":"IF(OR(W162>0,X162>0),C162,NA())","v":{"$error":"#N/A"}},null,{"$f":"IF($D$159>5,NA(), IF(C162>G162,1,0))","v":1},{"$f":"IFERROR(IF(AND(AB161=1,AA162=1),1,IF(SUM(AA162:AA168)>=7,1,0)),0)","v":0},{"$f":"IF(AB162=0,NA(),C162)","v":{"$error":"#N/A"}},null,{"$f":"IF($D$159>5,NA(), IF(C162<G162,1,0))","v":0},{"$f":"IFERROR(IF(AND(AF161=1,AE162=1),1,IF(SUM(AE162:AE168)>=7,1,0)),0)","v":0},{"$f":"IF(AF162=0,NA(),C162)","v":{"$error":"#N/A"}},null,{"$f":"IF($D$159>5,NA(),IF(C162>C161,1,0))","v":1},{"$f":"IF(AND(AJ161=1,AI162=1),1,IF(SUM(AI162:AI168)>=7,1,0))","v":0},{"$f":"IF(AJ162=0,NA(),C162)","v":{"$error":"#N/A"}},null,{"$f":"IF($D$159>5,NA(),IF(C162<C161,1,0))","v":0},{"$f":"IF(AND(AN161=1,AM162=1),1,IF(SUM(AM162:AM168)>=7,1,0))","v":0},{"$f":"IF(AN162=0,NA(),C162)","v":{"$error":"#N/A"}},null,null,{"$f":"IF(OR(W162>0,AB162>0,AJ162>0),C162,NA())","v":{"$error":"#N/A"}},{"$f":"IF(OR(X162>0,AF162>0,AN162>0),C162,NA())","v":{"$error":"#N/A"}}]
[null,{"$f":"IF(DAY(B162+31)=1,B162+31,B162+31-DAY(B162+31)+1)","v":"2018-04-01"},{"$f":"IFERROR(IF(GETPIVOTDATA(\"Value\",Pivots_LA!$A$6,\"Month\",$B163,\"Delay reason\",$C$22)=0,\"\",GETPIVOTDATA(\"Value\",Pivots_LA!$A$6,\"Month\",$B163,\"Delay reason\",$C$22)),NA())","v":16858},16858,null,null,16831,19959.935833333333,13702.064166666667,null,null,null,null,"2018-04-01",{"$f":"IF(D162=\"\",\"\",IF(D163=\"\",\"\",ABS(D162-D163)))","v":1785},{"$f":"IF(O163=\"\",P162,AVERAGE(IF($O$161:O$185<>\"\",$O$161:O$185)))","v":1176.2916666666667},{"$f":"IF(ISERROR((P163*2.66)),Q164,(P163*2.66))","v":3128.9358333333339},{"$f":"$P163*3.27","v":3846.4737500000001},null,null,null,null,{"$f":"IF($D$159>5,NA(),IF(C163>H163,MAX(W$160:$W162)+1,0))","v":0},{"$f":"IF($D$159>5,NA(),IF(C163<I163,MAX(W$160:$W162)+1,0))","v":0},{"$error":"#N/A"},null,1,0,{"$error":"#N/A"},null,0,0,{"$error":"#N/A"},null,0,0,{"$error":"#N/A"},null,1,0,{"$error":"#N/A"},null,null,{"$error":"#N/A"},{"$error":"#N/A"}]
[null,"2018-05-01",{"$f":"IFERROR(IF(GETPIVOTDATA(\"Value\",Pivots_LA!$A$6,\"Month\",$B164,\"Delay reason\",$C$22)=0,\"\",GETPIVOTDATA(\"Value\",Pivots_LA!$A$6,\"Month\",$B164,\"Delay reason\",$C$22)),NA())","v":16111},16111,null,null,16831,19959.935833333333,13702.064166666667,null,null,null,null,"2018-05-01",747,{"$f":"IF(O164=\"\",P163,AVERAGE(IF($O$161:O$185<>\"\",$O$161:O$185)))","v":1176.2916666666667},{"$f":"IF(ISERROR((P164*2.66)),Q165,(P164*2.66))","v":3128.9358333333339},{"$f":"$P164*3.27","v":3846.4737500000001},null,null,null,null,{"$f":"IF($D$159>5,NA(),IF(C164>H164,MAX(W$160:$W163)+1,0))","v":0},{"$f":"IF($D$159>5,NA(),IF(C164<I164,MAX(W$160:$W163)+1,0))","v":0},{"$error":"#N/A"},null,0,0,{"$error":"#N/A"},null,1,0,{"$error":"#N/A"},null,0,0,{"$error":"#N/A"},null,1,0,{"$error":"#N/A"},null,null,{"$error":"#N/A"},{"$error":"#N/A"}]
[null,"2018-06-01",{"$f":"IFERROR(IF(GETPIVOTDATA(\"Value\",Pivots_LA!$A$6,\"Month\",$B165,\"Delay reason\",$C$22)=0,\"\",GETPIVOTDATA(\"Value\",Pivots_LA!$A$6,\"Month\",$B165,\"Delay reason\",$C$22)),NA())","v":15083},15083,null,null,16831,19959.935833333333,13702.064166666667,null,null,null,null,"2018-06-01",1028,{"$f":"IF(O165=\"\",P164,AVERAGE(IF($O$161:O$185<>\"\",$O$161:O$185)))","v":1176.2916666666667},{"$f":"IF(ISERROR((P165*2.66)),Q166,(P165*2.66))","v":3128.9358333333339},3846.4737500000001,null,null,null,null,{"$f":"IF($D$159>5,NA(),IF(C165>H165,MAX(W$160:$W164)+1,0))","v":0},{"$f":"IF($D$159>5,NA(),IF(C165<I165,MAX(W$160:$W164)+1,0))","v":0},{"$error":"#N/A"},null,0,0,{"$error":"#N/A"},null,1,0,{"$error":"#N/A"},null,0,0,{"$error":"#N/A"},null,1,0,{"$error":"#N/A"},null,null,{"$error":"#N/A"},{"$error":"#N/A"}]
[null,"2018-07-01",{"$f":"IFERROR(IF(GETPIVOTDATA(\"Value\",Pivots_LA!$A$6,\"Month\",$B166,\"Delay reason\",$C$22)=0,\"\",GETPIVOTDATA(\"Value\",Pivots_LA!$A$6,\"Month\",$B166,\"Delay reason\",$C$22)),NA())","v":15807},15807,null,null,16831,19959.935833333333,13702.064166666667,null,null,null,null,"2018-07-01",724,{"$f":"IF(O166=\"\",P165,AVERAGE(IF($O$161:O$185<>\"\",$O$161:O$185)))","v":1176.2916666666667},3128.9358333333339,3846.4737500000001,null,null,null,null,{"$f":"IF($D$159>5,NA(),IF(C166>H166,MAX(W$160:$W165)+1,0))","v":0},{"$f":"IF($D$159>5,NA(),IF(C166<I166,MAX(W$160:$W165)+1,0))","v":0},{"$error":"#N/A"},null,0,0,{"$error":"#N/A"},null,1,0,{"$error":"#N/A"},null,1,0,{"$error":"#N/A"},null,0,0,{"$error":"#N/A"},null,null,{"$error":"#N/A"},{"$error":"#N/A"}]
[null,"2018-08-01",{"$f":"IFERROR(IF(GETPIVOTDATA(\"Value\",Pivots_LA!$A$6,\"Month\",$B167,\"Delay reason\",$C$22)=0,\"\",GETPIVOTDATA(\"Value\",Pivots_LA!$A$6,\"Month\",$B167,\"Delay reason\",$C$22)),NA())","v":16740},16740,null,null,16831,19959.935833333333,13702.064166666667,null,null,null,null,"2018-08-01",933,{"$f":"IF(O167=\"\",P166,AVERAGE(IF($O$161:O$185<>\"\",$O$161:O$185)))","v":1176.2916666666667},3128.9358333333339,3846.4737500000001,null,null,null,null,{"$f":"IF($D$159>5,NA(),IF(C167>H167,MAX(W$160:$W166)+1,0))","v":0},{"$f":"IF($D$159>5,NA(),IF(C167<I167,MAX(W$160:$W166)+1,0))","v":0},{"$error":"#N/A"},null,0,0,{"$error":"#N/A"},null,1,0,{"$error":"#N/A"},null,1,0,{"$error":"#N/A"},null,0,0,{"$error":"#N/A"},null,null,{"$error":"#N/A"},{"$error":"#N/A"}]
[null,"2018-09-01",{"$f":"IFERROR(IF(GETPIVOTDATA(\"Value\",Pivots_LA!$A$6,\"Month\",$B168,\"Delay reason\",$C$22)=0,\"\",GETPIVOTDATA(\"Value\",Pivots_LA!$A$6,\"Month\",$B168,\"Delay reason\",$C$22)),NA())","v":17079},17079,null,null,16831,19959.935833333333,13702.064166666667,null,null,null,null,"2018-09-01",339,{"$f":"IF(O168=\"\",P167,AVERAGE(IF($O$161:O$185<>\"\",$O$161:O$185)))","v":1176.2916666666667},3128.9358333333339,3846.4737500000001,null,null,null,null,{"$f":"IF($D$159>5,NA(),IF(C168>H168,MAX(W$160:$W167)+1,0))","v":0},{"$f":"IF($D$159>5,NA(),IF(C168<I168,MAX(W$160:$W167)+1,0))","v":0},{"$error":"#N/A"},null,1,0,{"$error":"#N/A"},null,0,0,{"$error":"#N/A"},null,1,0,{"$error":"#N/A"},null,0,0,{"$error":"#N/A"},null,null,{"$error":"#N/A"},{"$error":"#N/A"}]
[null,"2018-10-01",{"$f":"IFERROR(IF(GETPIVOTDATA(\"Value\",Pivots_LA!$A$6,\"Month\",$B169,\"Delay reason\",$C$22)=0,\"\",GETPIVOTDATA(\"Value\",Pivots_LA!$A$6,\"Month\",$B169,\"Delay reason\",$C$22)),NA())","v":16538},16538,null,null,16831,19959.935833333333,13702.064166666667,null,null,null,null,"2018-10-01",541,{"$f":"IF(O169=\"\",P168,AVERAGE(IF($O$161:O$185<>\"\",$O$161:O$185)))","v":1176.2916666666667},3128.9358333333339,3846.4737500000001,null,null,null,null,{"$f":"IF($D$159>5,NA(),IF(C169>H169,MAX(W$160:$W168)+1,0))","v":0},{"$f":"IF($D$159>5,NA(),IF(C169<I169,MAX(W$160:$W168)+1,0))","v":0},{"$error":"#N/A"},null,0,0,{"$error":"#N/A"},null,1,1,16538,null,0,0,{"$error":"#N/A"},null,1,0,{"$error":"#N/A"},null,null,{"$error":"#N/A"},16538]
[null,"2018-11-01",{"$f":"IFERROR(IF(GETPIVOTDATA(\"Value\",Pivots_LA!$A$6,\"Month\",$B170,\"Delay reason\",$C$22)=0,\"\",GETPIVOTDATA(\"Value\",Pivots_LA!$A$6,\"Month\",$B170,\"Delay reason\",$C$22)),NA())","v":13739},13739,null,null,16831,19959.935833333333,13702.064166666667,null,null,null,null,"2018-11-01",2799,{"$f":"IF(O170=\"\",P169,AVERAGE(IF($O$161:O$185<>\"\",$O$161:O$185)))","v":1176.2916666666667},3128.9358333333339,3846.4737500000001,null,null,null,null,{"$f":"IF($D$159>5,NA(),IF(C170>H170,MAX(W$160:$W169)+1,0))","v":0},{"$f":"IF($D$159>5,NA(),IF(C170<I170,MAX(W$160:$W169)+1,0))","v":0},{"$error":"#N/A"},null,0,0,{"$error":"#N/A"},null,1,1,13739,null,0,0,{"$error":"#N/A"},null,1,0,{"$error":"#N/A"},null,null,{"$error":"#N/A"},13739]
[null,"2018-12-01",{"$f":"IFERROR(IF(GETPIVOTDATA(\"Value\",Pivots_LA!$A$6,\"Month\",$B171,\"Delay reason\",$C$22)=0,\"\",GETPIVOTDATA(\"Value\",Pivots_LA!$A$6,\"Month\",$B171,\"Delay reason\",$C$22)),NA())","v":13983},13983,null,null,16831,19959.935833333333,13702.064166666667,null,null,null,null,"2018-12-01",244,{"$f":"IF(O171=\"\",P170,AVERAGE(IF($O$161:O$185<>\"\",$O$161:O$185)))","v":1176.2916666666667},3128.9358333333339,3846.4737500000001,null,null,null,null,{"$f":"IF($D$159>5,NA(),IF(C171>H171,MAX(W$160:$W170)+1,0))","v":0},{"$f":"IF($D$159>5,NA(),IF(C171<I171,MAX(W$160:$W170)+1,0))","v":0},{"$error":"#N/A"},null,0,0,{"$error":"#N/A"},null,1,1,13983,null,1,0,{"$error":"#N/A"},null,0,0,{"$error":"#N/A"},null,null,{"$error":"#N/A"},13983]
[null,"2019-01-01",{"$f":"IFERROR(IF(GETPIVOTDATA(\"Value\",Pivots_LA!$A$6,\"Month\",$B172,\"Delay reason\",$C$22)=0,\"\",GETPIVOTDATA(\"Value\",Pivots_LA!$A$6,\"Month\",$B172,\"Delay reason\",$C$22)),NA())","v":15811},15811,null,null,16831,19959.935833333333,13702.064166666667,null,null,null,null,"2019-01-01",1828,{"$f":"IF(O172=\"\",P171,AVERAGE(IF($O$161:O$185<>\"\",$O$161:O$185)))","v":1176.2916666666667},3128.9358333333339,3846.4737500000001,null,null,null,null,{"$f":"IF($D$159>5,NA(),IF(C172>H172,MAX(W$160:$W171)+1,0))","v":0},{"$f":"IF($D$159>5,NA(),IF(C172<I172,MAX(W$160:$W171)+1,0))","v":0},{"$error":"#N/A"},null,0,0,{"$error":"#N/A"},null,1,1,15811,null,1,0,{"$error":"#N/A"},null,0,0,{"$error":"#N/A"},null,null,{"$error":"#N/A"},15811]
[null,"2019-02-01",{"$f":"IFERROR(IF(GETPIVOTDATA(\"Value\",Pivots_LA!$A$6,\"Month\",$B173,\"Delay reason\",$C$22)=0,\"\",GETPIVOTDATA(\"Value\",Pivots_LA!$A$6,\"Month\",$B173,\"Delay reason\",$C$22)),NA())","v":14266},14266,null,null,16831,19959.935833333333,13702.064166666667,null,null,null,null,"2019-02-01",1545,{"$f":"IF(O173=\"\",P172,AVERAGE(IF($O$161:O$185<>\"\",$O$161:O$185)))","v":1176.2916666666667},3128.9358333333339,3846.4737500000001,null,null,null,null,{"$f":"IF($D$159>5,NA(),IF(C173>H173,MAX(W$160:$W172)+1,0))","v":0},{"$f":"IF($D$159>5,NA(),IF(C173<I173,MAX(W$160:$W172)+1,0))","v":0},{"$error":"#N/A"},null,0,0,{"$error":"#N/A"},null,1,1,14266,null,0,0,{"$error":"#N/A"},null,1,0,{"$error":"#N/A"},null,null,{"$error":"#N/A"},14266]
[null,"2019-03-01",{"$f":"IFERROR(IF(GETPIVOTDATA(\"Value\",Pivots_LA!$A$6,\"Month\",$B174,\"Delay reason\",$C$22)=0,\"\",GETPIVOTDATA(\"Value\",Pivots_LA!$A$6,\"Month\",$B174,\"Delay reason\",$C$22)),NA())","v":15422},15422,null,null,16831,19959.935833333333,13702.064166666667,null,null,null,null,"2019-03-01",1156,{"$f":"IF(O174=\"\",P173,AVERAGE(IF($O$161:O$185<>\"\",$O$161:O$185)))","v":1176.2916666666667},3128.9358333333339,3846.4737500000001,null,null,null,null,{"$f":"IF($D$159>5,NA(),IF(C174>H174,MAX(W$160:$W173)+1,0))","v":0},{"$f":"IF($D$159>5,NA(),IF(C174<I174,MAX(W$160:$W173)+1,0))","v":0},{"$error":"#N/A"},null,0,0,{"$error":"#N/A"},null,1,1,15422,null,1,0,{"$error":"#N/A"},null,0,0,{"$error":"#N/A"},null,null,{"$error":"#N/A"},15422]
[null,"2019-04-01",{"$f":"IFERROR(IF(GETPIVOTDATA(\"Value\",Pivots_LA!$A$6,\"Month\",$B175,\"Delay reason\",$C$22)=0,\"\",GETPIVOTDATA(\"Value\",Pivots_LA!$A$6,\"Month\",$B175,\"Delay reason\",$C$22)),NA())","v":15076},15076,null,null,16831,19959.935833333333,13702.064166666667,null,null,null,null,"2019-04-01",346,{"$f":"IF(O175=\"\",P174,AVERAGE(IF($O$161:O$185<>\"\",$O$161:O$185)))","v":1176.2916666666667},3128.9358333333339,3846.4737500000001,null,null,null,null,{"$f":"IF($D$159>5,NA(),IF(C175>H175,MAX(W$160:$W174)+1,0))","v":0},{"$f":"IF($D$159>5,NA(),IF(C175<I175,MAX(W$160:$W174)+1,0))","v":0},{"$error":"#N/A"},null,0,0,{"$error":"#N/A"},null,1,1,15076,null,0,0,{"$error":"#N/A"},null,1,0,{"$error":"#N/A"},null,null,{"$error":"#N/A"},15076]
[null,"2019-05-01",{"$f":"IFERROR(IF(GETPIVOTDATA(\"Value\",Pivots_LA!$A$6,\"Month\",$B176,\"Delay reason\",$C$22)=0,\"\",GETPIVOTDATA(\"Value\",Pivots_LA!$A$6,\"Month\",$B176,\"Delay reason\",$C$22)),NA())","v":17379},17379,null,null,16831,19959.935833333333,13702.064166666667,null,null,null,null,"2019-05-01",2303,{"$f":"IF(O176=\"\",P175,AVERAGE(IF($O$161:O$185<>\"\",$O$161:O$185)))","v":1176.2916666666667},3128.9358333333339,3846.4737500000001,null,null,null,null,{"$f":"IF($D$159>5,NA(),IF(C176>H176,MAX(W$160:$W175)+1,0))","v":0},{"$f":"IF($D$159>5,NA(),IF(C176<I176,MAX(W$160:$W175)+1,0))","v":0},{"$error":"#N/A"},null,1,0,{"$error":"#N/A"},null,0,0,{"$error":"#N/A"},null,1,0,{"$error":"#N/A"},null,0,0,{"$error":"#N/A"},null,null,{"$error":"#N/A"},{"$error":"#N/A"}]
[null,"2019-06-01",{"$f":"IFERROR(IF(GETPIVOTDATA(\"Value\",Pivots_LA!$A$6,\"Month\",$B177,\"Delay reason\",$C$22)=0,\"\",GETPIVOTDATA(\"Value\",Pivots_LA!$A$6,\"Month\",$B177,\"Delay reason\",$C$22)),NA())","v":15461},15461,null,null,16831,19959.935833333333,13702.064166666667,null,null,null,null,"2019-06-01",1918,{"$f":"IF(O177=\"\",P176,AVERAGE(IF($O$161:O$185<>\"\",$O$161:O$185)))","v":1176.2916666666667},3128.9358333333339,3846.4737500000001,null,null,null,null,{"$f":"IF($D$159>5,NA(),IF(C177>H177,MAX(W$160:$W176)+1,0))","v":0},{"$f":"IF($D$159>5,NA(),IF(C177<I177,MAX(W$160:$W176)+1,0))","v":0},{"$error":"#N/A"},null,0,0,{"$error":"#N/A"},null,1,0,{"$error":"#N/A"},null,0,0,{"$error":"#N/A"},null,1,0,{"$error":"#N/A"},null,null,{"$error":"#N/A"},{"$error":"#N/A"}]
[null,"2019-07-01",{"$f":"IFERROR(IF(GETPIVOTDATA(\"Value\",Pivots_LA!$A$6,\"Month\",$B178,\"Delay reason\",$C$22)=0,\"\",GETPIVOTDATA(\"Value\",Pivots_LA!$A$6,\"Month\",$B178,\"Delay reason\",$C$22)),NA())","v":16350},16350,null,null,16831,19959.935833333333,13702.064166666667,null,null,null,null,"2019-07-01",889,{"$f":"IF(O178=\"\",P177,AVERAGE(IF($O$161:O$185<>\"\",$O$161:O$185)))","v":1176.2916666666667},3128.9358333333339,3846.4737500000001,null,null,null,null,{"$f":"IF($D$159>5,NA(),IF(C178>H178,MAX(W$160:$W177)+1,0))","v":0},{"$f":"IF($D$159>5,NA(),IF(C178<I178,MAX(W$160:$W177)+1,0))","v":0},{"$error":"#N/A"},null,0,0,{"$error":"#N/A"},null,1,{"$f":"IFERROR(IF(AND(AF177=1,AE178=1),1,IF(SUM(AE178:AE184)>=7,1,0)),0)","v":0},{"$error":"#N/A"},null,1,0,{"$error":"#N/A"},null,0,0,{"$error":"#N/A"},null,null,{"$error":"#N/A"},{"$error":"#N/A"}]
[null,"2019-08-01",{"$f":"IFERROR(IF(GETPIVOTDATA(\"Value\",Pivots_LA!$A$6,\"Month\",$B179,\"Delay reason\",$C$22)=0,\"\",GETPIVOTDATA(\"Value\",Pivots_LA!$A$6,\"Month\",$B179,\"Delay reason\",$C$22)),NA())","v":17697},17697,null,null,16831,19959.935833333333,13702.064166666667,null,null,null,null,"2019-08-01",1347,{"$f":"IF(O179=\"\",P178,AVERAGE(IF($O$161:O$185<>\"\",$O$161:O$185)))","v":1176.2916666666667},3128.9358333333339,3846.4737500000001,null,null,null,null,{"$f":"IF($D$159>5,NA(),IF(C179>H179,MAX(W$160:$W178)+1,0))","v":0},{"$f":"IF($D$159>5,NA(),IF(C179<I179,MAX(W$160:$W178)+1,0))","v":0},{"$error":"#N/A"},null,1,1,17697,null,0,{"$f":"IFERROR(IF(AND(AF178=1,AE179=1),1,IF(SUM(AE179:AE185)>=7,1,0)),0)","v":0},{"$error":"#N/A"},null,1,{"$f":"IF(AND(AJ178=1,AI179=1),1,IF(SUM(AI179:AI185)>=7,1,0))","v":0},{"$error":"#N/A"},null,0,{"$f":"IF(AND(AN178=1,AM179=1),1,IF(SUM(AM179:AM185)>=7,1,0))","v":0},{"$error":"#N/A"},null,null,17697,{"$error":"#N/A"}]
[null,"2019-09-01",{"$f":"IFERROR(IF(GETPIVOTDATA(\"Value\",Pivots_LA!$A$6,\"Month\",$B180,\"Delay reason\",$C$22)=0,\"\",GETPIVOTDATA(\"Value\",Pivots_LA!$A$6,\"Month\",$B180,\"Delay reason\",$C$22)),NA())","v":19480},19480,null,null,16831,19959.935833333333,13702.064166666667,null,null,null,null,"2019-09-01",1783,{"$f":"IF(O180=\"\",P179,AVERAGE(IF($O$161:O$185<>\"\",$O$161:O$185)))","v":1176.2916666666667},3128.9358333333339,3846.4737500000001,null,null,null,null,{"$f":"IF($D$159>5,NA(),IF(C180>H180,MAX(W$160:$W179)+1,0))","v":0},{"$f":"IF($D$159>5,NA(),IF(C180<I180,MAX(W$160:$W179)+1,0))","v":0},{"$error":"#N/A"},null,1,{"$f":"IFERROR(IF(AND(AB179=1,AA180=1),1,IF(SUM(AA180:AA185)>=7,1,0)),0)","v":1},19480,null,0,{"$f":"IFERROR(IF(AND(AF179=1,AE180=1),1,IF(SUM(AE180:AE185)>=7,1,0)),0)","v":0},{"$error":"#N/A"},null,1,{"$f":"IF(AND(AJ179=1,AI180=1),1,IF(SUM(AI180:AI185)>=7,1,0))","v":0},{"$error":"#N/A"},null,0,{"$f":"IF(AND(AN179=1,AM180=1),1,IF(SUM(AM180:AM185)>=7,1,0))","v":0},{"$error":"#N/A"},null,null,19480,{"$error":"#N/A"}]
[null,"2019-10-01",{"$f":"IFERROR(IF(GETPIVOTDATA(\"Value\",Pivots_LA!$A$6,\"Month\",$B181,\"Delay reason\",$C$22)=0,\"\",GETPIVOTDATA(\"Value\",Pivots_LA!$A$6,\"Month\",$B181,\"Delay reason\",$C$22)),NA())","v":18437},18437,null,null,16831,19959.935833333333,13702.064166666667,null,null,null,null,"2019-10-01",1043,{"$f":"IF(O181=\"\",P180,AVERAGE(IF($O$161:O$185<>\"\",$O$161:O$185)))","v":1176.2916666666667},3128.9358333333339,3846.4737500000001,null,null,null,null,{"$f":"IF($D$159>5,NA(),IF(C181>H181,MAX(W$160:$W180)+1,0))","v":0},{"$f":"IF($D$159>5,NA(),IF(C181<I181,MAX(W$160:$W180)+1,0))","v":0},{"$error":"#N/A"},null,1,{"$f":"IFERROR(IF(AND(AB180=1,AA181=1),1,IF(SUM(AA181:AA185)>=7,1,0)),0)","v":1},18437,null,0,{"$f":"IFERROR(IF(AND(AF180=1,AE181=1),1,IF(SUM(AE181:AE185)>=7,1,0)),0)","v":0},{"$error":"#N/A"},null,0,{"$f":"IF(AND(AJ180=1,AI181=1),1,IF(SUM(AI181:AI185)>=7,1,0))","v":0},{"$error":"#N/A"},null,1,{"$f":"IF(AND(AN180=1,AM181=1),1,IF(SUM(AM181:AM185)>=7,1,0))","v":0},{"$error":"#N/A"},null,null,18437,{"$error":"#N/A"}]
[null,"2019-11-01",{"$f":"IFERROR(IF(GETPIVOTDATA(\"Value\",Pivots_LA!$A$6,\"Month\",$B182,\"Delay reason\",$C$22)=0,\"\",GETPIVOTDATA(\"Value\",Pivots_LA!$A$6,\"Month\",$B182,\"Delay reason\",$C$22)),NA())","v":17952},17952,null,null,16831,19959.935833333333,13702.064166666667,null,null,null,null,"2019-11-01",485,{"$f":"IF(O182=\"\",P181,AVERAGE(IF($O$161:O$185<>\"\",$O$161:O$185)))","v":1176.2916666666667},3128.9358333333339,3846.4737500000001,null,null,null,null,{"$f":"IF($D$159>5,NA(),IF(C182>H182,MAX(W$160:$W181)+1,0))","v":0},{"$f":"IF($D$159>5,NA(),IF(C182<I182,MAX(W$160:$W181)+1,0))","v":0},{"$error":"#N/A"},null,1,{"$f":"IFERROR(IF(AND(AB181=1,AA182=1),1,IF(SUM(AA182:AA188)>=7,1,0)),0)","v":1},17952,null,0,{"$f":"IFERROR(IF(AND(AF181=1,AE182=1),1,IF(SUM(AE182:AE185)>=7,1,0)),0)","v":0},{"$error":"#N/A"},null,0,{"$f":"IF(AND(AJ181=1,AI182=1),1,IF(SUM(AI182:AI185)>=7,1,0))","v":0},{"$error":"#N/A"},null,1,{"$f":"IF(AND(AN181=1,AM182=1),1,IF(SUM(AM182:AM185)>=7,1,0))","v":0},{"$error":"#N/A"},null,null,17952,{"$error":"#N/A"}]
[null,"2019-12-01",{"$f":"IFERROR(IF(GETPIVOTDATA(\"Value\",Pivots_LA!$A$6,\"Month\",$B183,\"Delay reason\",$C$22)=0,\"\",GETPIVOTDATA(\"Value\",Pivots_LA!$A$6,\"Month\",$B183,\"Delay reason\",$C$22)),NA())","v":18232},18232,null,null,16831,19959.935833333333,13702.064166666667,null,null,null,null,"2019-12-01",280,{"$f":"IF(O183=\"\",P182,AVERAGE(IF($O$161:O$185<>\"\",$O$161:O$185)))","v":1176.2916666666667},3128.9358333333339,3846.4737500000001,null,null,null,null,{"$f":"IF($D$159>5,NA(),IF(C183>H183,MAX(W$160:$W182)+1,0))","v":0},{"$f":"IF($D$159>5,NA(),IF(C183<I183,MAX(W$160:$W182)+1,0))","v":0},{"$error":"#N/A"},null,1,{"$f":"IFERROR(IF(AND(AB182=1,AA183=1),1,IF(SUM(AA183:AA185)>=7,1,0)),0)","v":1},18232,null,0,{"$f":"IFERROR(IF(AND(AF182=1,AE183=1),1,IF(SUM(AE183:AE185)>=7,1,0)),0)","v":0},{"$error":"#N/A"},null,1,{"$f":"IF(AND(AJ182=1,AI183=1),1,IF(SUM(AI183:AI185)>=7,1,0))","v":0},{"$error":"#N/A"},null,0,{"$f":"IF(AND(AN182=1,AM183=1),1,IF(SUM(AM183:AM185)>=7,1,0))","v":0},{"$error":"#N/A"},null,null,18232,{"$error":"#N/A"}]
[null,"2020-01-01",{"$f":"IFERROR(IF(GETPIVOTDATA(\"Value\",Pivots_LA!$A$6,\"Month\",$B184,\"Delay reason\",$C$22)=0,\"\",GETPIVOTDATA(\"Value\",Pivots_LA!$A$6,\"Month\",$B184,\"Delay reason\",$C$22)),NA())","v":20796},20796,null,null,16831,19959.935833333333,13702.064166666667,null,null,null,null,{"$f":"B184","v":"2020-01-01"},2564,{"$f":"IF(O184=\"\",P183,AVERAGE(IF($O$161:O$185<>\"\",$O$161:O$185)))","v":1176.2916666666667},3128.9358333333339,3846.4737500000001,null,null,null,null,{"$f":"IF($D$159>5,NA(),IF(C184>H184,MAX(W$160:$W183)+1,0))","v":1},{"$f":"IF($D$159>5,NA(),IF(C184<I184,MAX(W$160:$W183)+1,0))","v":0},20796,null,1,{"$f":"IFERROR(IF(AND(AB183=1,AA184=1),1,IF(SUM(AA184:AA185)>=7,1,0)),0)","v":1},20796,null,0,{"$f":"IFERROR(IF(AND(AF183=1,AE184=1),1,IF(SUM(AE184:AE185)>=7,1,0)),0)","v":0},{"$error":"#N/A"},null,1,{"$f":"IF(AND(AJ183=1,AI184=1),1,IF(SUM(AI184:AI185)>=7,1,0))","v":0},{"$error":"#N/A"},null,0,{"$f":"IF(AND(AN183=1,AM184=1),1,IF(SUM(AM184:AM185)>=7,1,0))","v":0},{"$error":"#N/A"},null,null,20796,{"$error":"#N/A"}]
[null,"2020-02-01",{"$f":"IFERROR(IF(GETPIVOTDATA(\"Value\",Pivots_LA!$A$6,\"Month\",$B185,\"Delay reason\",$C$22)=0,\"\",GETPIVOTDATA(\"Value\",Pivots_LA!$A$6,\"Month\",$B185,\"Delay reason\",$C$22)),NA())","v":20087},20087,null,null,16831,19959.935833333333,13702.064166666667,null,null,null,null,{"$f":"B185","v":"2020-02-01"},709,{"$f":"IF(O185=\"\",P184,AVERAGE(IF($O$161:O$185<>\"\",$O$161:O$185)))","v":1176.2916666666667},{"$f":"IF(ISERROR((P185*2.66)),Q186,(P185*2.66))","v":3128.9358333333339},{"$f":"$P185*3.27","v":3846.4737500000001},null,null,null,null,{"$f":"IF($D$159>5,NA(),IF(C185>H185,MAX(W$160:$W184)+1,0))","v":2},{"$f":"IF($D$159>5,NA(),IF(C185<I185,MAX(W$160:$W184)+1,0))","v":0},{"$f":"IF(OR(W185>0,X185>0),C185,NA())","v":20087},null,1,{"$f":"IFERROR(IF(AND(AB184=1,AA185=1),1,IF(SUM(AA185)>=7,1,0)),0)","v":1},20087,null,0,{"$f":"IFERROR(IF(AND(AF184=1,AE185=1),1,IF(SUM(AE185)>=7,1,0)),0)","v":0},{"$error":"#N/A"},null,0,{"$f":"IF(AND(AJ184=1,AI185=1),1,IF(SUM(AI185)>=7,1,0))","v":0},{"$error":"#N/A"},null,1,{"$f":"IF(AND(AN184=1,AM185=1),1,IF(SUM(AM185)>=7,1,0))","v":0},{"$error":"#N/A"},null,null,{"$f":"IF(OR(W185>0,AB185>0,AJ185>0),C185,NA())","v":20087},{"$error":"#N/A"}]
[]
[null,"Delayed days (all reasons)",null,"Count IF data point blank"]
[null,null,{"$f":"ROW()","v":188},{"$f":"COUNTIF(D190:D214,\"\")","v":19},null,null,null,"Upper","Lower",null,null,null,null,null,"Difference",null,"Sigma",null,null,null,null,null,"> 3","< 3 ",null,null,"7 points above/below mean",null,null,null,null,null,null,null,"Trend up/down",null,null,null,null,null,null,null,null,"chart 6"]
[null,"ID (Week no.)","Plot data","Data",null,null,"Mean","Control limits ","control limit (-3)",null,null,null,null,"Date","For. Roll avg","Cumul. Moving Avg.","2.66* MR","3.27*MR",null,null,null,null,"Count","Count","Above/below 3 sigma",null,"7 points > mean","Count of 7 point ","7 points above mean",null,"7 points <mean","Count of 7point ","7 points below mean",null,"Trend up",null,null,null,"Trend Down",null,null,null,null,"Concern","Improvement"]
[null,{"$f":"IF(AG14=0,NA(),T14)","v":{"$error":"#N/A"}},{"$f":"IFERROR(IF(GETPIVOTDATA(\"Value\",Pivots_LA!$A$6,\"Month\",$B190)=0,\"\",GETPIVOTDATA(\"Value\",Pivots_LA!$A$6,\"Month\",$B190)),NA())","v":{"$error":"#N/A"}},{"$f":"IFERROR(IF(C190=\"\",\"\",C190),\"\")","v":""},null,null,{"$f":"AVERAGE($D$190:$D$214)","v":151261.83333333334},{"$f":"IF($D$188>5,NA(),IF(D190=\"\",H189,G190+Q190))","v":{"$error":"#N/A"}},{"$f":"IF($D$188>5,NA(),IF(D190=\"\",I189,G190-Q190))","v":{"$error":"#N/A"}},null,null,null,null,{"$f":"IFERROR(B190,NA())","v":{"$error":"#N/A"}},null,{"$f":"IF(O190=\"\",P189,AVERAGE(IF($O$190:O$214<>\"\",$O$190:O$214)))","v":"Cumul. Moving Avg."},{"$f":"Q191","v":16859.080000000002},{"$f":"R191","v":{"$error":"#VALUE!"}},null,null,null,null,{"$f":"IF($D$188>5,NA(),IF(C190>H190,MAX(W$189:$W189)+1,0))","v":{"$error":"#N/A"}},{"$f":"IF($D$188>5,NA(),IF(C190<I190,MAX(W$189:$W189)+1,0))","v":{"$error":"#N/A"}},{"$f":"IF(OR(W190>0,X190>0),C190,NA())","v":{"$error":"#N/A"}},null,{"$f":"IF($D$188>5,NA(), IF(C190>G190,1,0))","v":{"$error":"#N/A"}},{"$f":"IFERROR(IF(AND(AB189=1,AA190=1),1,IF(SUM(AA190:AA196)>=7,1,0)),NA())","v":{"$error":"#N/A"}},{"$f":"IF(AB190=0,NA(),C190)","v":{"$error":"#N/A"}},null,{"$f":"IF($D$188>5,NA(), IF(C190<G190,1,0))","v":{"$error":"#N/A"}},{"$f":"IFERROR(IF(AND(AF189=1,AE190=1),1,IF(SUM(AE190:AE196)>=7,1,0)),NA())","v":{"$error":"#N/A"}},{"$f":"IF(AF190=0,NA(),C190)","v":{"$error":"#N/A"}},null,{"$f":"IF($D$188>5,NA(),IF(C190>C189,1,0))","v":{"$error":"#N/A"}},{"$f":"IFERROR(IF(AND(AJ189=1,AI190=1),1,IF(SUM(AI190:AI196)>=7,1,0)),NA())","v":{"$error":"#N/A"}},{"$f":"IF(AJ190=0,NA(),C190)","v":{"$error":"#N/A"}},null,{"$f":"IF($D$188>5,NA(),IF(C190<C189,1,0))","v":{"$error":"#N/A"}},{"$f":"IFERROR(IF(AND(AN189=1,AM190=1),1,IF(SUM(AM190:AM196)>=7,1,0)),NA())","v":{"$error":"#N/A"}},{"$f":"IF(AN190=0,NA(),C190)","v":{"$error":"#N/A"}},null,null,{"$f":"IF(OR(W190>0,AB190>0,AJ190>0),C190,NA())","v":{"$error":"#N/A"}},{"$f":"IF(OR(X190>0,AF190>0,AN190>0),C190,NA())","v":{"$error":"#N/A"}}]
[null,{"$f":"IF(AG15=0,NA(),T15)","v":{"$error":"#N/A"}},{"$f":"IFERROR(IF(GETPIVOTDATA(\"Value\",Pivots_LA!$A$6,\"Month\",$B191)=0,\"\",GETPIVOTDATA(\"Value\",Pivots_LA!$A$6,\"Month\",$B191)),NA())","v":{"$error":"#N/A"}},{"$f":"IFERROR(IF(C191=\"\",\"\",C191),\"\")","v":""},null,null,{"$f":"AVERAGE($D$190:$D$214)","v":151261.83333333334},{"$f":"IF($D$188>5,NA(),IF(D191=\"\",H190,G191+Q191))","v":{"$error":"#N/A"}},{"$f":"IF($D$188>5,NA(),IF(D191=\"\",I190,G191-Q191))","v":{"$error":"#N/A"}},null,null,null,null,{"$f":"IFERROR(B191,NA())","v":{"$error":"#N/A"}},{"$f":"IF(D190=\"\",\"\",IF(D191=\"\",\"\",ABS(D190-D191)))","v":""},{"$f":"IF(O191=\"\",P190,AVERAGE(IF($O$190:O$214<>\"\",$O$190:O$214)))","v":"Cumul. Moving Avg."},{"$f":"IF(ISERROR((P191*2.66)),Q192,(P191*2.66))","v":16859.080000000002},{"$f":"$P191*3.27","v":{"$error":"#VALUE!"}},null,null,null,null,{"$f":"IF($D$188>5,NA(),IF(C191>H191,MAX(W$189:$W190)+1,0))","v":{"$error":"#N/A"}},{"$f":"IF($D$188>5,NA(),IF(C191<I191,MAX(W$189:$W190)+1,0))","v":{"$error":"#N/A"}},{"$f":"IF(OR(W191>0,X191>0),C191,NA())","v":{"$error":"#N/A"}},null,{"$f":"IF($D$188>5,NA(), IF(C191>G191,1,0))","v":{"$error":"#N/A"}},{"$f":"IFERROR(IF(AND(AB190=1,AA191=1),1,IF(SUM(AA191:AA197)>=7,1,0)),NA())","v":{"$error":"#N/A"}},{"$f":"IF(AB191=0,NA(),C191)","v":{"$error":"#N/A"}},null,{"$f":"IF($D$188>5,NA(), IF(C191<G191,1,0))","v":{"$error":"#N/A"}},{"$f":"IFERROR(IF(AND(AF190=1,AE191=1),1,IF(SUM(AE191:AE197)>=7,1,0)),NA())","v":{"$error":"#N/A"}},{"$f":"IF(AF191=0,NA(),C191)","v":{"$error":"#N/A"}},null,{"$f":"IF($D$188>5,NA(),IF(C191>C190,1,0))","v":{"$error":"#N/A"}},{"$f":"IFERROR(IF(AND(AJ190=1,AI191=1),1,IF(SUM(AI191:AI197)>=7,1,0)),NA())","v":{"$error":"#N/A"}},{"$f":"IF(AJ191=0,NA(),C191)","v":{"$error":"#N/A"}},null,{"$f":"IF($D$188>5,NA(),IF(C191<C190,1,0))","v":{"$error":"#N/A"}},{"$f":"IFERROR(IF(AND(AN190=1,AM191=1),1,IF(SUM(AM191:AM197)>=7,1,0)),NA())","v":{"$error":"#N/A"}},{"$f":"IF(AN191=0,NA(),C191)","v":{"$error":"#N/A"}},null,null,{"$f":"IF(OR(W191>0,AB191>0,AJ191>0),C191,NA())","v":{"$error":"#N/A"}},{"$f":"IF(OR(X191>0,AF191>0,AN191>0),C191,NA())","v":{"$error":"#N/A"}}]
[null,{"$error":"#N/A"},{"$f":"IFERROR(IF(GETPIVOTDATA(\"Value\",Pivots_LA!$A$6,\"Month\",$B192)=0,\"\",GETPIVOTDATA(\"Value\",Pivots_LA!$A$6,\"Month\",$B192)),NA())","v":{"$error":"#N/A"}},"",null,null,151261.83333333334,{"$error":"#N/A"},{"$error":"#N/A"},null,null,null,null,{"$error":"#N/A"},{"$f":"IF(D191=\"\",\"\",IF(D192=\"\",\"\",ABS(D191-D192)))","v":""},{"$f":"IF(O192=\"\",P191,AVERAGE(IF($O$190:O$214<>\"\",$O$190:O$214)))","v":"Cumul. Moving Avg."},{"$f":"IF(ISERROR((P192*2.66)),Q193,(P192*2.66))","v":16859.080000000002},{"$f":"$P192*3.27","v":{"$error":"#VALUE!"}},null,null,null,null,{"$f":"IF($D$188>5,NA(),IF(C192>H192,MAX(W$189:$W191)+1,0))","v":{"$error":"#N/A"}},{"$f":"IF($D$188>5,NA(),IF(C192<I192,MAX(W$189:$W191)+1,0))","v":{"$error":"#N/A"}},{"$error":"#N/A"},null,{"$error":"#N/A"},{"$error":"#N/A"},{"$error":"#N/A"},null,{"$error":"#N/A"},{"$error":"#N/A"},{"$error":"#N/A"},null,{"$f":"IF($D$188>5,NA(),IF(C192>C191,1,0))","v":{"$error":"#N/A"}},{"$error":"#N/A"},{"$error":"#N/A"},null,{"$error":"#N/A"},{"$error":"#N/A"},{"$error":"#N/A"},null,null,{"$error":"#N/A"},{"$error":"#N/A"}]
[null,{"$error":"#N/A"},{"$f":"IFERROR(IF(GETPIVOTDATA(\"Value\",Pivots_LA!$A$6,\"Month\",$B193)=0,\"\",GETPIVOTDATA(\"Value\",Pivots_LA!$A$6,\"Month\",$B193)),NA())","v":{"$error":"#N/A"}},"",null,null,151261.83333333334,{"$error":"#N/A"},{"$error":"#N/A"},null,null,null,null,{"$error":"#N/A"},{"$f":"IF(D192=\"\",\"\",IF(D193=\"\",\"\",ABS(D192-D193)))","v":""},{"$f":"IF(O193=\"\",P192,AVERAGE(IF($O$190:O$214<>\"\",$O$190:O$214)))","v":"Cumul. Moving Avg."},{"$f":"IF(ISERROR((P193*2.66)),Q194,(P193*2.66))","v":16859.080000000002},{"$f":"$P193*3.27","v":{"$error":"#VALUE!"}},null,null,null,null,{"$f":"IF($D$188>5,NA(),IF(C193>H193,MAX(W$189:$W192)+1,0))","v":{"$error":"#N/A"}},{"$f":"IF($D$188>5,NA(),IF(C193<I193,MAX(W$189:$W192)+1,0))","v":{"$error":"#N/A"}},{"$error":"#N/A"},null,{"$error":"#N/A"},{"$error":"#N/A"},{"$error":"#N/A"},null,{"$error":"#N/A"},{"$error":"#N/A"},{"$error":"#N/A"},null,{"$error":"#N/A"},{"$error":"#N/A"},{"$error":"#N/A"},null,{"$error":"#N/A"},{"$error":"#N/A"},{"$error":"#N/A"},null,null,{"$error":"#N/A"},{"$error":"#N/A"}]
[null,{"$error":"#N/A"},{"$f":"IFERROR(IF(GETPIVOTDATA(\"Value\",Pivots_LA!$A$6,\"Month\",$B194)=0,\"\",GETPIVOTDATA(\"Value\",Pivots_LA!$A$6,\"Month\",$B194)),NA())","v":{"$error":"#N/A"}},"",null,null,151261.83333333334,{"$error":"#N/A"},{"$error":"#N/A"},null,null,null,null,{"$error":"#N/A"},"",{"$f":"IF(O194=\"\",P193,AVERAGE(IF($O$190:O$214<>\"\",$O$190:O$214)))","v":"Cumul. Moving Avg."},{"$f":"IF(ISERROR((P194*2.66)),Q195,(P194*2.66))","v":16859.080000000002},{"$error":"#VALUE!"},null,null,null,null,{"$f":"IF($D$188>5,NA(),IF(C194>H194,MAX(W$189:$W193)+1,0))","v":{"$error":"#N/A"}},{"$f":"IF($D$188>5,NA(),IF(C194<I194,MAX(W$189:$W193)+1,0))","v":{"$error":"#N/A"}},{"$error":"#N/A"},null,{"$error":"#N/A"},{"$error":"#N/A"},{"$error":"#N/A"},null,{"$error":"#N/A"},{"$error":"#N/A"},{"$error":"#N/A"},null,{"$error":"#N/A"},{"$error":"#N/A"},{"$error":"#N/A"},null,{"$error":"#N/A"},{"$error":"#N/A"},{"$error":"#N/A"},null,null,{"$error":"#N/A"},{"$error":"#N/A"}]
[null,{"$error":"#N/A"},{"$f":"IFERROR(IF(GETPIVOTDATA(\"Value\",Pivots_LA!$A$6,\"Month\",$B195)=0,\"\",GETPIVOTDATA(\"Value\",Pivots_LA!$A$6,\"Month\",$B195)),NA())","v":{"$error":"#N/A"}},"",null,null,151261.83333333334,{"$error":"#N/A"},{"$error":"#N/A"},null,null,null,null,{"$error":"#N/A"},"",{"$f":"IF(O195=\"\",P194,AVERAGE(IF($O$190:O$214<>\"\",$O$190:O$214)))","v":"Cumul. Moving Avg."},16859.080000000002,{"$error":"#VALUE!"},null,null,null,null,{"$f":"IF($D$188>5,NA(),IF(C195>H195,MAX(W$189:$W194)+1,0))","v":{"$error":"#N/A"}},{"$f":"IF($D$188>5,NA(),IF(C195<I195,MAX(W$189:$W194)+1,0))","v":{"$error":"#N/A"}},{"$error":"#N/A"},null,{"$error":"#N/A"},{"$error":"#N/A"},{"$error":"#N/A"},null,{"$error":"#N/A"},{"$error":"#N/A"},{"$error":"#N/A"},null,{"$error":"#N/A"},{"$error":"#N/A"},{"$error":"#N/A"},null,{"$error":"#N/A"},{"$error":"#N/A"},{"$error":"#N/A"},null,null,{"$error":"#N/A"},{"$error":"#N/A"}]
[null,{"$error":"#N/A"},{"$f":"IFERROR(IF(GETPIVOTDATA(\"Value\",Pivots_LA!$A$6,\"Month\",$B196)=0,\"\",GETPIVOTDATA(\"Value\",Pivots_LA!$A$6,\"Month\",$B196)),NA())","v":{"$error":"#N/A"}},"",null,null,151261.83333333334,{"$error":"#N/A"},{"$error":"#N/A"},null,null,null,null,{"$error":"#N/A"},"",{"$f":"IF(O196=\"\",P195,AVERAGE(IF($O$190:O$214<>\"\",$O$190:O$214)))","v":"Cumul. Moving Avg."},16859.080000000002,{"$error":"#VALUE!"},null,null,null,null,{"$f":"IF($D$188>5,NA(),IF(C196>H196,MAX(W$189:$W195)+1,0))","v":{"$error":"#N/A"}},{"$f":"IF($D$188>5,NA(),IF(C196<I196,MAX(W$189:$W195)+1,0))","v":{"$error":"#N/A"}},{"$error":"#N/A"},null,{"$error":"#N/A"},{"$error":"#N/A"},{"$error":"#N/A"},null,{"$error":"#N/A"},{"$error":"#N/A"},{"$error":"#N/A"},null,{"$error":"#N/A"},{"$error":"#N/A"},{"$error":"#N/A"},null,{"$error":"#N/A"},{"$error":"#N/A"},{"$error":"#N/A"},null,null,{"$error":"#N/A"},{"$error":"#N/A"}]
[null,{"$error":"#N/A"},{"$f":"IFERROR(IF(GETPIVOTDATA(\"Value\",Pivots_LA!$A$6,\"Month\",$B197)=0,\"\",GETPIVOTDATA(\"Value\",Pivots_LA!$A$6,\"Month\",$B197)),NA())","v":{"$error":"#N/A"}},"",null,null,151261.83333333334,{"$error":"#N/A"},{"$error":"#N/A"},null,null,null,null,{"$error":"#N/A"},"",{"$f":"IF(O197=\"\",P196,AVERAGE(IF($O$190:O$214<>\"\",$O$190:O$214)))","v":"Cumul. Moving Avg."},16859.080000000002,{"$error":"#VALUE!"},null,null,null,null,{"$f":"IF($D$188>5,NA(),IF(C197>H197,MAX(W$189:$W196)+1,0))","v":{"$error":"#N/A"}},{"$f":"IF($D$188>5,NA(),IF(C197<I197,MAX(W$189:$W196)+1,0))","v":{"$error":"#N/A"}},{"$error":"#N/A"},null,{"$error":"#N/A"},{"$error":"#N/A"},{"$error":"#N/A"},null,{"$error":"#N/A"},{"$error":"#N/A"},{"$error":"#N/A"},null,{"$error":"#N/A"},{"$error":"#N/A"},{"$error":"#N/A"},null,{"$error":"#N/A"},{"$error":"#N/A"},{"$error":"#N/A"},null,null,{"$error":"#N/A"},{"$error":"#N/A"}]
[null,{"$error":"#N/A"},{"$f":"IFERROR(IF(GETPIVOTDATA(\"Value\",Pivots_LA!$A$6,\"Month\",$B198)=0,\"\",GETPIVOTDATA(\"Value\",Pivots_LA!$A$6,\"Month\",$B198)),NA())","v":{"$error":"#N/A"}},"",null,null,151261.83333333334,{"$error":"#N/A"},{"$error":"#N/A"},null,null,null,null,{"$error":"#N/A"},"",{"$f":"IF(O198=\"\",P197,AVERAGE(IF($O$190:O$214<>\"\",$O$190:O$214)))","v":"Cumul. Moving Avg."},16859.080000000002,{"$error":"#VALUE!"},null,null,null,null,{"$f":"IF($D$188>5,NA(),IF(C198>H198,MAX(W$189:$W197)+1,0))","v":{"$error":"#N/A"}},{"$f":"IF($D$188>5,NA(),IF(C198<I198,MAX(W$189:$W197)+1,0))","v":{"$error":"#N/A"}},{"$error":"#N/A"},null,{"$error":"#N/A"},{"$error":"#N/A"},{"$error":"#N/A"},null,{"$error":"#N/A"},{"$error":"#N/A"},{"$error":"#N/A"},null,{"$error":"#N/A"},{"$error":"#N/A"},{"$error":"#N/A"},null,{"$error":"#N/A"},{"$error":"#N/A"},{"$error":"#N/A"},null,null,{"$error":"#N/A"},{"$error":"#N/A"}]
[null,{"$error":"#N/A"},{"$f":"IFERROR(IF(GETPIVOTDATA(\"Value\",Pivots_LA!$A$6,\"Month\",$B199)=0,\"\",GETPIVOTDATA(\"Value\",Pivots_LA!$A$6,\"Month\",$B199)),NA())","v":{"$error":"#N/A"}},"",null,null,151261.83333333334,{"$error":"#N/A"},{"$error":"#N/A"},null,null,null,null,{"$error":"#N/A"},"",{"$f":"IF(O199=\"\",P198,AVERAGE(IF($O$190:O$214<>\"\",$O$190:O$214)))","v":"Cumul. Moving Avg."},16859.080000000002,{"$error":"#VALUE!"},null,null,null,null,{"$f":"IF($D$188>5,NA(),IF(C199>H199,MAX(W$189:$W198)+1,0))","v":{"$error":"#N/A"}},{"$f":"IF($D$188>5,NA(),IF(C199<I199,MAX(W$189:$W198)+1,0))","v":{"$error":"#N/A"}},{"$error":"#N/A"},null,{"$error":"#N/A"},{"$error":"#N/A"},{"$error":"#N/A"},null,{"$error":"#N/A"},{"$error":"#N/A"},{"$error":"#N/A"},null,{"$error":"#N/A"},{"$error":"#N/A"},{"$error":"#N/A"},null,{"$error":"#N/A"},{"$error":"#N/A"},{"$error":"#N/A"},null,null,{"$error":"#N/A"},{"$error":"#N/A"}]
[null,{"$error":"#N/A"},{"$f":"IFERROR(IF(GETPIVOTDATA(\"Value\",Pivots_LA!$A$6,\"Month\",$B200)=0,\"\",GETPIVOTDATA(\"Value\",Pivots_LA!$A$6,\"Month\",$B200)),NA())","v":{"$error":"#N/A"}},"",null,null,151261.83333333334,{"$error":"#N/A"},{"$error":"#N/A"},null,null,null,null,{"$error":"#N/A"},"",{"$f":"IF(O200=\"\",P199,AVERAGE(IF($O$190:O$214<>\"\",$O$190:O$214)))","v":"Cumul. Moving Avg."},16859.080000000002,{"$error":"#VALUE!"},null,null,null,null,{"$f":"IF($D$188>5,NA(),IF(C200>H200,MAX(W$189:$W199)+1,0))","v":{"$error":"#N/A"}},{"$f":"IF($D$188>5,NA(),IF(C200<I200,MAX(W$189:$W199)+1,0))","v":{"$error":"#N/A"}},{"$error":"#N/A"},null,{"$error":"#N/A"},{"$error":"#N/A"},{"$error":"#N/A"},null,{"$error":"#N/A"},{"$error":"#N/A"},{"$error":"#N/A"},null,{"$error":"#N/A"},{"$error":"#N/A"},{"$error":"#N/A"},null,{"$error":"#N/A"},{"$error":"#N/A"},{"$error":"#N/A"},null,null,{"$error":"#N/A"},{"$error":"#N/A"}]
[null,{"$error":"#N/A"},{"$f":"IFERROR(IF(GETPIVOTDATA(\"Value\",Pivots_LA!$A$6,\"Month\",$B201)=0,\"\",GETPIVOTDATA(\"Value\",Pivots_LA!$A$6,\"Month\",$B201)),NA())","v":{"$error":"#N/A"}},"",null,null,151261.83333333334,{"$error":"#N/A"},{"$error":"#N/A"},null,null,null,null,{"$error":"#N/A"},"",{"$f":"IF(O201=\"\",P200,AVERAGE(IF($O$190:O$214<>\"\",$O$190:O$214)))","v":"Cumul. Moving Avg."},16859.080000000002,{"$error":"#VALUE!"},null,null,null,null,{"$f":"IF($D$188>5,NA(),IF(C201>H201,MAX(W$189:$W200)+1,0))","v":{"$error":"#N/A"}},{"$f":"IF($D$188>5,NA(),IF(C201<I201,MAX(W$189:$W200)+1,0))","v":{"$error":"#N/A"}},{"$error":"#N/A"},null,{"$error":"#N/A"},{"$error":"#N/A"},{"$error":"#N/A"},null,{"$error":"#N/A"},{"$error":"#N/A"},{"$error":"#N/A"},null,{"$error":"#N/A"},{"$error":"#N/A"},{"$error":"#N/A"},null,{"$error":"#N/A"},{"$error":"#N/A"},{"$error":"#N/A"},null,null,{"$error":"#N/A"},{"$error":"#N/A"}]
[null,{"$error":"#N/A"},{"$f":"IFERROR(IF(GETPIVOTDATA(\"Value\",Pivots_LA!$A$6,\"Month\",$B202)=0,\"\",GETPIVOTDATA(\"Value\",Pivots_LA!$A$6,\"Month\",$B202)),NA())","v":{"$error":"#N/A"}},"",null,null,151261.83333333334,{"$error":"#N/A"},{"$error":"#N/A"},null,null,null,null,{"$error":"#N/A"},"",{"$f":"IF(O202=\"\",P201,AVERAGE(IF($O$190:O$214<>\"\",$O$190:O$214)))","v":"Cumul. Moving Avg."},16859.080000000002,{"$error":"#VALUE!"},null,null,null,null,{"$f":"IF($D$188>5,NA(),IF(C202>H202,MAX(W$189:$W201)+1,0))","v":{"$error":"#N/A"}},{"$f":"IF($D$188>5,NA(),IF(C202<I202,MAX(W$189:$W201)+1,0))","v":{"$error":"#N/A"}},{"$error":"#N/A"},null,{"$error":"#N/A"},{"$error":"#N/A"},{"$error":"#N/A"},null,{"$error":"#N/A"},{"$error":"#N/A"},{"$error":"#N/A"},null,{"$error":"#N/A"},{"$error":"#N/A"},{"$error":"#N/A"},null,{"$error":"#N/A"},{"$error":"#N/A"},{"$error":"#N/A"},null,null,{"$error":"#N/A"},{"$error":"#N/A"}]
[null,{"$error":"#N/A"},{"$f":"IFERROR(IF(GETPIVOTDATA(\"Value\",Pivots_LA!$A$6,\"Month\",$B203)=0,\"\",GETPIVOTDATA(\"Value\",Pivots_LA!$A$6,\"Month\",$B203)),NA())","v":{"$error":"#N/A"}},"",null,null,151261.83333333334,{"$error":"#N/A"},{"$error":"#N/A"},null,null,null,null,{"$error":"#N/A"},"",{"$f":"IF(O203=\"\",P202,AVERAGE(IF($O$190:O$214<>\"\",$O$190:O$214)))","v":"Cumul. Moving Avg."},16859.080000000002,{"$error":"#VALUE!"},null,null,null,null,{"$f":"IF($D$188>5,NA(),IF(C203>H203,MAX(W$189:$W202)+1,0))","v":{"$error":"#N/A"}},{"$f":"IF($D$188>5,NA(),IF(C203<I203,MAX(W$189:$W202)+1,0))","v":{"$error":"#N/A"}},{"$error":"#N/A"},null,{"$error":"#N/A"},{"$error":"#N/A"},{"$error":"#N/A"},null,{"$error":"#N/A"},{"$error":"#N/A"},{"$error":"#N/A"},null,{"$error":"#N/A"},{"$error":"#N/A"},{"$error":"#N/A"},null,{"$error":"#N/A"},{"$error":"#N/A"},{"$error":"#N/A"},null,null,{"$error":"#N/A"},{"$error":"#N/A"}]
[null,{"$error":"#N/A"},{"$f":"IFERROR(IF(GETPIVOTDATA(\"Value\",Pivots_LA!$A$6,\"Month\",$B204)=0,\"\",GETPIVOTDATA(\"Value\",Pivots_LA!$A$6,\"Month\",$B204)),NA())","v":{"$error":"#N/A"}},"",null,null,151261.83333333334,{"$error":"#N/A"},{"$error":"#N/A"},null,null,null,null,{"$error":"#N/A"},"",{"$f":"IF(O204=\"\",P203,AVERAGE(IF($O$190:O$214<>\"\",$O$190:O$214)))","v":"Cumul. Moving Avg."},16859.080000000002,{"$error":"#VALUE!"},null,null,null,null,{"$f":"IF($D$188>5,NA(),IF(C204>H204,MAX(W$189:$W203)+1,0))","v":{"$error":"#N/A"}},{"$f":"IF($D$188>5,NA(),IF(C204<I204,MAX(W$189:$W203)+1,0))","v":{"$error":"#N/A"}},{"$error":"#N/A"},null,{"$error":"#N/A"},{"$error":"#N/A"},{"$error":"#N/A"},null,{"$error":"#N/A"},{"$error":"#N/A"},{"$error":"#N/A"},null,{"$error":"#N/A"},{"$error":"#N/A"},{"$error":"#N/A"},null,{"$error":"#N/A"},{"$error":"#N/A"},{"$error":"#N/A"},null,null,{"$error":"#N/A"},{"$error":"#N/A"}]
[null,{"$error":"#N/A"},{"$f":"IFERROR(IF(GETPIVOTDATA(\"Value\",Pivots_LA!$A$6,\"Month\",$B205)=0,\"\",GETPIVOTDATA(\"Value\",Pivots_LA!$A$6,\"Month\",$B205)),NA())","v":{"$error":"#N/A"}},"",null,null,151261.83333333334,{"$error":"#N/A"},{"$error":"#N/A"},null,null,null,null,{"$error":"#N/A"},"",{"$f":"IF(O205=\"\",P204,AVERAGE(IF($O$190:O$214<>\"\",$O$190:O$214)))","v":"Cumul. Moving Avg."},16859.080000000002,{"$error":"#VALUE!"},null,null,null,null,{"$f":"IF($D$188>5,NA(),IF(C205>H205,MAX(W$189:$W204)+1,0))","v":{"$error":"#N/A"}},{"$f":"IF($D$188>5,NA(),IF(C205<I205,MAX(W$189:$W204)+1,0))","v":{"$error":"#N/A"}},{"$error":"#N/A"},null,{"$error":"#N/A"},{"$error":"#N/A"},{"$error":"#N/A"},null,{"$error":"#N/A"},{"$error":"#N/A"},{"$error":"#N/A"},null,{"$error":"#N/A"},{"$error":"#N/A"},{"$error":"#N/A"},null,{"$error":"#N/A"},{"$error":"#N/A"},{"$error":"#N/A"},null,null,{"$error":"#N/A"},{"$error":"#N/A"}]
[null,{"$error":"#N/A"},{"$f":"IFERROR(IF(GETPIVOTDATA(\"Value\",Pivots_LA!$A$6,\"Month\",$B206)=0,\"\",GETPIVOTDATA(\"Value\",Pivots_LA!$A$6,\"Month\",$B206)),NA())","v":{"$error":"#N/A"}},"",null,null,151261.83333333334,{"$error":"#N/A"},{"$error":"#N/A"},null,null,null,null,{"$error":"#N/A"},"",{"$f":"IF(O206=\"\",P205,AVERAGE(IF($O$190:O$214<>\"\",$O$190:O$214)))","v":"Cumul. Moving Avg."},16859.080000000002,{"$error":"#VALUE!"},null,null,null,null,{"$f":"IF($D$188>5,NA(),IF(C206>H206,MAX(W$189:$W205)+1,0))","v":{"$error":"#N/A"}},{"$f":"IF($D$188>5,NA(),IF(C206<I206,MAX(W$189:$W205)+1,0))","v":{"$error":"#N/A"}},{"$error":"#N/A"},null,{"$error":"#N/A"},{"$error":"#N/A"},{"$error":"#N/A"},null,{"$error":"#N/A"},{"$error":"#N/A"},{"$error":"#N/A"},null,{"$error":"#N/A"},{"$error":"#N/A"},{"$error":"#N/A"},null,{"$error":"#N/A"},{"$error":"#N/A"},{"$error":"#N/A"},null,null,{"$error":"#N/A"},{"$error":"#N/A"}]
[null,{"$error":"#N/A"},{"$f":"IFERROR(IF(GETPIVOTDATA(\"Value\",Pivots_LA!$A$6,\"Month\",$B207)=0,\"\",GETPIVOTDATA(\"Value\",Pivots_LA!$A$6,\"Month\",$B207)),NA())","v":{"$error":"#N/A"}},"",null,null,151261.83333333334,{"$error":"#N/A"},{"$error":"#N/A"},null,null,null,null,{"$error":"#N/A"},"",{"$f":"IF(O207=\"\",P206,AVERAGE(IF($O$190:O$214<>\"\",$O$190:O$214)))","v":"Cumul. Moving Avg."},16859.080000000002,{"$error":"#VALUE!"},null,null,null,null,{"$f":"IF($D$188>5,NA(),IF(C207>H207,MAX(W$189:$W206)+1,0))","v":{"$error":"#N/A"}},{"$f":"IF($D$188>5,NA(),IF(C207<I207,MAX(W$189:$W206)+1,0))","v":{"$error":"#N/A"}},{"$error":"#N/A"},null,{"$error":"#N/A"},{"$error":"#N/A"},{"$error":"#N/A"},null,{"$error":"#N/A"},{"$error":"#N/A"},{"$error":"#N/A"},null,{"$error":"#N/A"},{"$error":"#N/A"},{"$error":"#N/A"},null,{"$error":"#N/A"},{"$error":"#N/A"},{"$error":"#N/A"},null,null,{"$error":"#N/A"},{"$error":"#N/A"}]
[null,{"$error":"#N/A"},{"$f":"IFERROR(IF(GETPIVOTDATA(\"Value\",Pivots_LA!$A$6,\"Month\",$B208)=0,\"\",GETPIVOTDATA(\"Value\",Pivots_LA!$A$6,\"Month\",$B208)),NA())","v":{"$error":"#N/A"}},"",null,null,151261.83333333334,{"$error":"#N/A"},{"$error":"#N/A"},null,null,null,null,{"$error":"#N/A"},"",{"$f":"IF(O208=\"\",P207,AVERAGE(IF($O$190:O$214<>\"\",$O$190:O$214)))","v":"Cumul. Moving Avg."},16859.080000000002,{"$error":"#VALUE!"},null,null,null,null,{"$f":"IF($D$188>5,NA(),IF(C208>H208,MAX(W$189:$W207)+1,0))","v":{"$error":"#N/A"}},{"$f":"IF($D$188>5,NA(),IF(C208<I208,MAX(W$189:$W207)+1,0))","v":{"$error":"#N/A"}},{"$error":"#N/A"},null,{"$error":"#N/A"},{"$error":"#N/A"},{"$error":"#N/A"},null,{"$error":"#N/A"},{"$error":"#N/A"},{"$error":"#N/A"},null,{"$error":"#N/A"},{"$error":"#N/A"},{"$error":"#N/A"},null,{"$error":"#N/A"},{"$error":"#N/A"},{"$error":"#N/A"},null,null,{"$error":"#N/A"},{"$error":"#N/A"}]
[null,"2019-09-01",{"$f":"IFERROR(IF(GETPIVOTDATA(\"Value\",Pivots_LA!$A$6,\"Month\",$B209)=0,\"\",GETPIVOTDATA(\"Value\",Pivots_LA!$A$6,\"Month\",$B209)),NA())","v":148346},148346,null,null,151261.83333333334,{"$error":"#N/A"},{"$error":"#N/A"},null,null,null,null,"2019-09-01","",{"$f":"IF(O209=\"\",P208,AVERAGE(IF($O$190:O$214<>\"\",$O$190:O$214)))","v":"Cumul. Moving Avg."},16859.080000000002,{"$error":"#VALUE!"},null,null,null,null,{"$f":"IF($D$188>5,NA(),IF(C209>H209,MAX(W$189:$W208)+1,0))","v":{"$error":"#N/A"}},{"$f":"IF($D$188>5,NA(),IF(C209<I209,MAX(W$189:$W208)+1,0))","v":{"$error":"#N/A"}},{"$error":"#N/A"},null,{"$error":"#N/A"},{"$error":"#N/A"},{"$error":"#N/A"},null,{"$error":"#N/A"},{"$error":"#N/A"},{"$error":"#N/A"},null,{"$error":"#N/A"},{"$error":"#N/A"},{"$error":"#N/A"},null,{"$error":"#N/A"},{"$error":"#N/A"},{"$error":"#N/A"},null,null,{"$error":"#N/A"},{"$error":"#N/A"}]
[null,"2019-10-01",{"$f":"IFERROR(IF(GETPIVOTDATA(\"Value\",Pivots_LA!$A$6,\"Month\",$B210)=0,\"\",GETPIVOTDATA(\"Value\",Pivots_LA!$A$6,\"Month\",$B210)),NA())","v":152522},152522,null,null,151261.83333333334,{"$error":"#N/A"},{"$error":"#N/A"},null,null,null,null,"2019-10-01",4176,{"$f":"IF(O210=\"\",P209,AVERAGE(IF($O$190:O$214<>\"\",$O$190:O$214)))","v":6338},16859.080000000002,20725.259999999998,null,null,null,null,{"$f":"IF($D$188>5,NA(),IF(C210>H210,MAX(W$189:$W209)+1,0))","v":{"$error":"#N/A"}},{"$f":"IF($D$188>5,NA(),IF(C210<I210,MAX(W$189:$W209)+1,0))","v":{"$error":"#N/A"}},{"$error":"#N/A"},null,{"$error":"#N/A"},{"$f":"IFERROR(IF(AND(AB209=1,AA210=1),1,IF(SUM(AA210:AA215)>=7,1,0)),NA())","v":{"$error":"#N/A"}},{"$error":"#N/A"},null,{"$error":"#N/A"},{"$f":"IFERROR(IF(AND(AF209=1,AE210=1),1,IF(SUM(AE210:AE215)>=7,1,0)),NA())","v":{"$error":"#N/A"}},{"$error":"#N/A"},null,{"$error":"#N/A"},{"$f":"IFERROR(IF(AND(AJ209=1,AI210=1),1,IF(SUM(AI210:AI215)>=7,1,0)),NA())","v":{"$error":"#N/A"}},{"$error":"#N/A"},null,{"$error":"#N/A"},{"$f":"IFERROR(IF(AND(AN209=1,AM210=1),1,IF(SUM(AM210:AM215)>=7,1,0)),NA())","v":{"$error":"#N/A"}},{"$error":"#N/A"},null,null,{"$error":"#N/A"},{"$error":"#N/A"}]
[null,"2019-11-01",{"$f":"IFERROR(IF(GETPIVOTDATA(\"Value\",Pivots_LA!$A$6,\"Month\",$B211)=0,\"\",GETPIVOTDATA(\"Value\",Pivots_LA!$A$6,\"Month\",$B211)),NA())","v":144966},144966,null,null,151261.83333333334,{"$error":"#N/A"},{"$error":"#N/A"},null,null,null,null,"2019-11-01",7556,{"$f":"IF(O211=\"\",P210,AVERAGE(IF($O$190:O$214<>\"\",$O$190:O$214)))","v":6338},16859.080000000002,20725.259999999998,null,null,null,null,{"$f":"IF($D$188>5,NA(),IF(C211>H211,MAX(W$189:$W210)+1,0))","v":{"$error":"#N/A"}},{"$f":"IF($D$188>5,NA(),IF(C211<I211,MAX(W$189:$W210)+1,0))","v":{"$error":"#N/A"}},{"$error":"#N/A"},null,{"$error":"#N/A"},{"$f":"IFERROR(IF(AND(AB210=1,AA211=1),1,IF(SUM(AA211:AA215)>=7,1,0)),NA())","v":{"$error":"#N/A"}},{"$error":"#N/A"},null,{"$error":"#N/A"},{"$f":"IFERROR(IF(AND(AF210=1,AE211=1),1,IF(SUM(AE211:AE215)>=7,1,0)),NA())","v":{"$error":"#N/A"}},{"$error":"#N/A"},null,{"$error":"#N/A"},{"$f":"IFERROR(IF(AND(AJ210=1,AI211=1),1,IF(SUM(AI211:AI215)>=7,1,0)),NA())","v":{"$error":"#N/A"}},{"$error":"#N/A"},null,{"$error":"#N/A"},{"$f":"IFERROR(IF(AND(AN210=1,AM211=1),1,IF(SUM(AM211:AM215)>=7,1,0)),NA())","v":{"$error":"#N/A"}},{"$error":"#N/A"},null,null,{"$error":"#N/A"},{"$error":"#N/A"}]
[null,"2019-12-01",{"$f":"IFERROR(IF(GETPIVOTDATA(\"Value\",Pivots_LA!$A$6,\"Month\",$B212)=0,\"\",GETPIVOTDATA(\"Value\",Pivots_LA!$A$6,\"Month\",$B212)),NA())","v":147177},147177,null,null,151261.83333333334,{"$error":"#N/A"},{"$error":"#N/A"},null,null,null,null,"2019-12-01",{"$f":"IF(D211=\"\",\"\",IF(D212=\"\",\"\",ABS(D211-D212)))","v":2211},{"$f":"IF(O212=\"\",P211,AVERAGE(IF($O$190:O$214<>\"\",$O$190:O$214)))","v":6338},16859.080000000002,20725.259999999998,null,null,null,null,{"$f":"IF($D$188>5,NA(),IF(C212>H212,MAX(W$189:$W211)+1,0))","v":{"$error":"#N/A"}},{"$f":"IF($D$188>5,NA(),IF(C212<I212,MAX(W$189:$W211)+1,0))","v":{"$error":"#N/A"}},{"$error":"#N/A"},null,{"$error":"#N/A"},{"$f":"IFERROR(IF(AND(AB211=1,AA212=1),1,IF(SUM(AA212:AA215)>=7,1,0)),NA())","v":{"$error":"#N/A"}},{"$error":"#N/A"},null,{"$error":"#N/A"},{"$f":"IFERROR(IF(AND(AF211=1,AE212=1),1,IF(SUM(AE212:AE215)>=7,1,0)),NA())","v":{"$error":"#N/A"}},{"$error":"#N/A"},null,{"$error":"#N/A"},{"$f":"IFERROR(IF(AND(AJ211=1,AI212=1),1,IF(SUM(AI212:AI215)>=7,1,0)),NA())","v":{"$error":"#N/A"}},{"$error":"#N/A"},null,{"$error":"#N/A"},{"$f":"IFERROR(IF(AND(AN211=1,AM212=1),1,IF(SUM(AM212:AM215)>=7,1,0)),NA())","v":{"$error":"#N/A"}},{"$error":"#N/A"},null,null,{"$error":"#N/A"},{"$error":"#N/A"}]
[null,"2020-01-01",{"$f":"IFERROR(IF(GETPIVOTDATA(\"Value\",Pivots_LA!$A$6,\"Month\",$B213)=0,\"\",GETPIVOTDATA(\"Value\",Pivots_LA!$A$6,\"Month\",$B213)),NA())","v":159828},159828,null,null,151261.83333333334,{"$error":"#N/A"},{"$error":"#N/A"},null,null,null,null,"2020-01-01",12651,{"$f":"IF(O213=\"\",P212,AVERAGE(IF($O$190:O$214<>\"\",$O$190:O$214)))","v":6338},16859.080000000002,20725.259999999998,null,null,null,null,{"$f":"IF($D$188>5,NA(),IF(C213>H213,MAX(W$189:$W212)+1,0))","v":{"$error":"#N/A"}},{"$f":"IF($D$188>5,NA(),IF(C213<I213,MAX(W$189:$W212)+1,0))","v":{"$error":"#N/A"}},{"$error":"#N/A"},null,{"$error":"#N/A"},{"$f":"IFERROR(IF(AND(AB212=1,AA213=1),1,IF(SUM(AA213:AA215)>=7,1,0)),NA())","v":{"$error":"#N/A"}},{"$error":"#N/A"},null,{"$error":"#N/A"},{"$f":"IFERROR(IF(AND(AF212=1,AE213=1),1,IF(SUM(AE213:AE215)>=7,1,0)),NA())","v":{"$error":"#N/A"}},{"$error":"#N/A"},null,{"$error":"#N/A"},{"$f":"IFERROR(IF(AND(AJ212=1,AI213=1),1,IF(SUM(AI213:AI215)>=7,1,0)),NA())","v":{"$error":"#N/A"}},{"$error":"#N/A"},null,{"$error":"#N/A"},{"$f":"IFERROR(IF(AND(AN212=1,AM213=1),1,IF(SUM(AM213:AM215)>=7,1,0)),NA())","v":{"$error":"#N/A"}},{"$error":"#N/A"},null,null,{"$error":"#N/A"},{"$error":"#N/A"}]
[null,"2020-02-01",{"$f":"IFERROR(IF(GETPIVOTDATA(\"Value\",Pivots_LA!$A$6,\"Month\",$B214)=0,\"\",GETPIVOTDATA(\"Value\",Pivots_LA!$A$6,\"Month\",$B214)),NA())","v":154732},154732,null,null,151261.83333333334,{"$f":"IF($D$188>5,NA(),IF(D214=\"\",H213,G214+Q214))","v":{"$error":"#N/A"}},{"$f":"IF($D$188>5,NA(),IF(D214=\"\",I213,G214-Q214))","v":{"$error":"#N/A"}},null,null,null,null,"2020-02-01",{"$f":"IF(D213=\"\",\"\",IF(D214=\"\",\"\",ABS(D213-D214)))","v":5096},{"$f":"IF(O214=\"\",P213,AVERAGE(IF($O$190:O$214<>\"\",$O$190:O$214)))","v":6338},{"$f":"IF(ISERROR((P214*2.66)),Q215,(P214*2.66))","v":16859.080000000002},{"$f":"$P214*3.27","v":20725.259999999998},null,null,null,null,{"$f":"IF($D$188>5,NA(),IF(C214>H214,MAX(W$189:$W213)+1,0))","v":{"$error":"#N/A"}},{"$f":"IF($D$188>5,NA(),IF(C214<I214,MAX(W$189:$W213)+1,0))","v":{"$error":"#N/A"}},{"$error":"#N/A"},null,{"$error":"#N/A"},{"$f":"IFERROR(IF(AND(AB213=1,AA214=1),1,IF(SUM(AA214:AA215)>=7,1,0)),NA())","v":{"$error":"#N/A"}},{"$error":"#N/A"},null,{"$error":"#N/A"},{"$f":"IFERROR(IF(AND(AF213=1,AE214=1),1,IF(SUM(AE214:AE215)>=7,1,0)),NA())","v":{"$error":"#N/A"}},{"$error":"#N/A"},null,{"$error":"#N/A"},{"$f":"IFERROR(IF(AND(AJ213=1,AI214=1),1,IF(SUM(AI214:AI215)>=7,1,0)),NA())","v":{"$error":"#N/A"}},{"$error":"#N/A"},null,{"$error":"#N/A"},{"$f":"IFERROR(IF(AND(AN213=1,AM214=1),1,IF(SUM(AM214:AM215)>=7,1,0)),NA())","v":{"$error":"#N/A"}},{"$error":"#N/A"},null,null,{"$f":"IF(OR(W214>0,AB214>0,AJ214>0),C214,NA())","v":{"$error":"#N/A"}},{"$error":"#N/A"}]

{"sheet":"Pivots","index":5,"n_rows":34,"n_cols":13,"rows_kept":34,"cut":false,"hidden":true,"merged":[]}
["Org name","(All)"]
["Org code","(All)"]
["Type","(All)"]
["Source of delayed days","(All)"]
["Region","(All)"]
[]
["Sum of Value","Column Labels"]
["Row Labels","A) Awaiting completion of assessment","B) Awaiting public funding","C) Awaiting further non-acute NHS care (including intermediate care, rehabilitation services etc)","Di) Awaiting residential home placement or availability","Dii) Awaiting nursing home placement or availability","E) Awaiting care package in own home","F) Awaiting community equipment and adaptations","G) Patient or family choice","H) Disputes","I) Housing – patients not covered by NHS Care Act","O) Other","Grand Total"]
["2018-02-01",17748,4454,24647,16602,19461,30876,3790,16081,1434,4684,587,140364]
["2018-03-01",18643,4981,29316,17869,20569,33504,4200,17529,1402,5563,918,154494]
["2018-04-01",16858,4843,26700,16818,19803,29458,4946,18036,1136,5677,1072,145347]
["2018-05-01",16111,4965,24841,16353,19173,27442,4258,18314,1290,5832,1233,139812]
["2018-06-01",15083,4981,22953,15652,18511,27978,4172,17693,1209,5490,1366,135088]
["2018-07-01",15807,4943,24166,16868,19331,30570,3800,17509,1189,5484,1271,140938]
["2018-08-01",16740,4393,24797,17903,20672,31577,3831,18363,1193,6247,1150,146866]
["2018-09-01",17079,3983,22400,17435,21063,31080,4106,18383,1103,6047,1916,144595]
["2018-10-01",16538,4181,22411,18128,21062,30807,4199,19285,1098,6493,2408,146610]
["2018-11-01",13739,4067,21587,17653,19943,28822,3855,16488,1064,6687,2278,136183]
["2018-12-01",13983,3586,21361,16861,18394,27550,3421,15131,857,5757,1898,128799]
["2019-01-01",15811,3621,24403,18172,17584,27733,3526,15850,935,5992,1801,135428]
["2019-02-01",14266,3268,24289,15805,17459,25350,3828,15109,1113,5124,1596,127207]
["2019-03-01",15422,3788,26458,17222,18380,28208,3936,16488,1307,5710,1857,138776]
["2019-04-01",15076,3994,25624,15865,17100,25051,3814,16223,892,5610,1524,130773]
["2019-05-01",17620,4214,26330,17221,17102,27789,4236,16805,863,5764,1471,139415]
["2019-06-01",15622,4028,24777,15801,17453,27719,3861,17394,971,5606,1857,135089]
["2019-07-01",16535,3881,25100,16138,19140,29889,3648,17397,869,5360,1946,139903]
["2019-08-01",17871,3932,24475,17964,20205,32173,4222,18438,1227,6452,1913,148872]
["2019-09-01",19611,4128,24587,17524,19644,32025,4171,18613,868,6222,1991,149384]
["2019-10-01",18437,4199,26023,18371,21881,31643,4557,17896,1174,6641,1700,152522]
["2019-11-01",18022,4517,25343,17214,20004,30375,4033,16536,1299,6410,2123,145876]
["2019-12-01",18399,3753,25704,18374,19344,31393,3925,16654,1235,7078,2242,148101]
["2020-01-01",20917,4228,29825,19327,19641,34456,4091,17052,1191,7696,2213,160637]
["2020-02-01",20214,4118,28717,17828,20452,32464,3977,16868,1044,8027,2008,155717]
["Grand Total",422152,105046,626834,430968,483371,745932,100403,430135,27963,151653,42339,3566796]

{"sheet":"Pivots_LA","index":6,"n_rows":355,"n_cols":13,"rows_kept":355,"cut":false,"hidden":true,"merged":[]}
["LA code","(All)"]
["LA_Name","(All)"]
["Type","(All)"]
["Source of delayed days","(All)"]
["Parent_Name","(All)"]
["Region","(All)"]
[]
["Sum of Value","Column Labels"]
["Row Labels","A) Awaiting completion of assessment","B) Awaiting public funding","Di) Awaiting residential home placement or availability","Dii) Awaiting nursing home placement or availability","E) Awaiting care package in own home","F) Awaiting community equipment and adaptations","G) Patient or family choice","H) Disputes","O) Other","C) Awaiting further non-acute NHS care (including intermediate care, rehabilitation services etc)","I) Housing – patients not covered by NHS Care Act","Grand Total"]
["2018-02-01",17748,4454,16602,19461,30876,3790,16081,1434,587,24647,4684,140364]
["2018-03-01",18643,4981,17869,20569,33504,4200,17529,1402,918,29316,5563,154494]
["2018-04-01",16858,4843,16818,19803,29458,4946,18036,1136,1072,26700,5677,145347]
["2018-05-01",16111,4965,16353,19173,27442,4258,18314,1290,1233,24841,5832,139812]
["2018-06-01",15083,4981,15652,18511,27978,4172,17693,1209,1366,22953,5490,135088]
["2018-07-01",15807,4943,16868,19331,30570,3800,17509,1189,1271,24166,5484,140938]
["2018-08-01",16740,4393,17903,20672,31577,3831,18363,1193,1150,24797,6247,146866]
["2018-09-01",17079,3983,17435,21063,31080,4106,18383,1103,1916,22400,6047,144595]
["2018-10-01",16538,4181,18128,21062,30807,4199,19285,1098,2408,22411,6493,146610]
["2018-11-01",13739,4067,17653,19943,28822,3855,16488,1064,2278,21587,6687,136183]
["2018-12-01",13983,3586,16861,18394,27550,3421,15131,857,1898,21361,5757,128799]
["2019-01-01",15811,3621,18172,17584,27733,3526,15850,935,1801,24403,5992,135428]
["2019-02-01",14266,3268,15805,17459,25350,3828,15109,1113,1596,24289,5124,127207]
["2019-03-01",15422,3788,17222,18380,28208,3936,16488,1307,1857,26458,5710,138776]
["2019-04-01",15076,3994,15865,17100,25051,3814,16223,892,1524,25624,5610,130773]
["2019-05-01",17379,4214,17178,16902,27428,4236,16734,863,1417,26157,5764,138272]
["2019-06-01",15461,4028,15715,17182,27404,3861,17340,971,1827,24654,5606,134049]
["2019-07-01",16350,3873,16105,18897,29601,3648,17276,869,1943,24947,5356,138865]
["2019-08-01",17697,3931,17893,20054,31886,4222,18333,1227,1895,24287,6436,147861]
["2019-09-01",19480,4126,17478,19432,31736,4171,18580,868,1991,24335,6149,148346]
["2019-10-01",18437,4199,18371,21881,31643,4557,17896,1174,1700,26023,6641,152522]
["2019-11-01",17952,4517,17148,19885,30071,4033,16505,1299,2090,25116,6350,144966]
["2019-12-01",18232,3743,18353,19251,31166,3925,16580,1235,2196,25463,7033,147177]
["2020-01-01",20796,4228,19306,19600,34257,4091,17004,1191,2181,29511,7663,159828]
["2020-02-01",20087,4112,17726,20286,32213,3977,16822,1044,2008,28473,7984,154732]
["Grand Total",420775,105019,430479,481875,743411,100403,429552,27963,42123,624919,151379,3557898]
[]
[]
[]
[]
[]
[]
[]
[]
[]
[]
["Row Labels"]
["Barking & Dagenham"]
["716"]
["Barnet"]
["717"]
["Barnsley"]
["204"]
["Bath & North East Somerset UA"]
["908"]
["Bedford"]
["00KB"]
["Bexley"]
["718"]
["Birmingham"]
["406"]
["Blackburn With Darwen UA"]
["324"]
["Blackpool UA"]
["325"]
["Bolton"]
["304"]
["Bournemouth UA"]
["810"]
["Bracknell Forest UA"]
["614"]
["Bradford"]
["209"]
["Brent"]
["719"]
["Brighton & Hove UA"]
["816"]
["Bristol UA"]
["909"]
["Bromley"]
["720"]
["Buckinghamshire"]
["612"]
["Bury"]
["305"]
["Calderdale"]
["210"]
["Cambridgeshire"]
["623"]
["Camden"]
["702"]
["Central Bedfordshire"]
["00KC"]
["Cheshire East"]
["00EQ"]
["Cheshire West And Chester"]
["00EW"]
["City Of London"]
["714"]
["Cornwall"]
["902"]
["Coventry"]
["407"]
["Croydon"]
["721"]
["Cumbria"]
["102"]
["Darlington UA"]
["117"]
["Derby UA"]
["507"]
["Derbyshire"]
["506"]
["Devon"]
["912"]
["Doncaster"]
["205"]
["Dorset"]
["809"]
["Dudley"]
["408"]
["Durham"]
["116"]
["Ealing"]
["722"]
["East Riding Of Yorkshire UA"]
["214"]
["East Sussex"]
["815"]
["Enfield"]
["723"]
["Essex"]
["620"]
["Gateshead"]
["106"]
["Gloucestershire"]
["904"]
["Greenwich"]
["703"]
["Hackney"]
["704"]
["Halton UA"]
["321"]
["Hammersmith & Fulham"]
["705"]
["Hampshire"]
["812"]
["Haringey"]
["724"]
["Harrow"]
["725"]
["Hartlepool UA"]
["111"]
["Havering"]
["726"]
["Herefordshire UA"]
["415"]
["Hertfordshire"]
["606"]
["Hillingdon"]
["727"]
["Hounslow"]
["728"]
["Isle Of Wight UA"]
["803"]
["Islington"]
["706"]
["Kensington & Chelsea"]
["707"]
["Kent"]
["820"]
["Kingston Upon Hull UA"]
["215"]
["Kingston Upon Thames"]
["729"]
["Kirklees"]
["211"]
["Knowsley"]
["315"]
["Lambeth"]
["708"]
["Lancashire"]
["323"]
["Leeds"]
["212"]
["Leicester UA"]
["509"]
["Leicestershire"]
["508"]
["Lewisham"]
["709"]
["Lincolnshire"]
["503"]
["Liverpool"]
["316"]
["Luton UA"]
["611"]
["Manchester"]
["306"]
["Medway Towns UA"]
["821"]
["Merton"]
["730"]
["Middlesbrough UA"]
["112"]
["Milton Keynes UA"]
["613"]
["Newcastle Upon Tyne"]
["107"]
["Newham"]
["731"]
["Norfolk"]
["607"]
["North East Lincolnshire UA"]
["216"]
["North Lincolnshire UA"]
["217"]
["North Somerset UA"]
["910"]
["North Tyneside"]
["108"]
["North Yorkshire"]
["218"]
["Northamptonshire"]
["504"]
["Northumberland"]
["104"]
["Nottingham UA"]
["512"]
["Nottinghamshire"]
["511"]
["Oldham"]
["307"]
["Oxfordshire"]
["608"]
["Peterborough UA"]
["624"]
["Plymouth UA"]
["913"]
["Poole UA"]
["811"]
["Portsmouth UA"]
["813"]
["Reading UA"]
["616"]
["Redbridge"]
["732"]
["Redcar & Cleveland UA"]
["113"]
["Resident in Scotland"]
["9901"]
["Resident In Wales"]
["9900"]
["Resident outside GB"]
["9902"]
["Richmond Upon Thames"]
["733"]
["Rochdale"]
["308"]
["Rotherham"]
["206"]
["Rutland UA"]
["510"]
["Salford"]
["309"]
["Sandwell"]
["409"]
["Sefton"]
["317"]
["Sheffield"]
["207"]
["Shropshire"]
["417"]
["Slough UA"]
["617"]
["Solihull"]
["410"]
["Somerset"]
["905"]
["South Gloucestershire UA"]
["911"]
["South Tyneside"]
["109"]
["Southampton UA"]
["814"]
["Southend UA"]
["621"]
["Southwark"]
["710"]
["St Helens"]
["318"]
["Staffordshire"]
["413"]
["Stockport"]
["310"]
["Stockton On Tees UA"]
["114"]
["Stoke-On-Trent UA"]
["414"]
["Suffolk"]
["609"]
["Sunderland"]
["110"]
["Surrey"]
["805"]
["Sutton"]
["734"]
["Swindon UA"]
["819"]
["Tameside"]
["311"]
["Telford & Wrekin UA"]
["418"]
["Thurrock UA"]
["622"]
["Torbay UA"]
["914"]
["Tower Hamlets"]
["711"]
["Trafford"]
["312"]
["Wakefield"]
["213"]
["Walsall"]
["411"]
["Waltham Forest"]
["735"]
["Wandsworth"]
["712"]
["Warrington UA"]
["322"]
["Warwickshire"]
["404"]
["West Berkshire UA"]
["615"]
["West Sussex"]
["807"]
["Westminster"]
["713"]
["Wigan"]
["313"]
["Wiltshire"]
["817"]
["Windsor & Maidenhead UA"]
["618"]
["Wirral"]
["319"]
["Wokingham UA"]
["619"]
["Wolverhampton"]
["412"]
["Worcestershire"]
["416"]
["York UA"]
["219"]
["Grand Total"]

{"sheet":"ReferenceSheet","index":7,"n_rows":20,"n_cols":33,"rows_kept":20,"cut":false,"hidden":true,"merged":[]}
[null,"Reasons for Delay [do not delete]","LookupCharts"]
[1,"A) Awaiting completion of assessment",1]
[2,"B) Awaiting public funding",2]
[3,"C) Awaiting further non-acute NHS care",3]
[4,"Di) Awaiting residential home placement or availability",4]
[5,"Dii) Awaiting nursing home placement or availability",5]
[6,"E) Awaiting care package in own home",6]
[7,"F) Awaiting community equipment and adaptations",7]
[8,"G) Patient or family choice",8]
[9,"H) Disputes",9]
[10,"I) Housing – patients not covered by NHS and Community Care Act",10]
[11,"O) Other",11]
[]
[]
[]
[]
[]
[]
[]
[null,null,null,null,null,null,null,null,null,null,null,null,null,null,null,null,null,null,null,null,null,null,null,null,null,null,null,null,null,null,null,null,1]

{"sheet":"INFO","index":8,"n_rows":10,"n_cols":3,"rows_kept":10,"cut":false,"hidden":false,"merged":[[5,2,7,22]]}
[]
[]
[]
[]
[]
[null,null,"Information sheet"]
[]
[]
[]
[null,null,"Instructions for using the pivot table slicers"]