{"text_format":"1","workbook":"xlsx","n_sheets":6,"sheets":["Notes","Summary","STP","Trusts","Categories","BS"],"not_rendered":{"charts":0,"images":0,"macros":1,"external_links":1,"defined_names":14,"comments":0,"pivot_tables":0},"unopened":[],"bounds":{"document_bytes":16777216,"sheet_cells":100000,"rows_first":2000,"rows_last":500,"rows_between":2000,"halvings":0,"cell_chars":16384,"cell_head_chars":4096},"cells_cut":0,"cells_raw":0,"read":"whole","date_system":"1900"}

{"sheet":"Notes","index":0,"n_rows":2,"n_cols":8,"rows_kept":2,"cut":false,"hidden":false,"merged":[[1,1,1,4]]}
[]
[null,"Community Health Friends and Family Test (FFT) data - November 2021",null,null,null,null,null,"  Show data for:"]

{"sheet":"Summary","index":1,"n_rows":11,"n_cols":10,"rows_kept":11,"cut":false,"hidden":false,"merged":[[2,1,3,1],[2,4,2,5],[2,6,2,7],[2,8,2,9]]}
[]
[]
[null,"FFT","Number of organisations submitting","Total responses to date","Responses",null,"Percentage Positive",null,"Percentage Negative"]
[null,null,"2021-11-01","2021-11-01","2021-11-01","2021-10-27","2021-11-01","2021-10-27","2021-11-01","2021-10-27"]
[null,"Community Health Overall",145,7563224,78144,70513,0.93496621621621623,0.92814091018677403,3.1186015561015561E-2,3.7085360146355995E-2]
[null,"Community Inpatient Services",63,272501,2058,1834,0.94606413994169092,0.95365321701199568,1.4091350826044704E-2,1.2540894220283533E-2]
[null,"Community Nursing Services",88,934725,10055,10098,0.94490303331675785,0.94216676569617741,1.9293883639980108E-2,2.2380669439492969E-2]
[null,"Rehabilitation and Therapy Services",89,1419341,15128,11257,0.93257535695399263,0.93603979745935861,3.1530936012691697E-2,2.8249089455449943E-2]
[null,"Specialist Services",89,1692678,18920,17189,0.95882663847780125,0.95596020710919771,1.849894291754757E-2,2.0652743033335273E-2]
[null,"Children and Family Services",78,1168057,7827,5982,0.93675737830586436,0.9399866265463056,3.0663089306247605E-2,3.1260448010698764E-2]
[null,"Community Healthcare Other",89,2075922,24156,24153,0.91211293260473592,0.89392622034529867,4.7483026991223712E-2,6.2352502794683892E-2]

{"sheet":"STP","index":2,"n_rows":47,"n_cols":12,"rows_kept":47,"cut":false,"hidden":false,"merged":[[2,6,2,11],[2,0,3,0],[2,1,3,1],[2,2,3,2],[2,3,3,3],[2,4,3,4],[2,5,3,5]]}
[]
[]
["STP Code","STP Name","Total Responses","Total Eligible","Percentage Positive","Percentage Negative","Breakdown of Responses"]
[null,null,null,null,null,null,"Very Good","Good","Neither Good nor Poor","Poor","Very Poor","Don't Know"]
[null,"England (including Independent Sector Providers)",{"$f":"SUM('[1]Organisation Level'!M:M)","v":78144},{"$f":"SUM('[1]Organisation Level'!N:N)","v":2737735},{"$f":"SUM(G5:H5)/SUM(G5:L5)","v":0.93496621621621623},{"$f":"SUM(J5:K5)/SUM(G5:L5)","v":3.1186015561015561E-2},{"$f":"SUM('[1]Organisation Level'!G:G)","v":59716},{"$f":"SUM('[1]Organisation Level'!H:H)","v":13346},{"$f":"SUM('[1]Organisation Level'!I:I)","v":2059},{"$f":"SUM('[1]Organisation Level'!J:J)","v":1020},{"$f":"SUM('[1]Organisation Level'!K:K)","v":1417},{"$f":"SUM('[1]Organisation Level'!L:L)","v":586}]
[null,"England (excluding Independent Sector Providers)",{"$f":"SUMIF('[1]Organisation Level'!$P:$P, \"<>zIS1\", '[1]Organisation Level'!M:M)","v":56193},{"$f":"SUMIF('[1]Organisation Level'!$P:$P, \"<>zIS1\", '[1]Organisation Level'!N:N)","v":2286978},{"$f":"SUM(G6:H6)/SUM(G6:L6)","v":0.94476180307155699},{"$f":"SUM(J6:K6)/SUM(G6:L6)","v":2.4967522645169327E-2},{"$f":"SUMIF('[1]Organisation Level'!$P:$P, \"<>zIS1\", '[1]Organisation Level'!G:G)","v":43541},{"$f":"SUMIF('[1]Organisation Level'!$P:$P, \"<>zIS1\", '[1]Organisation Level'!H:H)","v":9548},{"$f":"SUMIF('[1]Organisation Level'!$P:$P, \"<>zIS1\", '[1]Organisation Level'!I:I)","v":1283},{"$f":"SUMIF('[1]Organisation Level'!$P:$P, \"<>zIS1\", '[1]Organisation Level'!J:J)","v":607},{"$f":"SUMIF('[1]Organisation Level'!$P:$P, \"<>zIS1\", '[1]Organisation Level'!K:K)","v":796},{"$f":"SUMIF('[1]Organisation Level'!$P:$P, \"<>zIS1\", '[1]Organisation Level'!L:L)","v":418}]
[null,"Selection (excluding suppressed data)",{"$f":"SUBTOTAL(9,C8:C340)","v":78144},{"$f":"SUBTOTAL(9,D8:D340)","v":2737735},{"$f":"IFERROR((G7+H7)/SUM(G7:L7), \"-\")","v":0.93493290996619893},{"$f":"IFERROR((J7+K7)/SUM(G7:L7), \"-\")","v":3.1201987094130901E-2},{"$f":"SUBTOTAL(9,G8:G340)","v":59679},{"$f":"SUBTOTAL(9,H8:H340)","v":13343},2059,1020,1417,586]
["QE1","HEALTHIER LANCASHIRE AND SOUTH CUMBRIA",3083,132689,0.95329224781057409,1.7191047680830358E-2,2553,386,51,25,28,40]
["QF7","SOUTH YORKSHIRE AND BASSETLAW STP",774,146612,0.94444444444444442,2.3255813953488372E-2,664,67,23,7,11,2]
["QGH","HEREFORDSHIRE AND WORCESTERSHIRE STP",233,18545,0.93133047210300424,3.4334763948497854E-2,193,24,5,2,6,3]
["QH8","MID AND SOUTH ESSEX STP",10,17718,1,0,"*","*","*","*","*","*"]
["QHL","BIRMINGHAM AND SOLIHULL STP",1011,65792,0.95548961424332346,2.4727992087042534E-2,842,124,14,9,16,6]
["QHM","CUMBRIA AND NORTH EAST STP",1986,123646,0.96424974823766363,1.7119838872104734E-2,1708,207,32,18,16,5]
["QJ2","JOINED UP CARE DERBYSHIRE STP",1324,38975,0.89123867069486407,4.0785498489425982E-2,916,264,78,26,28,12]
["QJG","SUFFOLK AND NORTH EAST ESSEX ICS",412,12386,0.95873786407766992,1.9417475728155338E-2,340,55,8,2,6,1]
["QJK","DEVON STP",378,40681,0.96296296296296291,1.0582010582010581E-2,328,36,6,2,2,4]
["QJM","LINCOLNSHIRE STP",1129,25999,0.82816651904340122,9.7431355181576612E-2,768,167,68,49,61,16]
["QK1","LEICESTER, LEICESTERSHIRE AND RUTLAND STP",2769,90665,0.86421090646442755,6.3921993499458291E-2,1887,506,143,64,113,56]
["QKK","OUR HEALTHIER SOUTH EAST LONDON STP",2236,50703,0.93112701252236141,2.6833631484794274E-2,1591,491,84,25,35,10]
["QKS","KENT AND MEDWAY STP",4385,65000,0.97879133409350061,6.6134549600912204E-3,3878,414,56,14,15,8]
{"$rows_left_out":28}
{"sheet":"Trusts","index":3,"n_rows":152,"n_cols":19,"rows_kept":152,"cut":false,"hidden":false,"merged":[[2,6,3,6],[2,7,2,12],[2,13,2,18],[2,0,3,0],[2,1,3,1],[2,2,3,2],[2,3,3,3],[2,4,3,4],[2,5,3,5]]}
[]
[]
["STP Code","Trust Code","Trust Name","Total Responses","Total Eligible","Percentage Positive","Percentage Negative","Breakdown of Responses",null,null,null,null,null,"Mode of Collection"]
[null,null,null,null,null,null,null,"Very Good","Good","Neither Good nor Poor","Poor","Very Poor","Don't Know","Mode SMS","Mode Electronic Discharge","Mode Paper Home","Mode Telephone","Mode Online","Mode Other"]
[null,null,"England (including Independent Sector Providers)",78144,2737735,0.93496621621621623,3.1186015561015561E-2,59716,13346,2059,1020,1417,586,22962,4521,21620,3925,22690,2426]
[null,null,"England (excluding Independent Sector Providers)",56193,2286978,0.94476180307155699,2.4967522645169327E-2,43541,9548,1283,607,796,418,16102,4420,15894,3611,13741,2425]
[null,null,"Selection (excluding suppressed data)",{"$f":"SUBTOTAL(9,D8:D294)","v":78144},{"$f":"SUBTOTAL(9,E8:E294)","v":2737735},{"$f":"IFERROR((H7+I7)/SUM(H7:M7), \"-\")","v":0.93575882760514029},{"$f":"IFERROR((K7+L7)/SUM(H7:M7), \"-\")","v":3.0996300315061509E-2},{"$f":"SUBTOTAL(9,H8:H294)","v":58534},13045,1975,991,1380,568,21367,4521,21618,3925,22636,2426]
["QE1","RXL","BLACKPOOL TEACHING HOSPITALS NHS FOUNDATION TRUST",916,22653,0.95851528384279472,2.1834061135371178E-2,781,97,16,12,8,2,131,0,478,0,307,0]
["QE1","RXR","EAST LANCASHIRE HOSPITALS NHS TRUST",664,49244,0.91265060240963858,3.1626506024096383E-2,486,120,16,8,13,21,402,0,193,21,48,0]
["QE1","RW5","LANCASHIRE & SOUTH CUMBRIA NHS FOUNDATION TRUST",752,55642,0.98404255319148937,3.9893617021276593E-3,684,56,8,2,1,1,0,0,0,0,752,0]
["QE1","RTX","UNIVERSITY HOSPITALS OF MORECAMBE BAY NHS FOUNDATION TRUST",751,5150,0.95206391478029295,1.1984021304926764E-2,602,113,11,3,6,16,504,0,0,247,0,0]
["QF7","RXE","ROTHERHAM DONCASTER AND SOUTH HUMBER NHS FOUNDATION TRUST",262,113185,0.99236641221374045,7.6335877862595417E-3,251,9,0,0,2,0,0,150,112,0,0,0]
["QF7","RCU","SHEFFIELD CHILDREN'S NHS FOUNDATION TRUST",112,6718,0.9642857142857143,8.9285714285714281E-3,102,6,3,1,0,0,0,0,0,0,112,0]
["QF7","RHQ","SHEFFIELD TEACHING HOSPITALS NHS FOUNDATION TRUST",266,1425,0.90225563909774431,4.5112781954887216E-2,197,43,12,5,7,2,128,0,38,0,87,13]
["QF7","RFR","THE ROTHERHAM NHS FOUNDATION TRUST",134,25284,0.91791044776119401,2.2388059701492536E-2,114,9,8,1,2,0,0,0,42,0,92,0]
["QGH","R1A","HEREFORDSHIRE AND WORCESTERSHIRE HEALTH AND CARE NHS TRUST",230,13217,0.93043478260869561,3.4782608695652174E-2,"*","*","*","*","*","*","*","*","*","*","*","*"]
["QGH","RLQ","WYE VALLEY NHS TRUST",3,5328,"*","*","*","*","*","*","*","*","*","*","*","*","*","*"]
["QH8","R1L","ESSEX PARTNERSHIP UNIVERSITY NHS FOUNDATION TRUST",10,17718,1,0,"*","*","*","*","*","*","*","*","*","*","*","*"]
["QHL","RYW","BIRMINGHAM COMMUNITY HEALTHCARE NHS FOUNDATION TRUST",985,60389,0.95431472081218272,2.5380710659898477E-2,817,123,14,9,16,6,1,0,612,0,372,0]
["QHL","RRK","UNIVERSITY HOSPITALS BIRMINGHAM NHS FOUNDATION TRUST",26,5403,1,0,25,1,0,0,0,0,0,0,26,0,0,0]
{"$rows_left_out":133}
{"sheet":"Categories","index":4,"n_rows":503,"n_cols":13,"rows_kept":503,"cut":false,"hidden":false,"merged":[[2,6,3,6],[2,7,2,12],[2,0,3,0],[2,1,3,1],[2,2,3,2],[2,3,3,3],[2,4,3,4],[2,5,3,5]]}
[]
[]
["STP Code","Trust Code","Trust Name","Service Category Provided","Total Responses","Percentage Positive","Percentage Negative","Breakdown of Responses"]
[null,null,null,null,null,null,null,"Very Good","Good","Neither Good nor Poor","Poor","Very Poor","Don't Know"]
[null,null,null,"England (including Independent Sector Providers)",78144,0.93496621621621623,3.1186015561015561E-2,59716,13346,2059,1020,1417,586]
[null,null,null,"England (excluding Independent Sector Providers)",56193,0.94476180307155699,2.4967522645169327E-2,43541,9548,1283,607,796,418]
[null,null,null,"Selection (excluding suppressed data)",{"$f":"SUBTOTAL(9,E8:E994)","v":78144},{"$f":"IFERROR((H7+I7)/SUM(H7:M7), \"-\")","v":0.93498195739617418},{"$f":"IFERROR((K7+L7)/SUM(H7:M7), \"-\")","v":3.1273846631400599E-2},{"$f":"SUBTOTAL(9,H8:H994)","v":59061},13229,2039,1015,1403,570]
["QE1","RXL","BLACKPOOL TEACHING HOSPITALS NHS FOUNDATION TRUST","Children & Family Services",17,0.94117647058823528,5.8823529411764705E-2,14,2,0,1,0,0]
["QE1","RXL","BLACKPOOL TEACHING HOSPITALS NHS FOUNDATION TRUST","Community Inpatient Services",44,0.95454545454545459,0,32,10,2,0,0,0]
["QE1","RXL","BLACKPOOL TEACHING HOSPITALS NHS FOUNDATION TRUST","Community Nursing Services",54,1,0,53,1,0,0,0,0]
["QE1","RXL","BLACKPOOL TEACHING HOSPITALS NHS FOUNDATION TRUST","Rehabilitation & Therapy Services",482,0.94605809128630702,2.9045643153526972E-2,406,50,10,8,6,2]
["QE1","RXL","BLACKPOOL TEACHING HOSPITALS NHS FOUNDATION TRUST","Specialist Services",319,0.97178683385579934,1.5673981191222569E-2,276,34,4,3,2,0]
["QE1","RXR","EAST LANCASHIRE HOSPITALS NHS TRUST","Children & Family Services",20,0.95,0,15,4,0,0,0,1]
["QE1","RXR","EAST LANCASHIRE HOSPITALS NHS TRUST","Community Healthcare Other",6,1,0,6,0,0,0,0,0]
["QE1","RXR","EAST LANCASHIRE HOSPITALS NHS TRUST","Community Inpatient Services",83,0.92771084337349397,0,57,20,0,0,0,6]
["QE1","RXR","EAST LANCASHIRE HOSPITALS NHS TRUST","Community Nursing Services",404,0.9133663366336634,3.4653465346534656E-2,296,73,12,5,9,9]
["QE1","RXR","EAST LANCASHIRE HOSPITALS NHS TRUST","Rehabilitation & Therapy Services",143,0.90909090909090906,4.195804195804196E-2,108,22,4,3,3,3]
["QE1","RXR","EAST LANCASHIRE HOSPITALS NHS TRUST","Specialist Services",8,0.625,0.125,4,1,0,0,1,2]
["QE1","RW5","LANCASHIRE & SOUTH CUMBRIA NHS FOUNDATION TRUST","Children & Family Services",12,0.91666666666666663,0,10,1,1,0,0,0]
["QE1","RW5","LANCASHIRE & SOUTH CUMBRIA NHS FOUNDATION TRUST","Community Inpatient Services",5,1,0,4,1,0,0,0,0]
{"$rows_left_out":484}
{"sheet":"BS","index":5,"n_rows":497,"n_cols":30,"rows_kept":497,"cut":false,"hidden":true,"merged":[]}
[null,"Sort","Region (LO) Code","Region (LO) name","Trust code","Trust name","Category",null,"Sort Lists:","Sort range…","Sort range…","Sort range…","Reference Region Lists:","Code…","Name…","Linked Region Lists:","Code…","Name…","Reference Lists:","Code…","Code…","Name…","Category…","Trusts Linked lists:","Code…","Name…","Categories Linked lists:","Code…","Name…","Category…"]
["Region (LO)",1,1,1,"-","-","-",null,null,"STP Code","STP Code","STP Code",null,"QE1","LANCASHIRE AND SOUTH CUMBRIA ICS",null,"QE1","LANCASHIRE AND SOUTH CUMBRIA ICS",null,"QE1","RXL","BLACKPOOL TEACHING HOSPITALS NHS FOUNDATION TRUST","Children & Family Services",null,"8HE44","AIREDALE NHS FOUNDATION TRUST",null,"8HE44","AIREDALE NHS FOUNDATION TRUST","Children & Family Services"]
["Trusts",1,1,1,1,1,"-",null,null,"STP Name","Trust Code","Trust Code",null,"QF7","SOUTH YORKSHIRE AND BASSETLAW STP",null,"QF7","SOUTH YORKSHIRE AND BASSETLAW STP",null,"QE1","RXL","BLACKPOOL TEACHING HOSPITALS NHS FOUNDATION TRUST","Community Inpatient Services",null,"8HN95","ALDER HEY CHILDREN'S NHS FOUNDATION TRUST",null,"8HN95","ALDER HEY CHILDREN'S NHS FOUNDATION TRUST","Community Healthcare Other"]
["Categories",1,1,1,1,1,1,null,null,"Total Responses","Trust Name","Trust Name",null,"QGH","HEREFORDSHIRE AND WORCESTERSHIRE STP",null,"QGH","HEREFORDSHIRE AND WORCESTERSHIRE STP",null,"QE1","RXL","BLACKPOOL TEACHING HOSPITALS NHS FOUNDATION TRUST","Community Nursing Services",null,"8J094","ALLIED HEALTH PROFESSIONALS SUFFOLK CIC",null,"8J094","ALLIED HEALTH PROFESSIONALS SUFFOLK CIC","Community Inpatient Services"]
[null,null,null,null,null,null,null,null,null,"Total Eligible","Total Responses","Category",null,"QH8","MID AND SOUTH ESSEX STP",null,"QH8","MID AND SOUTH ESSEX STP",null,"QE1","RXL","BLACKPOOL TEACHING HOSPITALS NHS FOUNDATION TRUST","Rehabilitation & Therapy Services",null,"ARA","BADGER LTD",null,"ARA","BADGER LTD","Community Nursing Services"]
[null,null,null,null,null,null,null,null,null,"Percentage Positive","Total Eligible","Total Responses",null,"QHL","BIRMINGHAM AND SOLIHULL STP",null,"QHL","BIRMINGHAM AND SOLIHULL STP",null,"QE1","RXL","BLACKPOOL TEACHING HOSPITALS NHS FOUNDATION TRUST","Specialist Services",null,"AT7H","BARDOC",null,"AT7H","BARDOC","Rehabilitation & Therapy Services"]
[null,null,null,null,null,null,null,null,null,"Percentage Negative","Percentage Positive","Percentage Positive",null,"QHM","CUMBRIA AND NORTH EAST STP",null,"QHM","CUMBRIA AND NORTH EAST STP",null,"QE1","RXR","EAST LANCASHIRE HOSPITALS NHS TRUST","Children & Family Services",null,"AXG","BARNET, ENFIELD AND HARINGEY MENTAL HEALTH NHS TRUST",null,"AXG","BARNET, ENFIELD AND HARINGEY MENTAL HEALTH NHS TRUST","Specialist Services"]
[null,null,null,null,null,null,null,null,null,"Very good","Percentage Negative","Percentage Negative",null,"QJ2","JOINED UP CARE DERBYSHIRE STP",null,"QJ2","JOINED UP CARE DERBYSHIRE STP",null,"QE1","RXR","EAST LANCASHIRE HOSPITALS NHS TRUST","Community Healthcare Other",null,"DAY","BERKSHIRE HEALTHCARE NHS FOUNDATION TRUST",null,"DAY","BERKSHIRE HEALTHCARE NHS FOUNDATION TRUST"]
[null,null,null,null,null,null,null,null,null,"Good","Very good","Very good",null,"QJG","SUFFOLK AND NORTH EAST ESSEX ICS",null,"QJG","SUFFOLK AND NORTH EAST ESSEX ICS",null,"QE1","RXR","EAST LANCASHIRE HOSPITALS NHS TRUST","Community Inpatient Services",null,"DCF","BIRMINGHAM COMMUNITY HEALTHCARE NHS FOUNDATION TRUST",null,"DCF","BIRMINGHAM COMMUNITY HEALTHCARE NHS FOUNDATION TRUST"]
[null,null,null,null,null,null,null,null,null,"Neither Good nor Poor","Good","Good",null,"QJK","DEVON STP",null,"QJK","DEVON STP",null,"QE1","RXR","EAST LANCASHIRE HOSPITALS NHS TRUST","Community Nursing Services",null,"DVG","BLACK COUNTRY HEALTHCARE NHS FOUNDATION TRUST",null,"DVG","BLACK COUNTRY HEALTHCARE NHS FOUNDATION TRUST"]
[null,null,null,null,null,null,null,null,null,"Poor","Neither Good nor Poor","Neither Good nor Poor",null,"QJM","LINCOLNSHIRE STP",null,"QJM","LINCOLNSHIRE STP",null,"QE1","RXR","EAST LANCASHIRE HOSPITALS NHS TRUST","Rehabilitation & Therapy Services",null,"DY6","BLACKPOOL TEACHING HOSPITALS NHS FOUNDATION TRUST",null,"DY6","BLACKPOOL TEACHING HOSPITALS NHS FOUNDATION TRUST"]
[null,null,null,null,null,null,null,null,null,"Very Poor","Poor","Poor",null,"QK1","LEICESTER, LEICESTERSHIRE AND RUTLAND STP",null,"QK1","LEICESTER, LEICESTERSHIRE AND RUTLAND STP",null,"QE1","RXR","EAST LANCASHIRE HOSPITALS NHS TRUST","Specialist Services",null,"NAX","BOLTON NHS FOUNDATION TRUST",null,"NAX","BOLTON NHS FOUNDATION TRUST"]
[null,null,null,null,null,null,null,null,null,"Don't Know","Very Poor","Very Poor",null,"QKK","OUR HEALTHIER SOUTH EAST LONDON STP",null,"QKK","OUR HEALTHIER SOUTH EAST LONDON STP",null,"QE1","RW5","LANCASHIRE & SOUTH CUMBRIA NHS FOUNDATION TRUST","Children & Family Services",null,"NCE","BRADFORD DISTRICT CARE NHS FOUNDATION TRUST",null,"NCE","BRADFORD DISTRICT CARE NHS FOUNDATION TRUST"]
[null,null,null,null,null,null,null,null,null,null,"Don't Know","Don't Know",null,"QKS","KENT AND MEDWAY STP",null,"QKS","KENT AND MEDWAY STP",null,"QE1","RW5","LANCASHIRE & SOUTH CUMBRIA NHS FOUNDATION TRUST","Community Inpatient Services",null,"NDA","BRIDGEWATER COMMUNITY HEALTHCARE NHS FOUNDATION TRUST",null,"NDA","BRIDGEWATER COMMUNITY HEALTHCARE NHS FOUNDATION TRUST"]
[null,null,null,null,null,null,null,null,null,null,"Mode SMS",null,null,"QM7","HERTFORDSHIRE AND WEST ESSEX STP",null,"QM7","HERTFORDSHIRE AND WEST ESSEX STP",null,"QE1","RW5","LANCASHIRE & SOUTH CUMBRIA NHS FOUNDATION TRUST","Community Nursing Services",null,"NDJ","BROMLEY HEALTHCARE",null,"NDJ","BROMLEY HEALTHCARE"]
[null,null,null,null,null,null,null,null,null,null,"Mode Electronic Discharge",null,null,"QMF","EAST LONDON HEALTH & CARE PARTNERSHIP (STP)",null,"QMF","EAST LONDON HEALTH & CARE PARTNERSHIP (STP)",null,"QE1","RW5","LANCASHIRE & SOUTH CUMBRIA NHS FOUNDATION TRUST","Rehabilitation & Therapy Services",null,"NDK","BUCKINGHAMSHIRE HEALTHCARE NHS TRUST",null,"NDK","BUCKINGHAMSHIRE HEALTHCARE NHS TRUST"]
[null,null,null,null,null,null,null,null,null,null,"Mode Paper Home",null,null,"QMJ","NORTH LONDON PARTNERS IN HEALTH & CARE (STP)",null,"QMJ","NORTH LONDON PARTNERS IN HEALTH & CARE (STP)",null,"QE1","RW5","LANCASHIRE & SOUTH CUMBRIA NHS FOUNDATION TRUST","Specialist Services",null,"NDL","CALDERDALE AND HUDDERSFIELD NHS FOUNDATION TRUST",null,"NDL","CALDERDALE AND HUDDERSFIELD NHS FOUNDATION TRUST"]
[null,null,null,null,null,null,null,null,null,null,"Mode Telephone",null,null,"QMM","NORFOLK AND WAVENEY HEALTH & CARE PARTNERSHIP (STP)",null,"QMM","NORFOLK AND WAVENEY HEALTH & CARE PARTNERSHIP (STP)",null,"QE1","RTX","UNIVERSITY HOSPITALS OF MORECAMBE BAY NHS FOUNDATION TRUST","Community Healthcare Other",null,"NEC","CAMBRIDGESHIRE AND PETERBOROUGH NHS FOUNDATION TRUST",null,"NEC","CAMBRIDGESHIRE AND PETERBOROUGH NHS FOUNDATION TRUST"]
[null,null,null,null,null,null,null,null,null,null,"Mode Online",null,null,"QNC","STAFFORDSHIRE & STOKE ON TRENT STP",null,"QNC","STAFFORDSHIRE & STOKE ON TRENT STP",null,"QE1","RTX","UNIVERSITY HOSPITALS OF MORECAMBE BAY NHS FOUNDATION TRUST","Community Inpatient Services",null,"NGX","CAMBRIDGESHIRE COMMUNITY SERVICES NHS TRUST",null,"NGX","CAMBRIDGESHIRE COMMUNITY SERVICES NHS TRUST"]
[null,null,null,null,null,null,null,null,null,null,"Mode Other",null,null,"QNQ","FRIMLEY HEALTH & CARE (STP)",null,"QNQ","FRIMLEY HEALTH & CARE (STP)",null,"QE1","RTX","UNIVERSITY HOSPITALS OF MORECAMBE BAY NHS FOUNDATION TRUST","Community Nursing Services",null,"NHA","CARE PLUS GROUP",null,"NHA","CARE PLUS GROUP"]
{"$rows_left_out":477}