{"text_format":"1","workbook":"xlsx","n_sheets":6,"sheets":["Notes","Summary","STP","Trusts","Categories","BS"],"not_rendered":{"charts":0,"images":0,"macros":1,"external_links":1,"defined_names":14,"comments":0,"pivot_tables":0},"unopened":[],"bounds":{"document_bytes":16777216,"sheet_cells":100000,"rows_first":2000,"rows_last":500,"rows_between":2000,"halvings":0,"cell_chars":16384,"cell_head_chars":4096},"cells_cut":0,"cells_raw":0,"read":"whole","date_system":"1900"}

{"sheet":"Notes","index":0,"n_rows":2,"n_cols":8,"rows_kept":2,"cut":false,"hidden":false,"merged":[[1,1,1,4]]}
[]
[null,"Mental Health Friends and Family Test (FFT) data - November 2021",null,null,null,null,null,"  Show data for:"]

{"sheet":"Summary","index":1,"n_rows":12,"n_cols":10,"rows_kept":12,"cut":false,"hidden":false,"merged":[[2,1,3,1],[2,4,2,5],[2,6,2,7],[2,8,2,9]]}
[]
[]
[null,"FFT","Number of organisations submitting","Total responses to date","Responses",null,"Percentage Positive",null,"Percentage Negative"]
[null,null,"2021-11-01","2021-11-01","2021-11-01","2021-10-27","2021-11-01","2021-10-27","2021-11-01","2021-10-27"]
[null,"Mental Health Overall",68,1364171,16985,15214,0.85758021783926996,0.8705140002629157,6.9237562555195767E-2,6.0930721703693964E-2]
[null,"Primary Care",36,234283,2424,1975,0.87953795379537958,0.90632911392405058,6.3531353135313537E-2,4.5569620253164557E-2]
[null,"Secondary Care Community Services",48,498659,6391,5577,0.83758410264434358,0.86462255693024925,8.9500860585197933E-2,7.0826609288147754E-2]
[null,"Acute Services",42,213906,2431,2275,0.82928835870012341,0.83076923076923082,6.4993829699712055E-2,6.901098901098901E-2]
[null,"Specialist Services",41,111858,1597,1321,0.90857858484658738,0.91143073429220289,4.4458359423919847E-2,4.8448145344436033E-2]
[null,"Secure and Forensic Services",26,50830,876,843,0.84360730593607303,0.8754448398576512,5.8219178082191778E-2,4.5077105575326216E-2]
[null,"Child and Adolescent Mental Health Services",46,164250,1917,1898,0.87115284298382889,0.85879873551106423,6.3119457485654673E-2,6.5331928345626969E-2]
[null,"Mental Health Other",36,90385,1349,1325,0.89325426241660488,0.88301886792452833,3.6323202372127501E-2,4.4528301886792451E-2]

{"sheet":"STP","index":2,"n_rows":45,"n_cols":12,"rows_kept":45,"cut":false,"hidden":false,"merged":[[2,6,2,11],[2,0,3,0],[2,1,3,1],[2,2,3,2],[2,3,3,3],[2,4,3,4],[2,5,3,5]]}
[]
[]
["STP Code","STP Name","Total Responses","Total Eligible","Percentage Positive","Percentage Negative","Breakdown of Responses"]
[null,null,null,null,null,null,"Very Good","Good","Neither Good nor Poor","Poor","Very Poor","Don't Know"]
[null,"England (including Independent Sector Providers)",16985,765177,0.85758021783926996,6.9237562555195767E-2,10668,3898,915,457,719,328]
[null,"England (excluding Independent Sector Providers)",16364,756545,0.85584209239794673,7.0642874602786607E-2,10241,3764,885,446,710,318]
[null,"Selection (excluding suppressed data)",{"$f":"SUBTOTAL(9,C8:C100)","v":16985},{"$f":"SUBTOTAL(9,D8:D100)","v":765177},{"$f":"IFERROR((G7+H7)/SUM(G7:L7), \"-\")","v":0.85758021783926996},{"$f":"IFERROR((J7+K7)/SUM(G7:L7), \"-\")","v":6.9237562555195767E-2},{"$f":"SUBTOTAL(9,G8:G100)","v":10668},3898,915,457,719,328]
["QE1","HEALTHIER LANCASHIRE AND SOUTH CUMBRIA",872,35111,0.97018348623853212,9.1743119266055051E-3,719,127,18,4,4,0]
["QF7","SOUTH YORKSHIRE AND BASSETLAW STP",225,28172,0.93333333333333335,2.2222222222222223E-2,156,54,10,3,2,0]
["QGH","HEREFORDSHIRE AND WORCESTERSHIRE STP",35,4183,0.48571428571428571,0.45714285714285713,12,5,2,6,10,0]
["QH8","MID AND SOUTH ESSEX STP",13,11710,1,0,13,0,0,0,0,0]
["QHL","BIRMINGHAM AND SOLIHULL STP",0,0,"NA","NA",0,0,0,0,0,0]
["QHM","CUMBRIA AND NORTH EAST STP",934,141976,0.8907922912205567,4.3897216274089934E-2,585,247,45,19,22,16]
["QJ2","JOINED UP CARE DERBYSHIRE STP",381,16539,0.90288713910761154,3.4120734908136482E-2,286,58,10,4,9,14]
["QJM","LINCOLNSHIRE STP",479,4363,0.88935281837160751,2.9227557411273485E-2,285,141,31,5,9,8]
["QK1","LEICESTER, LEICESTERSHIRE AND RUTLAND STP",942,21914,0.67197452229299359,0.20912951167728239,464,169,71,61,136,41]
["QKK","OUR HEALTHIER SOUTH EAST LONDON STP",1131,45611,0.77718832891246681,9.7259062776304153E-2,575,304,124,55,55,18]
["QKS","KENT AND MEDWAY STP",641,15840,0.87831513260530425,2.9641185647425898E-2,370,193,31,10,9,28]
["QM7","HERTFORDSHIRE AND WEST ESSEX STP",287,13552,0.89547038327526129,6.2717770034843204E-2,179,78,9,8,10,3]
["QMF","EAST LONDON HEALTH & CARE PARTNERSHIP (STP)",753,57556,0.79814077025232399,8.4993359893758294E-2,386,215,69,25,39,19]
{"$rows_left_out":26}
{"sheet":"Trusts","index":3,"n_rows":75,"n_cols":21,"rows_kept":75,"cut":false,"hidden":false,"merged":[[2,6,3,6],[2,7,2,12],[2,13,2,20],[2,0,3,0],[2,1,3,1],[2,2,3,2],[2,3,3,3],[2,4,3,4],[2,5,3,5]]}
[]
[]
["STP Code","Trust Code","Trust Name","Total Responses","Total Eligible","Percentage Positive","Percentage Negative","Breakdown of Responses",null,null,null,null,null,"Mode of Collection"]
[null,null,null,null,null,null,null,"Very Good","Good","Neither Good nor Poor","Poor","Very Poor","Don't Know","Mode SMS","Mode Electronic Discharge","Mode Electronic Home","Mode Paper Discharge","Mode Paper Home","Mode Telephone","Mode Online","Mode Other"]
[null,null,"England (including Independent Sector Providers)",16985,765177,0.85758021783926996,6.9237562555195767E-2,10668,3898,915,457,719,328,2820,1543,230,3559,1735,58,5464,1576]
[null,null,"England (excluding Independent Sector Providers)",16364,756545,0.85584209239794673,7.0642874602786607E-2,10241,3764,885,446,710,318,2792,1543,223,3417,1728,58,5346,1257]
[null,null,"Selection (excluding suppressed data)",{"$f":"SUBTOTAL(9,D8:D193)","v":16985},{"$f":"SUBTOTAL(9,E8:E193)","v":765177},{"$f":"IFERROR((H7+I7)/SUM(H7:M7), \"-\")","v":0.857202580028667},{"$f":"IFERROR((K7+L7)/SUM(H7:M7), \"-\")","v":6.9457716196846625E-2},{"$f":"SUBTOTAL(9,H8:H193)","v":10507},3846,908,447,716,320,2820,1474,226,3471,1680,51,5446,1576]
["QE1","RXL","BLACKPOOL TEACHING HOSPITALS NHS FOUNDATION TRUST",54,1113,1,0,42,12,0,0,0,0,0,0,0,34,0,0,20,{"$f":"IF(VLOOKUP($B8,[1]TrustCalcs!$B:$H,7,0)=1,\"*\",VLOOKUP($B8,'[1]Collection Mode'!$C:$O, 13, 0))","v":0}]
["QE1","RW5","LANCASHIRE & SOUTH CUMBRIA NHS FOUNDATION TRUST",818,33998,0.9682151589242054,9.7799511002444987E-3,677,115,18,4,4,0,0,0,0,1,0,0,817,{"$f":"IF(VLOOKUP($B9,[1]TrustCalcs!$B:$H,7,0)=1,\"*\",VLOOKUP($B9,'[1]Collection Mode'!$C:$O, 13, 0))","v":0}]
["QF7","RXE","ROTHERHAM DONCASTER AND SOUTH HUMBER NHS FOUNDATION TRUST",86,19470,0.93023255813953487,2.3255813953488372E-2,"*","*","*","*","*","*","*","*","*","*","*","*","*",{"$f":"IF(VLOOKUP($B10,[1]TrustCalcs!$B:$H,7,0)=1,\"*\",VLOOKUP($B10,'[1]Collection Mode'!$C:$O, 13, 0))","v":"*"}]
["QF7","RCU","SHEFFIELD CHILDREN'S NHS FOUNDATION TRUST",1,990,"*","*","*","*","*","*","*","*","*","*","*","*","*","*","*",{"$f":"IF(VLOOKUP($B11,[1]TrustCalcs!$B:$H,7,0)=1,\"*\",VLOOKUP($B11,'[1]Collection Mode'!$C:$O, 13, 0))","v":"*"}]
["QF7","TAH","SHEFFIELD HEALTH & SOCIAL CARE NHS FOUNDATION TRUST",138,7712,0.94202898550724634,1.4492753623188406E-2,89,41,6,2,0,0,0,0,0,138,0,0,0,{"$f":"IF(VLOOKUP($B12,[1]TrustCalcs!$B:$H,7,0)=1,\"*\",VLOOKUP($B12,'[1]Collection Mode'!$C:$O, 13, 0))","v":0}]
["QGH","R1A","HEREFORDSHIRE AND WORCESTERSHIRE HEALTH AND CARE NHS TRUST",35,4183,0.48571428571428571,0.45714285714285713,12,5,2,6,10,0,35,0,0,0,0,0,0,{"$f":"IF(VLOOKUP($B13,[1]TrustCalcs!$B:$H,7,0)=1,\"*\",VLOOKUP($B13,'[1]Collection Mode'!$C:$O, 13, 0))","v":0}]
["QH8","R1L","ESSEX PARTNERSHIP UNIVERSITY NHS FOUNDATION TRUST",13,11710,1,0,13,0,0,0,0,0,0,0,0,2,0,0,11,{"$f":"IF(VLOOKUP($B14,[1]TrustCalcs!$B:$H,7,0)=1,\"*\",VLOOKUP($B14,'[1]Collection Mode'!$C:$O, 13, 0))","v":0}]
["QHM","RX4","CUMBRIA, NORTHUMBERLAND, TYNE AND WEAR NHS FOUNDATION TRUST",226,35259,0.85398230088495575,9.2920353982300891E-2,145,48,12,5,16,0,0,0,0,153,0,0,0,{"$f":"IF(VLOOKUP($B15,[1]TrustCalcs!$B:$H,7,0)=1,\"*\",VLOOKUP($B15,'[1]Collection Mode'!$C:$O, 13, 0))","v":73}]
["QHM","RR7","GATESHEAD HEALTH NHS FOUNDATION TRUST",0,133,"NA","NA",0,0,0,0,0,0,0,0,0,0,0,0,0,{"$f":"IF(VLOOKUP($B16,[1]TrustCalcs!$B:$H,7,0)=1,\"*\",VLOOKUP($B16,'[1]Collection Mode'!$C:$O, 13, 0))","v":0}]
["QHM","RTF","NORTHUMBRIA HEALTHCARE NHS FOUNDATION TRUST",0,997,"NA","NA",0,0,0,0,0,0,0,0,0,0,0,0,0,{"$f":"IF(VLOOKUP($B17,[1]TrustCalcs!$B:$H,7,0)=1,\"*\",VLOOKUP($B17,'[1]Collection Mode'!$C:$O, 13, 0))","v":0}]
["QHM","R0B","SOUTH TYNESIDE AND SUNDERLAND NHS FOUNDATION TRUST",6,1492,1,0,5,1,0,0,0,0,0,0,0,0,6,0,0,{"$f":"IF(VLOOKUP($B18,[1]TrustCalcs!$B:$H,7,0)=1,\"*\",VLOOKUP($B18,'[1]Collection Mode'!$C:$O, 13, 0))","v":0}]
["QHM","RX3","TEES, ESK AND WEAR VALLEYS NHS FOUNDATION TRUST",702,104095,0.90170940170940173,2.8490028490028491E-2,435,198,33,14,6,16,32,151,0,491,0,0,28,{"$f":"IF(VLOOKUP($B19,[1]TrustCalcs!$B:$H,7,0)=1,\"*\",VLOOKUP($B19,'[1]Collection Mode'!$C:$O, 13, 0))","v":0}]
["QJ2","RXM","DERBYSHIRE HEALTHCARE NHS FOUNDATION TRUST",381,16539,0.90288713910761154,3.4120734908136482E-2,286,58,10,4,9,14,44,0,0,178,0,0,159,{"$f":"IF(VLOOKUP($B20,[1]TrustCalcs!$B:$H,7,0)=1,\"*\",VLOOKUP($B20,'[1]Collection Mode'!$C:$O, 13, 0))","v":0}]
{"$rows_left_out":56}
{"sheet":"Categories","index":4,"n_rows":282,"n_cols":13,"rows_kept":282,"cut":false,"hidden":false,"merged":[[2,6,3,6],[2,7,2,12],[2,0,3,0],[2,1,3,1],[2,2,3,2],[2,3,3,3],[2,4,3,4],[2,5,3,5]]}
[]
[]
["STP Code","Trust Code","Trust Name","Service Category Provided","Total Responses","Percentage Positive","Percentage Negative","Breakdown of Responses"]
[null,null,null,null,null,null,null,"Very Good","Good","Neither Good nor Poor","Poor","Very Poor","Don't Know"]
[null,null,null,"England (including Independent Sector Providers)",16985,0.85758021783926996,6.9237562555195767E-2,10668,3898,915,457,719,328]
[null,null,null,"England (excluding Independent Sector Providers)",16364,0.85584209239794673,7.0642874602786607E-2,10241,3764,885,446,710,318]
[null,null,null,"Selection (excluding suppressed data)",{"$f":"SUBTOTAL(9,E8:E667)","v":16985},{"$f":"IFERROR((H7+I7)/SUM(H7:M7), \"-\")","v":0.85777321083172142},{"$f":"IFERROR((K7+L7)/SUM(H7:M7), \"-\")","v":6.9572050290135398E-2},{"$f":"SUBTOTAL(9,H8:H667)","v":10401},3790,890,441,710,312]
["QE1","RXL","BLACKPOOL TEACHING HOSPITALS NHS FOUNDATION TRUST","Secondary Care Community Services",54,1,0,42,12,0,0,0,0]
["QE1","RW5","LANCASHIRE & SOUTH CUMBRIA NHS FOUNDATION TRUST","Acute Services",118,0.9576271186440678,8.4745762711864406E-3,86,27,4,1,0,0]
["QE1","RW5","LANCASHIRE & SOUTH CUMBRIA NHS FOUNDATION TRUST","Child & Adolescent Mental Health Services",151,0.99337748344370858,0,134,16,1,0,0,0]
["QE1","RW5","LANCASHIRE & SOUTH CUMBRIA NHS FOUNDATION TRUST","Mental Health Other",4,"*","*","*","*","*","*","*","*"]
["QE1","RW5","LANCASHIRE & SOUTH CUMBRIA NHS FOUNDATION TRUST","Secondary Care Community Services",280,0.9642857142857143,1.4285714285714285E-2,233,37,6,2,2,0]
["QE1","RW5","LANCASHIRE & SOUTH CUMBRIA NHS FOUNDATION TRUST","Secure & Forensic Services",4,"*","*","*","*","*","*","*","*"]
["QE1","RW5","LANCASHIRE & SOUTH CUMBRIA NHS FOUNDATION TRUST","Specialist Services",261,0.96168582375478928,1.1494252873563218E-2,218,33,7,1,2,0]
["QF7","RXE","ROTHERHAM DONCASTER AND SOUTH HUMBER NHS FOUNDATION TRUST","Acute Services",4,"*","*","*","*","*","*","*","*"]
["QF7","RXE","ROTHERHAM DONCASTER AND SOUTH HUMBER NHS FOUNDATION TRUST","Child & Adolescent Mental Health Services",3,"*","*","*","*","*","*","*","*"]
["QF7","RXE","ROTHERHAM DONCASTER AND SOUTH HUMBER NHS FOUNDATION TRUST","Primary Care",62,0.95161290322580649,0,46,13,3,0,0,0]
["QF7","RXE","ROTHERHAM DONCASTER AND SOUTH HUMBER NHS FOUNDATION TRUST","Secondary Care Community Services",6,1,0,6,0,0,0,0,0]
["QF7","RXE","ROTHERHAM DONCASTER AND SOUTH HUMBER NHS FOUNDATION TRUST","Specialist Services",11,1,0,11,0,0,0,0,0]
["QF7","RCU","SHEFFIELD CHILDREN'S NHS FOUNDATION TRUST","Child & Adolescent Mental Health Services",1,"*","*","*","*","*","*","*","*"]
{"$rows_left_out":263}
{"sheet":"BS","index":5,"n_rows":276,"n_cols":30,"rows_kept":276,"cut":false,"hidden":true,"merged":[]}
[null,"Sort","Region (LO) Code","Region (LO) name","Trust code","Trust name","Category",null,"Sort Lists:","Sort range…","Sort range…","Sort range…","Reference Region Lists:","Code…","Name…","Linked Region Lists:","Code…","Name…","Reference Lists:","Code…","Code…","Name…","Category…","Trusts Linked Lists:","Code…","Name…","Categories Linked Lists:","Code…","Name…","Category…"]
["Region (LO)",1,1,1,"-","-","-",null,null,"STP Code","STP Code","STP Code",null,"QE1","HEALTHIER LANCASHIRE AND SOUTH CUMBRIA",null,"QE1","HEALTHIER LANCASHIRE AND SOUTH CUMBRIA",null,"QE1","RXL","BLACKPOOL TEACHING HOSPITALS NHS FOUNDATION TRUST","Secondary Care Community Services",null,"NDK","ALDER HEY CHILDREN'S NHS FOUNDATION TRUST",null,"NDK","ALDER HEY CHILDREN'S NHS FOUNDATION TRUST","Acute Services"]
["Trusts",1,1,1,1,1,"-",null,null,"STP Name","Trust Code","Trust Code",null,"QF7","SOUTH YORKSHIRE AND BASSETLAW STP",null,"QF7","SOUTH YORKSHIRE AND BASSETLAW STP",null,"QE1","RW5","LANCASHIRE & SOUTH CUMBRIA NHS FOUNDATION TRUST","Acute Services",null,"NNF","AVON AND WILTSHIRE MENTAL HEALTH PARTNERSHIP NHS TRUST",null,"NNF","AVON AND WILTSHIRE MENTAL HEALTH PARTNERSHIP NHS TRUST","Child & Adolescent Mental Health Services"]
["Categories",1,1,1,1,1,1,null,null,"Total Responses","Trust Name","Trust Name",null,"QGH","HEREFORDSHIRE AND WORCESTERSHIRE STP",null,"QGH","HEREFORDSHIRE AND WORCESTERSHIRE STP",null,"QE1","RW5","LANCASHIRE & SOUTH CUMBRIA NHS FOUNDATION TRUST","Child & Adolescent Mental Health Services",null,"NQL","BARNET, ENFIELD AND HARINGEY MENTAL HEALTH NHS TRUST",null,"NQL","BARNET, ENFIELD AND HARINGEY MENTAL HEALTH NHS TRUST","Mental Health Other"]
[null,null,null,null,null,null,null,null,null,"Total Eligible","Total Responses","Category",null,"QH8","MID AND SOUTH ESSEX STP",null,"QH8","MID AND SOUTH ESSEX STP",null,"QE1","RW5","LANCASHIRE & SOUTH CUMBRIA NHS FOUNDATION TRUST","Mental Health Other",null,"NR5","BERKSHIRE HEALTHCARE NHS FOUNDATION TRUST",null,"NR5","BERKSHIRE HEALTHCARE NHS FOUNDATION TRUST","Primary Care"]
[null,null,null,null,null,null,null,null,null,"Percentage Positive","Total Eligible","Total Responses",null,"QHL","BIRMINGHAM AND SOLIHULL STP",null,"QHL","BIRMINGHAM AND SOLIHULL STP",null,"QE1","RW5","LANCASHIRE & SOUTH CUMBRIA NHS FOUNDATION TRUST","Secondary Care Community Services",null,"NV2","BIRMINGHAM AND SOLIHULL MENTAL HEALTH NHS FOUNDATION TRUST",null,"NV2","BIRMINGHAM AND SOLIHULL MENTAL HEALTH NHS FOUNDATION TRUST","Secondary Care Community Services"]
[null,null,null,null,null,null,null,null,null,"Percentage Negative","Percentage Positive","Percentage Positive",null,"QHM","CUMBRIA AND NORTH EAST STP",null,"QHM","CUMBRIA AND NORTH EAST STP",null,"QE1","RW5","LANCASHIRE & SOUTH CUMBRIA NHS FOUNDATION TRUST","Secure & Forensic Services",null,"O2F3D","BLACK COUNTRY HEALTHCARE NHS FOUNDATION TRUST",null,"O2F3D","BLACK COUNTRY HEALTHCARE NHS FOUNDATION TRUST","Secure & Forensic Services"]
[null,null,null,null,null,null,null,null,null,"Very Good","Percentage Negative","Percentage Negative",null,"QJ2","JOINED UP CARE DERBYSHIRE STP",null,"QJ2","JOINED UP CARE DERBYSHIRE STP",null,"QE1","RW5","LANCASHIRE & SOUTH CUMBRIA NHS FOUNDATION TRUST","Specialist Services",null,"R0B","BLACKPOOL TEACHING HOSPITALS NHS FOUNDATION TRUST",null,"R0B","BLACKPOOL TEACHING HOSPITALS NHS FOUNDATION TRUST","Specialist Services"]
[null,null,null,null,null,null,null,null,null,"Good","Very Good","Very Good",null,"QJM","LINCOLNSHIRE STP",null,"QJM","LINCOLNSHIRE STP",null,"QF7","RXE","ROTHERHAM DONCASTER AND SOUTH HUMBER NHS FOUNDATION TRUST","Acute Services",null,"R1A","BRADFORD DISTRICT CARE NHS FOUNDATION TRUST",null,"R1A","BRADFORD DISTRICT CARE NHS FOUNDATION TRUST"]
[null,null,null,null,null,null,null,null,null,"Neither Good nor Poor","Good","Good",null,"QK1","LEICESTER, LEICESTERSHIRE AND RUTLAND STP",null,"QK1","LEICESTER, LEICESTERSHIRE AND RUTLAND STP",null,"QF7","RXE","ROTHERHAM DONCASTER AND SOUTH HUMBER NHS FOUNDATION TRUST","Child & Adolescent Mental Health Services",null,"R1C","CAMBRIDGESHIRE AND PETERBOROUGH NHS FOUNDATION TRUST",null,"R1C","CAMBRIDGESHIRE AND PETERBOROUGH NHS FOUNDATION TRUST"]
[null,null,null,null,null,null,null,null,null,"Poor","Neither Good nor Poor","Neither Good nor Poor",null,"QKK","OUR HEALTHIER SOUTH EAST LONDON STP",null,"QKK","OUR HEALTHIER SOUTH EAST LONDON STP",null,"QF7","RXE","ROTHERHAM DONCASTER AND SOUTH HUMBER NHS FOUNDATION TRUST","Primary Care",null,"R1F","CAMDEN AND ISLINGTON NHS FOUNDATION TRUST",null,"R1F","CAMDEN AND ISLINGTON NHS FOUNDATION TRUST"]
[null,null,null,null,null,null,null,null,null,"Very Poor","Poor","Poor",null,"QKS","KENT AND MEDWAY STP",null,"QKS","KENT AND MEDWAY STP",null,"QF7","RXE","ROTHERHAM DONCASTER AND SOUTH HUMBER NHS FOUNDATION TRUST","Secondary Care Community Services",null,"R1L","CENTRAL AND NORTH WEST LONDON NHS FOUNDATION TRUST",null,"R1L","CENTRAL AND NORTH WEST LONDON NHS FOUNDATION TRUST"]
[null,null,null,null,null,null,null,null,null,"Don't Know","Very Poor","Very Poor",null,"QM7","HERTFORDSHIRE AND WEST ESSEX STP",null,"QM7","HERTFORDSHIRE AND WEST ESSEX STP",null,"QF7","RXE","ROTHERHAM DONCASTER AND SOUTH HUMBER NHS FOUNDATION TRUST","Specialist Services",null,"RAT","CHESHIRE AND WIRRAL PARTNERSHIP NHS FOUNDATION TRUST",null,"RAT","CHESHIRE AND WIRRAL PARTNERSHIP NHS FOUNDATION TRUST"]
[null,null,null,null,null,null,null,null,null,null,"Don't Know","Don't Know",null,"QMF","EAST LONDON HEALTH & CARE PARTNERSHIP (STP)",null,"QMF","EAST LONDON HEALTH & CARE PARTNERSHIP (STP)",null,"QF7","RCU","SHEFFIELD CHILDREN'S NHS FOUNDATION TRUST","Child & Adolescent Mental Health Services",null,"RBS","CITY HEALTH CARE PARTNERSHIP CIC",null,"RBS","CITY HEALTH CARE PARTNERSHIP CIC"]
[null,null,null,null,null,null,null,null,null,null,"Mode SMS",null,null,"QMJ","NORTH LONDON PARTNERS IN HEALTH & CARE (STP)",null,"QMJ","NORTH LONDON PARTNERS IN HEALTH & CARE (STP)",null,"QF7","TAH","SHEFFIELD HEALTH & SOCIAL CARE NHS FOUNDATION TRUST","Mental Health Other",null,"RCU","CORNWALL PARTNERSHIP NHS FOUNDATION TRUST",null,"RCU","CORNWALL PARTNERSHIP NHS FOUNDATION TRUST"]
[null,null,null,null,null,null,null,null,null,null,"Mode Electronic Discharge",null,null,"QMM","NORFOLK AND WAVENEY HEALTH & CARE PARTNERSHIP (STP)",null,"QMM","NORFOLK AND WAVENEY HEALTH & CARE PARTNERSHIP (STP)",null,"QF7","TAH","SHEFFIELD HEALTH & SOCIAL CARE NHS FOUNDATION TRUST","Secondary Care Community Services",null,"RDY","CUMBRIA, NORTHUMBERLAND, TYNE AND WEAR NHS FOUNDATION TRUST",null,"RDY","CUMBRIA, NORTHUMBERLAND, TYNE AND WEAR NHS FOUNDATION TRUST"]
[null,null,null,null,null,null,null,null,null,null,"Mode Electronic Home",null,null,"QNC","STAFFORDSHIRE & STOKE ON TRENT STP",null,"QNC","STAFFORDSHIRE & STOKE ON TRENT STP",null,"QF7","TAH","SHEFFIELD HEALTH & SOCIAL CARE NHS FOUNDATION TRUST","Specialist Services",null,"RGD","DERBYSHIRE HEALTHCARE NHS FOUNDATION TRUST",null,"RGD","DERBYSHIRE HEALTHCARE NHS FOUNDATION TRUST"]
[null,null,null,null,null,null,null,null,null,null,"Mode Paper Discharge",null,null,"QNQ","FRIMLEY HEALTH & CARE (STP)",null,"QNQ","FRIMLEY HEALTH & CARE (STP)",null,"QGH","R1A","HEREFORDSHIRE AND WORCESTERSHIRE HEALTH AND CARE NHS TRUST","Child & Adolescent Mental Health Services",null,"RH5","DORSET HEALTHCARE UNIVERSITY NHS FOUNDATION TRUST",null,"RH5","DORSET HEALTHCARE UNIVERSITY NHS FOUNDATION TRUST"]
[null,null,null,null,null,null,null,null,null,null,"Mode Paper Home",null,null,"QNX","SUSSEX HEALTH AND CARE PARTNERSHIP",null,"QNX","SUSSEX HEALTH AND CARE PARTNERSHIP",null,"QGH","R1A","HEREFORDSHIRE AND WORCESTERSHIRE HEALTH AND CARE NHS TRUST","Mental Health Other",null,"RHA","DUDLEY INTEGRATED HEALTH AND CARE NHS TRUST",null,"RHA","DUDLEY INTEGRATED HEALTH AND CARE NHS TRUST"]
[null,null,null,null,null,null,null,null,null,null,"Mode Telephone",null,null,"QOP","GREATER MANCHESTER HEALTH & SOCIAL CARE PARTNERSHIP",null,"QOP","GREATER MANCHESTER HEALTH & SOCIAL CARE PARTNERSHIP",null,"QGH","R1A","HEREFORDSHIRE AND WORCESTERSHIRE HEALTH AND CARE NHS TRUST","Primary Care",null,"RJ8","EAST LONDON NHS FOUNDATION TRUST",null,"RJ8","EAST LONDON NHS FOUNDATION TRUST"]
{"$rows_left_out":256}