{"text_format":"1","workbook":"xlsx","n_sheets":11,"sheets":["Introduction","Framework >>","Stages","Dimensions","Summary","Inputs >>","Assessment","Outputs >>","Dashboard","Workings >>","Lists"],"not_rendered":{"charts":1,"images":4,"macros":1,"external_links":1,"defined_names":113,"comments":0,"pivot_tables":0},"unopened":[],"bounds":{"document_bytes":16777216,"sheet_cells":100000,"rows_first":2000,"rows_last":500,"rows_between":2000,"halvings":0,"cell_chars":16384,"cell_head_chars":4096},"cells_cut":0,"cells_raw":0,"read":"row_number_cap","date_system":"1900"}

{"sheet":"Introduction","index":0,"n_rows":9,"n_cols":4,"rows_kept":9,"cut":false,"hidden":false,"merged":[]}
[]
[]
[]
[]
[]
[]
[null,"Background",null,"Objectives"]
[]
[null,"The Office of Government Property (‘OGP’) formed the Facilities Management ('FM') Strategy Programme Team in January 2020. A new cross-department FM Taskforce was established and first met in February 2020. As part of a landscape review, the FM Taskforce has identified management and service standards as a priority area. This will help improve facilities management across the government estate.\n\nThere are a number of reasons why actions are being taken to improve FM:\n\n• Senior Civil Servant Function Surveys – FM was identified as a key a driver behind poor performance ratings for the Property Function.\n\n• Cross-Government feedback – Senior officials and non-execs from Departments and property bodies have frequently raised concerns over services and a lack of strategy on FM.\n\n• Confidence in suppliers – In recent years FM procurements have focused on minimising costs, this has impacted on service delivery and reduced suppliers' margins. One major FM provider collapsed and the financial stability of a significant part of the marketplace was questioned.\n\n• Changing needs – The needs and demands of users have changed but approach to workplace and FM has not adapted.  A refocus is needed to ensure buildings function well, user experience improves and to address policy issues such as sustainability.\n\n• Investment in maintenance – Lack of investment, and significant backlog maintenance, is the single biggest risk across the Property Function.",null,"The objectives of the FM management and service standard standards include:\n\n• Collaboration and knowledge sharing – a common standard and common language across FM services will facilitate collaboration and knowledge sharing between departments.\n• Common Service Standards - will help drive more consistent experiences across departments. improving satisfaction ratings of government staff and maintenance standards, which will help reduce future maintenance costs.\n• Strengthening FM Management Standards – will improve interoperability and resilience across the estate, supporting a better customer experience and better value for money."]

{"sheet":"Framework >>","index":1,"n_rows":0,"n_cols":0,"rows_kept":0,"cut":false,"hidden":true,"merged":[]}

{"sheet":"Stages","index":2,"n_rows":19,"n_cols":6,"rows_kept":19,"cut":false,"hidden":false,"merged":[]}
[]
[]
[]
[]
[]
[]
[null,"Maturity framework",null,null,null,"Maturity Framework Stages"]
[]
[null,"This framework has been developed to assist in assessing the baseline position of departments with regards to FM service standards and to inform the maturity tool development. The maturity tool will support departments in evidencing investment requirements to adhere to the FM service standards standards. This framework is designed around five maturity stages (Developing – Basic, Developing – Improving, Good, Better, Best) and 5 assessment dimensions (Strategic, Integrated, Intelligent, Collaborative, Delivery Excellence). These are detailed on the ‘Dimensions’ tab. ",null,null,null,"For the purposes of the FM management and service standard maturity framework, the ‘Developing’ stage has been separated into two: ‘Developing – Basic’ and ‘Developing – Improving’ to allow differentiation in the levels below ‘Good’. In order to be ‘Developing - Improving’, ‘Good', ‘Better' or ‘Best’, a department would need to meet all the criteria for that level across the framework, so by default an department is ‘Developing - Basic’ if it doesn’t meet at least 'Developing - Improving’ across all five dimensions."]
[]
[]
[null,"Functional Standards Framework"]
[]
[null,"The stages in this maturity framework are aligned to the “Government Functional Standards - Handbook for assessing performance against functional standards, version 1.1”, issued 25th November 2020."]
[]
[null,"The functional standards framework sets out different levels of maturity against the most important aspects of a functional standard - from ‘Developing’, to ‘Good’ (which is the level at which the data standard is developed), to ‘Better’ and ‘Best’, as shown in figure below:"]
[]
[]
[null,null,null,null,null,"These stages are scored 1 to 5 for each question on the 'Assessment' tab."]

{"sheet":"Dimensions","index":3,"n_rows":16,"n_cols":3,"rows_kept":16,"cut":false,"hidden":false,"merged":[[8,1,9,2]]}
[]
[]
[]
[]
[]
[]
[null,"Maturity Framework – Dimensions"]
[]
[null,"The dimensions of the maturity framework have been defined to be closely aligned to the proposed sections of the FM management and service standard. The definition and sub components of these dimensions are detailed below:"]
[]
[null,"Dimensions","Definition"]
[null,"Integrated","i. CAFM – integrated technology and systems are used to ensure a single version of the truth, supporting effective decision making and efficient operation of the estate\nii. Integrated Leadership - leadership across the wider property function is integrated and aligned. Total cost of ownership is considered and understood across all aspects of asset lifecycle."]
[null,"Collaborative","i. Partnership & Transparency – the management organisation works collaboratively and in partnership with the delivery organisation, with transparency of activity, data and cost. Building trusting relationships and working together to achieve continuous improvement in an ever-changing FM landscape."]
[null,"Delivery Excellence","i. Compliance – the estate is safe, productive and sanitary and the organisation can easily evidence compliance and effective risk management in the delivery of FM. Data is easy to access and validate and is regularly reviewed. It is managed by competent people and a robust QA process is in place. \nii. Standards & Best Practice – industry standards and best practice are used, supporting interoperability.\niii. Defined Roles – clearly defined roles are in place within both delivery and management organisation, and those roles are resourced with appropriate capability and capacity. "]
[null,"Strategic","i. Enabling - FM is an effective enabling service and supports wider and changing business priorities in an agile way.\nii. FM Strategy - FM is a strategic resource, forward looking and proactive, with a service plan and strategy in place that supports and enables the wider organisation in achieving its priorities.\niii. Governance - effective governance is in place; the role of FM in wider organisational priorities is understood and FM is an integrated part of service delivery."]
[null,"Intelligent","i. Intelligent Client – the organisation recognises the value of an intelligent client and has a defined intelligent client function, supporting an efficient and effective FM provision.\nii. Control levers - the service is aware of the commercial, financial and quality controls available to improve performance.\niii. Management Structure – The service is appropriately resourced with the right skills in the right place.\niv. Forward Planning – the service is forward looking and has an effective FMR in place, allowing for more informed, efficient and effective service delivery."]

{"sheet":"Summary","index":4,"n_rows":14,"n_cols":7,"rows_kept":14,"cut":false,"hidden":false,"merged":[]}
[]
[]
[]
[]
[]
[]
[null,"Maturity Framework"]
[]
[null,"Dimensions","Developing - Basic","Developing - Improving","Good","Better","Best"]
[null,"Integrated","FM is reactive and operates in a disjoined way with the wider business. No CAFM is in place and basic spreadsheets or similar are used to manage the service.","FM works closely with construction and estates teams, but is not fully integrated at a leadership level. Several systems are in use and no clear single version of the truth.","Leadership across the wider property function is well integrated and aligned. This allows for joined up decision making including an understanding of total cost of ownership. Several CAFM systems are in use but a recognised single version of the truth exists.","Leadership across the wider property function is well integrated and aligned. An integrated CAFM is used for management with only financial data held in a separate system.","Leadership is exceptionally well aligned, and all property activities and systems are integrated. "]
[null,"Collaborative","Relationship with supply chain is transactional and can be adversarial. No transparency regarding performance or cost.","Supply chain shares key info on a periodic basis and is validated by the management organisation. Client and supplier teams meet to discuss performance improvement.","Organisation has immediate access to key datasets and MI in a transparent and open way. Supplier and management organisation work together collaboratively to continually improve. ","Data is jointly owned and transparent for all parties. Supplier and management organisation work together in an open and honest way.","All parties have access to high quality management information. The relationship is built upon a foundation of trust and all parties work together to continuously improve."]
[null,"Delivery Excellence","Compliance across the estate cannot be evidenced. There are few agreed standards in place. Roles and responsibilities are poorly defined.","High risk compliance items can be evidenced and data is regularly validated. Some standards are used, such as SFG20. ","Compliance and effective risk management can easily be evidenced with robust quality assurance in place. Roles and clearly defined. ","Full oversight of all compliance and risk items, with associated remedial actions is easily accessible and a robust quality assurance process is in place.","Performance is exceptional and evidence of an effective programme of continuous improvement can be demonstrated."]
[null,"Strategic","Reactive support service only. No real strategy in place and works in a silo. May have annual service plan as part of corporate initiatives.","An effective service plan is in place and reviewed annually. A high level strategy has been developed to guide the service over the short to medium term.","An FM strategy is in place for the medium term (3 - 5 years) and linked in with the wider property function. Service plan is developed and refreshed annually.","FM is well understood and involved in shaping the organisation as a key enabler and catalyst. Integrated strategies and service delivery plans are in place.","FM has an integrated strategy and delivery plan with the wider organisation. It is aligned back to back with strategy and plans of supply chain partners."]
[null,"Intelligent","No identifiable client department exists.","A strong client department exists, with a range of subject matter experts forming a basic intelligent client function. ","A recognisable and effective intelligent client is in place. It supports value through understanding the levers of change available to it.","A strong and effective intelligent client is in place, supported by an appropriately resourced management team. ","An exceptionally strong intelligent client function, effectively integrated with the wider business. The value of the ICF is understood at leadership level.  "]

{"sheet":"Inputs >>","index":5,"n_rows":0,"n_cols":0,"rows_kept":0,"cut":false,"hidden":true,"merged":[]}

{"sheet":"Assessment","index":6,"n_rows":166,"n_cols":9,"rows_kept":166,"cut":false,"hidden":false,"merged":[[134,2,145,2],[14,1,14,7],[16,1,16,7],[53,6,58,6],[74,6,79,6],[59,5,64,5],[59,6,64,6],[65,5,70,5],[65,6,70,6],[47,1,70,1],[74,1,109,1],[47,5,52,5],[104,6,109,6],[80,6,85,6],[47,6,52,6],[80,5,85,5],[20,8,21,8],[1,5,1,6],[3,3,3,4],[8,1,8,7],[10,1,10,7],[12,1,12,7],[20,5,25,5],[20,6,25,6],[20,1,43,1],[38,2,43,2],[38,5,43,5],[26,6,31,6],[38,6,43,6],[32,6,37,6],[158,5,163,5],[134,6,139,6],[158,6,163,6],[113,1,130,1],[134,1,163,1],[158,2,163,2],[119,6,124,6],[125,5,130,5],[125,6,130,6],[146,6,151,6],[113,6,118,6],[152,2,157,2],[146,2,151,2],[125,2,130,2],[152,5,157,5],[152,6,157,6],[113,2,118,2],[119,2,124,2],[26,5,31,5],[32,5,37,5],[53,5,58,5],[20,2,37,2],[47,2,70,2],[74,2,85,2],[86,2,97,2],[98,2,109,2],[98,5,103,5],[98,6,103,6],[92,5,97,5],[134,5,139,5],[146,5,151,5],[74,5,79,5],[92,6,97,6],[86,5,91,5],[86,6,91,6],[113,5,118,5],[119,5,124,5],[104,5,109,5],[140,5,145,5],[140,6,145,6]],"read":"row_number_cap"}
[]
[null,null,null,null,"Please enter the department / portfolio:","e.g. Department of Education"]
[]
[null,"Dimension","Sub-Dimension","Questions",null,"Self-Assessment Score","Comment","Navigation"]
[]
[]
[null,"User Notes"]
[]
[null,"1. The questions below allow the user to self-assess their department or sub department against the Service Standards Framework. Questions are split into categories and sub-categories, as per the Framework, to help users understand areas that may require further investigation or investment."]
[]
[null,"2. To complete the assessment, the user should select a score for each question using the dropdown cells in column F. For reference, a score of 1 is equivalent to  'Development - Basic', and a score of 5 is equivalent to 'Best'. If deemed necessary, you may also wish to add a comment in column G to provide further context for your answer / score. Once all questions are complete 'Assessment Complete' will be shown on the 'Dashboard' tab. "]
[]
[null,"3. For some questions in the assessment there are only three score 1 to 3+, as 'Best' or 'Better' level are not relevant. A score of '3+' will not limit the overall assessment for that sub-dimension to a '3'. "]
[]
[null,"4. There is further guidance and considerations for each question in the appendix of the guidance document (FM Standard - FMS 001 - Management and Services - Guidance Document v0.1). Please refer to this document to support when answering the questions below."]
[]
[null,"5. This worksheet has been designed to be viewed at 90% zoom. Note: this may depend on screen resolutions. "]
[]
[null,"Integrated"]
[]
[null,"Integrated","Integrated Leadership","Q1","How integrated is facilities management - Soft Services?","3+",null,null,"to next section"]
[null,null,null,1,"Soft services is devolved around the organisation without a central \"controlling mind\"."]
[null,null,null,2,"A central team exists that manage a range of core buildings directly but are not fully integrated"]
[null,null,null,"3+","Soft services is integrated with a clear centre of expertise with delivery coordinated centrally"]
[]
[]
[null,null,null,"Q2","How integrated is facilities management - Hard Services?","3+"]
[null,null,null,1,"Hard services is devolved around the organisation without a central \"controlling mind\"."]
[null,null,null,2,"A central team exists that manage a range of core buildings directly but are not fully integrated"]
[null,null,null,"3+","Hard services is integrated with a clear centre of expertise with delivery coordinated centrally"]
[]
[]
[null,null,null,"Q3","How integrated is Property Leadership?","3+"]
[null,null,null,1,"FM works in a silo, reactive to demand with little engagement with wider property leadership"]
[null,null,null,2,"FM links in some what with construction, design and asset management teams, but gaps remain."]
[null,null,null,"3+","leadership across the wider property function is integrated and aligned. Total cost of ownership is considered and understood across all aspects of asset lifecycle."]
[]
[]
[null,null,"CAFM","Q4","How integrated are your FM Management IT Systems?",3]
[null,null,null,1,"No CAFM, basic spreadsheets or similar used to monitor and manage FM."]
[null,null,null,2,"Several systems in use, e.g. asset management system, CAFM, finance system, supplier system. Limited or no integration. Multiple versions of the truth."]
[null,null,null,3,"A combination of systems are used between departments and suppliers, but a recognised master system is in place, showing one version of the truth."]
[null,null,null,4,"An integrated CAFM is in use holding all but financial data, which is held in corporate finance system."]
[null,null,null,5,"Organisation has a single, integrated CAFM system holding a single version of the truth, with other key systems feeding into a master system."]
[]
[null,"Collaborative"]
[]
[null,"Collaborative","Partnership & Transparency","Q5","How closely does FM management work with the FM delivery organisation(s)?",3,null,null,"to previous section"]
[null,null,null,1,"Minimal, adversarial relationship"]
[null,null,null,2,"Weekly or monthly meetings, focused on performance and reporting",null,null,null,"to next section"]
[null,null,null,3,"Regular, joint meetings held taking both a backwards look at performance and a forward look at opportunity for improvement and upcoming changes"]
[null,null,null,4,"Genuine partnership, both sides work in an open and honest way to improve service delivery, built on trust. Very little discussion on poor performance or penalties. "]
[null,null,null,5,"A fully open and trusting relationship, working both ways to improve performance and value"]
[null,null,null,"Q6","How strategic and effective are supplier relationships?","3+"]
[null,null,null,1,"Supplier relationships are transactional only."]
[null,null,null,2,"A supplier relationship model (SRM) is in place (See CCS)"]
[null,null,null,"3+","Open and honest conversations about what can be done both sides to improve outcomes. Service plans are jointly developed with each party inputting to one another. Topics such as profit, overheads, investment and supplier sustainability are openly discussed. An effective SRM model is in place."]
[]
[]
[null,null,null,"Q7","How transparent is FM delivery between the management organisation and delivery organisation?","3+"]
{"$rows_left_out":107}
{"sheet":"Outputs >>","index":7,"n_rows":0,"n_cols":0,"rows_kept":0,"cut":false,"hidden":true,"merged":[]}

{"sheet":"Dashboard","index":8,"n_rows":112,"n_cols":15,"rows_kept":112,"cut":false,"hidden":false,"merged":[[101,14,103,14],[48,10,50,10],[48,12,50,12],[48,14,50,14],[61,13,63,13],[61,14,63,14],[73,10,75,10],[73,12,75,12],[73,14,75,14],[87,10,89,10],[87,12,89,12],[87,14,89,14],[101,1,103,6],[101,9,103,9],[101,11,103,11],[101,13,103,13],[87,1,89,6],[87,9,89,9],[87,11,89,11],[87,13,89,13],[101,10,103,10],[101,12,103,12],[12,1,12,13],[48,1,50,6],[48,9,50,9],[48,11,50,11],[48,13,50,13],[73,1,75,6],[46,1,46,8],[73,9,75,9],[73,11,75,11],[73,13,75,13],[61,9,63,9],[61,1,63,6],[61,10,63,10],[61,12,63,12],[61,11,63,11]]}
[]
[]
[null,null,null,null,null,null,null,null,null,null,null,"Check:",{"$f":"IF(Assessment!F166=Lists!C57,\"Assessment Complete\", Lists!C52)","v":"Assessment Complete"}]
[]
[]
[]
[null,null,"The dashboard below is intended to visualise your department's current placement against the Asset Management Framework. The values for each category have been drawn from the Assessment tab."]
[]
[null,null,"The overview displays the departmental score across each of the key categories included in the assessment, as per the Framework."]
[]
[null,null,"These categories are broken down further into sub-categories below to provide additional detail."]
[]
["`",{"$f":"\"Maturity Assessment – Overview\" & \": \" & Assessment!F2","v":"Maturity Assessment – Overview: e.g. Department of Education"}]
[null,null,null,null,null,null,null,null,null,null,null,1,null,2]
[]
[null,null,null,null,null,null,null,null,null,"Overview - Assessment against Standard"]
[]
[]
[]
[]
[]
[]
[]
[]
[]
[]
[]
[]
[]
[]
[]
[]
[]
[null,"Overview"]
[null,null,null,null,null,null,null,null,null,"Score",1,2,3,4,5]
[]
[null,null,"Overall Maturity Rating:",{"$f":"IFERROR(INDEX(Lists!$B$11:$B$15,MATCH(E37,Lists!$C$11:$C$15,0)),Lists!$C$52)","v":"Good"},{"$f":"MIN(E40:E44)","v":3},null,null,null,null,"Dimensions","Developing - Basic","Developing - Improving","Good","Better","Best"]
[]
[null,null,"Dimensions","Maturity Assessment","Maturity Assessment","Graph"]
[null,null,"Integrated",{"$f":"IFERROR(INDEX(Lists!$B$11:$B$15,MATCH(E40,Lists!$C$11:$C$15,0)),Lists!$C$52)","v":"Good"},{"$f":"E57","v":3},{"$f":"IF(ISTEXT(E40),LEFT(E40,1)*1,E40)","v":3},null,null,null,{"$f":"C40","v":"Integrated"},{"$f":"$E40","v":3},{"$f":"$E40","v":3},{"$f":"$E40","v":3},3,3]
[null,null,{"$f":"B62","v":"Collaborative"},{"$f":"IFERROR(INDEX(Lists!$B$11:$B$15,MATCH(Dashboard!E41,Lists!$C$11:$C$15,0)),Lists!$C$52)","v":"Good"},{"$f":"E69","v":3},{"$f":"IF(ISTEXT(E41),LEFT(E41,1)*1,E41)","v":3},{"$f":"MIN(G82:G83)","v":0},null,null,{"$f":"C41","v":"Collaborative"},{"$f":"$E41","v":3},3,{"$f":"$E41","v":3},3,3]
[null,null,{"$f":"B74","v":"Delivery Excellence"},{"$f":"IFERROR(INDEX(Lists!$B$31:$B$34,MATCH(Dashboard!E42,Lists!$C$31:$C$34,0)),Lists!$C$52)","v":"Good"},{"$f":"E83","v":3},3,null,null,null,"Delivery Excellence",{"$f":"$E42","v":3},3,{"$f":"$E42","v":3},{"$f":"$E42","v":3}]
[null,null,{"$f":"B88","v":"Strategic"},{"$f":"IFERROR(INDEX(Lists!$B$11:$B$15,MATCH(E43,Lists!$C$11:$C$15,0)),Lists!$C$52)","v":"Good"},{"$f":"E97","v":3},3,null,null,null,"Strategic",{"$f":"$E43","v":3},3,{"$f":"$E43","v":3},3,3]
[null,null,{"$f":"B102","v":"Intelligent"},{"$f":"IFERROR(INDEX(Lists!$B$31:$B$34,MATCH(Dashboard!E44,Lists!$C$31:$C$34,0)),Lists!$C$52)","v":"Good"},{"$f":"E112","v":3},3,null,null,null,"Intelligent",{"$f":"$E44","v":3},3,{"$f":"$E44","v":3},3]
[]
[]
["`","Maturity Assessment – Dimension level detail"]
[]
[null,{"$f":"Assessment!$B$19","v":"Integrated"},null,null,null,null,null,null,null,"Dimensions","Developing - Basic","Developing - Improving","Good","Better","Best"]
[]
[]
[]
[null,null,"Sub-Dimensions","Maturity Assessment","Scores"]
[null,null,{"$f":"Assessment!$C$21","v":"Integrated Leadership"},{"$f":"IFERROR(INDEX(Lists!$B$19:$B$21,MATCH(Dashboard!E54,Lists!$C$19:$C$21,0)),Lists!$C$52)","v":"Good+"},{"$f":"IF(AND(Assessment!$F$21=\"3+\",Assessment!$F$27=\"3+\",Assessment!$F$33=\"3+\"),\"3+\",MIN(Assessment!$F$21:$F$38))","v":"3+"},null,null,null,null,{"$f":"C54","v":"Integrated Leadership"},{"$f":"$E54","v":"3+"},{"$f":"$E54","v":"3+"},{"$f":"$E54","v":"3+"}]
[null,null,{"$f":"Assessment!$C$39","v":"CAFM"},{"$f":"IFERROR(INDEX(Lists!$B$11:$B$15,MATCH(E55,Lists!$C$11:$C$15,0)),Lists!$C$52)","v":"Good"},{"$f":"Assessment!F39","v":3},null,null,null,null,{"$f":"C55","v":"CAFM"},{"$f":"$E55","v":3},{"$f":"$E55","v":3},{"$f":"$E55","v":3},3,3]
[]
[null,null,"Maturity Rating:",{"$f":"IFERROR(INDEX(Lists!$B$11:$B$15,MATCH(E57,Lists!$C$11:$C$15,0)),Lists!$C$52)","v":"Good"},{"$f":"MIN(E54:E55)","v":3}]
[]
[]
[]
{"$rows_left_out":53}
{"sheet":"Workings >>","index":9,"n_rows":0,"n_cols":0,"rows_kept":0,"cut":false,"hidden":true,"merged":[]}

{"sheet":"Lists","index":10,"n_rows":59,"n_cols":4,"rows_kept":59,"cut":false,"hidden":true,"merged":[]}
[]
[]
[]
[]
[]
[]
["Inputs and scoring"]
[]
["5 level scoring"]
[null,"Stage","Score","Score (3+)"]
[null,"Developing - Basic",1,1]
[null,"Developing - Improving",2,2]
[null,"Good",3,"3+"]
[null,"Better",4]
[null,"Best",5]
[]
["3+ level scoring"]
[null,"Stage","Score"]
[null,"Developing - Basic",1]
[null,"Developing - Improving",2]
[null,"Good+","3+"]
[]
["Split level scoring"]
[null,"Developing - Basic",1]
[null,"Good",3]
[null,"Best",5]
[]
[]
["4+ level scoring"]
[null,"Stage","Score"]
[null,"Developing - Basic",1]
[null,"Developing - Improving",2]
[null,"Good",3]
[null,"Better+","4+"]
[]
["Split 4+ level scoring","Stage","Score"]
[null,"Developing - Basic",1]
[null,"Good",3]
[null,"Better+","4+"]
[]
["Chart data"]
[]
[null,null,"Standard"]
[null,{"$f":"Dashboard!C40","v":"Integrated"},3]
[null,{"$f":"Dashboard!C41","v":"Collaborative"},3]
[null,{"$f":"Dashboard!C42","v":"Delivery Excellence"},3]
[null,{"$f":"Dashboard!C43","v":"Strategic"},3]
[null,{"$f":"Dashboard!C44","v":"Intelligent"},3]
[]
["Output lists"]
[]
[null,"Incomplete note","Assessment not complete "]
[]
[]
["Questions"]
[]
[null,"Number of Questions",22]
[]
["End of sheet"]