{"text_format":"1","workbook":"xlsx","n_sheets":11,"sheets":["Introduction","Framework >>","Stages","Dimensions","Summary","Inputs >>","Assessment","Outputs >>","Dashboard","Workings >>","Lists"],"not_rendered":{"charts":1,"images":4,"macros":1,"external_links":1,"defined_names":113,"comments":0,"pivot_tables":0},"unopened":[],"bounds":{"document_bytes":16777216,"sheet_cells":100000,"rows_first":2000,"rows_last":500,"rows_between":2000,"halvings":0,"cell_chars":16384,"cell_head_chars":4096},"cells_cut":0,"cells_raw":0,"read":"whole","date_system":"1900"}

{"sheet":"Introduction","index":0,"n_rows":9,"n_cols":4,"rows_kept":9,"cut":false,"hidden":false,"merged":[]}
[]
[]
[]
[]
[]
[]
[null,"Background",null,"Objectives"]
[]
[null,"The Office of Government Property (‘OGP’) formed the Facilities Management ('FM') Strategy Programme Team in January 2020. A new cross-department FM Taskforce was established and first met in February 2020. As part of a landscape review, the FM Taskforce has identified asset data as a priority area. This will help improve facilities management across the government estate.\n\nThere are a number of reasons why actions are being taken to improve FM:\n\n• Senior Civil Servant Function Surveys – FM was identified as a key a driver behind poor performance ratings for the Property Function.\n\n• Cross-Government feedback – Senior officials and non-execs from Departments and property bodies have frequently raised concerns over services and a lack of strategy on FM.\n\n• Confidence in suppliers – In recent years FM procurements have focused on minimising costs, this has impacted on service delivery and reduced suppliers' margins. One major FM provider collapsed and the financial stability of a significant part of the marketplace was questioned.\n\n• Changing needs – The needs and demands of users have changed but approach to workplace and FM has not adapted.  A refocus is needed to ensure buildings function well, user experience improves and to address policy issues such as sustainability.\n\n• Investment in maintenance – Lack of investment, and significant backlog maintenance, is the single biggest risk across the Property Function.",null,"The objectives of the FM asset data standards include:\n\n• Collaboration and knowledge sharing – a common standard and common language across FM asset data will facilitate collaboration and knowledge sharing between departments.\n\n• Consistent reporting of FM asset data – improved aggregation and collation of FM asset data across departments will facilitate cross-government evidence-based decision making.\n\n• Improved reporting within Departments – suppliers applying consistent FM data standards will support the improvement of FM reporting within departments.\n\n• Improved data to support procurement – increased transparency and accuracy of data to support contract pricing discussions with FM suppliers; increased interoperability and transferability of data between FM suppliers when changing service providers."]

{"sheet":"Framework >>","index":1,"n_rows":0,"n_cols":0,"rows_kept":0,"cut":false,"hidden":true,"merged":[]}

{"sheet":"Stages","index":2,"n_rows":19,"n_cols":6,"rows_kept":19,"cut":false,"hidden":false,"merged":[]}
[]
[]
[]
[]
[]
[]
[null,"Maturity framework",null,null,null,"Maturity Framework Stages"]
[]
[null,"This maturity framework has been developed to assist departments in self assessing against the FM asset data standard. The maturity tool will support departments in evidencing investment requirements to adhere to the FM asset data standard. This framework is designed around five maturity stages (Developing – Basic, Developing – Improving, Good, Better, Best) and six assessment dimensions (Structure, Assurance and Quality, Ownership and Access, Systems, Usage, Team). These are detailed on the ‘Dimensions’ tab.",null,null,null,"For the purposes of the FM asset data maturity framework, the ‘Developing’ stage has been separated into two: ‘Developing – Basic’ and ‘Developing – Improving’ to allow differentiation in the levels below ‘Good’. In order to be ‘Developing - Improving’, ‘Good', ‘Better' or ‘Best’, a department would need to meet all the criteria for that level across the framework, so by default an department is ‘Developing - Basic’ if it doesn’t meet at least 'Developing - Improving’ across all six dimensions."]
[]
[]
[null,"Functional Standards Framework"]
[]
[null,"The stages in this maturity framework are aligned to the “Government Functional Standards - Handbook for assessing performance against functional standards, version 1.1”, issued 25th November 2020."]
[]
[null,"The functional standards framework sets out different levels of maturity against the most important aspects of a functional standard - from ‘Developing’, to ‘Good’ (which is the level at which the data standard is developed), to ‘Better’ and ‘Best’, as shown in figure below:"]
[]
[]
[null,null,null,null,null,"These stages are scored 1 to 5 for each question on the 'Assessment' tab."]

{"sheet":"Dimensions","index":3,"n_rows":16,"n_cols":3,"rows_kept":16,"cut":false,"hidden":false,"merged":[[8,1,8,2]]}
[]
[]
[]
[]
[]
[]
[null,"Maturity Framework"]
[]
[null,"The dimensions of the maturity framework have been defined to be closely aligned to the proposed sections of the FM asset data standard. The definition and sub components of these dimensions are detailed below:"]
[null,"Dimensions","Definition"]
[null,"Data Structure\n- Hierarchy\n- Data Specification","i. Hierarchy – The FM asset data is captured for the a clearly defined location and system hierarchy (e.g. Site > Building > Floor > Room > Space > System > Asset).\nii. Data Specification – The FM asset data is aligned to the data structure and classifications within FM data standard or tailored specifications based on specific department needs."]
[null,"Data Assurance and Quality\n- Coverage and Completeness\n- Audit\n- Data Quality Control\n- Governance ","i. Coverage and Completeness – The coverage of FM assets and completeness of data fields related to these assets.\nii. Audit – The sample surveys of assets to verify data quality and independent asset verification exercises.\niii. Data Quality Control – The processes of data quality checks, verifying data prior to updates and change controls processes.\niv. Governance – The governance and documentation around FM asset data quality and assurance. "]
[null,"Data Ownership and Access\n- Ownership\n- Accessibility","i. Ownership – The contractual ownership of the FM asset data.\nIi. Accessibility – The ability to readily access the FM asset data and control the access management to this data."]
[null,"Data Systems\n- Flexibility\n- Interoperability\n- Management","i. Flexibility – The ability of the systems to alter the data schema enabling data structure flexibility as per departmental needs and integration of specifications. \nii. Interoperability – The ability of the systems to transfer data between and connect with other systems even if they are managed by different suppliers. \niii. Management – The responsibility for the management of data systems including data security and backup procedures."]
[null,"Data Usage\n- Management Information\n- Insights","i. Management Information – The reporting and dashboarding to provide the management information related to FM assets.\nii. Insights – The use of this management information to inform decisions around contract management, compliance, maintenance schedules and investment prioritisation."]
[null,"Team Capacity and Capability\n- Capacity\n- Capability\n- Training","i. Capacity – The current capacity of data teams within the department to deliver FM data related requirements. \nii. Capability – The required skillset of the data team members to complete the required analysis, both technical data skills and FM understanding/experience.\niii. Training – The training, guidance material and knowledge sharing for the data team members for onboarding, upskilling and transitions."]

{"sheet":"Summary","index":4,"n_rows":15,"n_cols":7,"rows_kept":15,"cut":false,"hidden":false,"merged":[]}
[]
[]
[]
[]
[]
[]
[null,"Maturity Framework"]
[]
[null,"Dimensions","Developing - Basic","Developing - Improving","Good","Better","Best"]
[null,"Data Structure\n- Hierarchy\n- Data Specification","- Asset data is captured against a hierarchy which includes the site and building\n- No consistent data standards defined","- Asset data is captured against a hierarchy which includes the site, building, floor and location\n- A consistent data standard is defined for core fields but inconsistently applied across the estate","- Asset data is captured against a hierarchy which includes the site, building, floor, location and system\n- A data standard is defined for core fields and is consistently applied across the estate","- Asset data is captured against a hierarchy (from site to system) including sub components where required\n- A data standard is defined for both core and non-core fields but inconsistently applied across the estate for non-core fields","- Asset data is captured against a hierarchy (from site to system) including sub components where required\n- A data standard is defined for both core and non-core fields and consistently applied across the estate"]
[null,"Data Assurance and Quality\n- Coverage and Completeness\n- Audit\n- Data Quality Control\n- Governance","- Incomplete asset register\n- No data update, quality control and assurance processes\n- Processes are ad-hoc, with improper audit trails\n- No governance board and documented items","- Incomplete asset register with actions to address\n- Inconsistent update, audit and change control processes\n- Processes contain basic checks and traceable audit comments but applied on an ad-hoc basis\n- Governance board exists but meets on an irregular basis without all required attendees","- Complete asset register across all estates\n- Consistent update assurance and change control processes running on a regular basis\n- Verification tools for quality control based on business rules along with audit logs\n- Dedicated governance board covering all estates with the department engaged in setting policies and strategy","- Complete asset register across all estates\n- Partially automated assurance and change control processes running on a frequent basis\n- Quality control dashboards are used observing a high level of consistency across systems and high quality audit trails synchronised across systems\n- Dedicated governance board along with additional sub-working groups with suppliers","- Complete asset register across all estates\n- Automated assurance and change control processes\n- Automated controls for erroneous records, user feedback and data quality gaps\n- Dedicated governance board along with additional sub-working groups with suppliers and cross departmental governance board"]
[null,"Data Ownership and Access\n- Ownership\n- Accessibility","- Data contractually not owned by the department\n- No/limited data access\n- No/limited data access management privileges","- Data contractually owned by the department for some estates\n- Access to some data tables/extracts in some parts of the estate\n- Some access management privileges in some parts of the estate","- Data contractually owned by the department for all estates\n- Access across all data stores / all estates and ability to manually extract the required data\n- Access management privileges across all data stores these are consistently applied and tightly controlled.","- Data contractually owned by the department for all estates\n- Access across all data stores with the ability to connect using desktop tools\n- Access management privileges across all data stores these are consistently applied and tightly controlled.","- Data contractually owned by the department for all estates\n- Access across all data stores with the ability to connect using automated APIs \n- Access management privileges across all data stores these are consistently applied and tightly controlled."]
[null,"Data Systems\n- Flexibility\n- Interoperability\n- Management","- Limited flexibility of system to accommodated the data standards\n- Limited interoperability between systems\n- systems do not meet minimum security and backup management requirements","- Systems with some flexibility to accommodate the data standard but not fully and for all estate\n- Interoperability between some systems, not transferable in COBie format\n- Inconsistent common aggregation data platform\n- Some systems meet minimum security and backup management requirements","- Systems with flexibility to fully accommodate the data standards for all estates\n- Interoperability between all systems and transferable data in COBie format\n- Consistent common data aggregation platform with regularly updated data\n- All systems meet minimum security and backup management requirements","- Systems with flexibility to fully accommodate the data standards for all estates\n- Interoperability between all systems and transferable data in COBie format\n- A common data platform with frequent data updates using desktop tools\n- All systems meet minimum security and backup management requirements","- Systems with flexibility to fully accommodate the data standards for all estates\n- Interoperability between all systems and transferable data in COBie format\n- A common data platform with real-data updates using automated APIs\n- All systems meet minimum security and backup management requirements"]
[null,"Data Usage\n- Management Information\n- Insights","- None / limited reports on ad-hoc basis or based on unreliable data\n- None / limited insights","- Inaccurate reports generated from data gathered point in time\n- Some insights generated but with limitations that impact decision making","- Standardised reports  generated regularly with reliable processing and calculations\n- Data insights are generated and used to make informed decisions","- Interactive dashboards generated from frequently updated via robust data pipelines\n- Repeatable processes for generate insights and acting on these","- Ability to create bespoke customisable reports to answer the latest business questions\n- Predictive and prescriptive analytical techniques used to create forward looking insights"]
[null,"Team Capacity and Capability\n- Capacity\n- Capability\n- Training","- No dedicated personnel/working team\n- No / limited training, guidance materials or knowledge sharing","- Informal team covering some parts of the estate\n- Individuals may not be identified with roles and responsibilities\n- Team with some FM experience and data/technical understanding\n- Some irregular/inconsistent training and knowledge sharing\n- Inconsistent training materials which are reviewed and referred on an ad-hoc basis","- Dedicated team covering all estates.\nIndividuals with identified with roles and responsibilities\n- Team with FM experience and ability to extract, transform, load and report data to generate required reports and insights\n- Regular/consistent training and knowledge sharing aligned\n- Consistent training materials which are reviewed and referred regularly","- Additional sub-teams working with suppliers\n- Ability to create robust and repeatable data processes along interactive dashboard\n- Additional upskilling and knowledge sharing sessions with suppliers\n- Consistent training materials which are reviewed and referred regularly","- Additional sub-teams working with suppliers and cross-departmental teams\n- Ability to use predictive and prescriptive analytical techniques used to create forward-looking insights\n- Additional upskilling and knowledge sharing sessions across departments\n- Consistent training materials which are reviewed and referred regularly"]

{"sheet":"Inputs >>","index":5,"n_rows":0,"n_cols":0,"rows_kept":0,"cut":false,"hidden":true,"merged":[]}

{"sheet":"Assessment","index":6,"n_rows":217,"n_cols":9,"rows_kept":217,"cut":false,"hidden":false,"merged":[[20,8,21,8],[158,5,163,5],[158,6,163,6],[164,5,169,5],[170,5,175,5],[104,5,109,5],[110,5,115,5],[77,6,82,6],[65,5,70,5],[20,6,25,6],[32,6,37,6],[143,6,148,6],[53,5,58,5],[26,5,31,5],[26,6,31,6],[143,5,148,5],[185,1,214,1],[185,2,190,2],[185,5,190,5],[185,6,190,6],[191,2,196,2],[191,5,196,5],[191,6,196,6],[209,5,214,5],[209,6,214,6],[197,2,214,2],[197,5,202,5],[203,5,208,5],[197,6,202,6],[203,6,208,6],[98,1,115,1],[152,1,181,1],[152,2,157,2],[152,5,157,5],[152,6,157,6],[158,2,181,2],[176,5,181,5],[119,1,148,1],[119,2,124,2],[119,5,124,5],[119,6,124,6],[125,2,136,2],[125,5,130,5],[125,6,130,6],[131,5,136,5],[137,2,148,2],[53,2,64,2],[137,5,142,5],[137,6,142,6],[53,6,58,6],[59,5,64,5],[59,6,64,6],[77,5,82,5],[83,2,94,2],[83,5,88,5],[83,6,88,6],[98,2,103,2],[98,5,103,5],[98,6,103,6],[104,2,115,2],[89,5,94,5],[89,6,94,6],[41,5,46,5],[41,6,46,6],[47,5,52,5],[47,6,52,6],[3,3,3,4],[1,5,1,6],[12,1,12,7],[14,1,14,7],[16,1,16,7],[41,1,94,1],[65,2,82,2],[8,1,8,7],[10,1,10,7],[26,2,37,2],[20,1,37,1],[20,2,25,2],[20,5,25,5],[32,5,37,5],[41,2,52,2],[71,5,76,5],[71,6,76,6],[170,6,175,6],[176,6,181,6],[65,6,70,6],[104,6,109,6],[110,6,115,6],[131,6,136,6],[164,6,169,6]]}
[]
[null,null,null,null,"Please enter the organisation / portfolio:","e.g. Department of Education"]
[]
[null,"Dimension","Sub-Dimension","Questions",null,"Self-Assessment Score","Rationale","Navigation"]
[]
[]
[null,"User Notes"]
[]
[null,"1. The questions below allow the user to self-assess their organisation or sub organisation against the Asset Data Framework. Questions are split into categories and sub-categories, as per the Framework, to help users understand areas that may require further investigation or investment."]
[]
[null,"2. To complete the assessment, the user should select a score for each question using the dropdown cells in column F. For reference, a score of 1 is equivalent to  'Development - Basic', and a score of 5 is equivalent to 'Best'. If deemed necessary, you may also wish to add a comment in column G to provide further context for your answer / score. Once all questions are complete 'Assessment Complete' will be shown on the 'Dashboard' tab. "]
[]
[null,"3. For some questions in the assessment there are only three score 1 to 3+, as 'Best' or 'Better' level are not relevant. A score of '3+' will not limit the overall assessment for that sub-dimension to a '3'. "]
[]
[null,"4. There is further guidance and considerations for each question in the appendix of the guidance document (FM_Asset_Data_Guidance_Document_v1). Please refer to this document to support when answering the questions below."]
[]
[null,"5. This worksheet has been designed to be viewed at 90% zoom. Note: this may depend on screen resolutions. "]
[]
[null,{"$f":"B21","v":"Data Structure"}]
[]
[null,"Data Structure","Hierarchy","Q1","What level of location hierarchy is asset data captured against?","3+",null,null,"to next section"]
[null,null,null,1,"Asset level data is captured against the site and building it is in."]
[null,null,null,2,"Asset level data is captured against the site, building, floor and location it is in."]
[null,null,null,"3+","Asset level data is captured against the site, building, floor, location and system it is in."]
[]
[]
[null,null,"Data Specification","Q2","Is there a consistent data specification aligned to the FM asset data standards (4.2)?",3]
[null,null,null,1,"No defined data specification for FM asset data."]
[null,null,null,2,"Defined data specification for FM asset data is not aligned to the data standard (4.2.1)."]
[null,null,null,3,"Defined data specification for FM asset data is consistently aligned to the data standard (4.2.1)."]
[null,null,null,4,"Defined data specification for FM asset data is consistently aligned to the data standard for 'core' (4.2.1) and inconsistently aligned to 'non-core' fields (4.2.2)."]
[null,null,null,5,"Defined data specification for FM asset data is consistently aligned to the data standard for 'core' (4.2.1) and 'non-core' fields (4.2.2)."]
[null,null,null,"Q3","How consistently is the data specification applied across the estate?","3+"]
[null,null,null,1,"No defined data specification for FM asset data."]
[null,null,null,2,"The data specification is inconsistently applied across the estate."]
[null,null,null,"3+","The data specification is consistently applied across the estate."]
[]
[]
[]
[null,{"$f":"B42","v":"Data Assurance and Quality"}]
{"$rows_left_out":178}
{"sheet":"Outputs >>","index":7,"n_rows":0,"n_cols":0,"rows_kept":0,"cut":false,"hidden":true,"merged":[]}

{"sheet":"Dashboard","index":8,"n_rows":131,"n_cols":14,"rows_kept":131,"cut":false,"hidden":false,"merged":[[12,1,12,10],[53,12,55,12],[53,13,55,13],[108,11,110,11],[108,12,110,12],[81,10,83,10],[94,1,96,5],[66,1,68,5],[81,1,83,5],[108,1,110,5],[15,1,18,14],[34,2,34,13],[94,10,96,10],[51,1,51,7],[66,9,68,9],[66,10,68,10],[121,12,123,12],[121,13,123,13],[108,13,110,13],[53,11,55,11],[66,13,68,13],[121,11,123,11],[66,12,68,12],[56,11,57,11],[81,13,83,13],[94,13,96,13],[94,11,96,11],[94,12,96,12],[81,12,83,12],[81,11,83,11],[66,11,68,11],[121,1,123,5],[53,1,55,5],[108,8,110,8],[108,9,110,9],[108,10,110,10],[121,8,123,8],[121,9,123,9],[121,10,123,10],[53,8,55,8],[53,9,55,9],[53,10,55,10],[66,8,68,8],[81,8,83,8],[81,9,83,9],[94,8,96,8],[94,9,96,9]]}
[]
[]
[null,null,null,null,null,null,null,null,null,null,"Check:",{"$f":"IF(Assessment!$F$217=Lists!$C$43,\"Assessment Complete\",\"Assessment Incomplete\")","v":"Assessment Complete"}]
[]
[]
[]
[null,null,"The dashboard below is intended to visualise your department's current placement against the Asset Management Framework. The values for each category have been drawn from the Assessment tab."]
[]
[null,null,"The overview displays the departmental score across each of the key categories included in the assessment, as per the Framework."]
[]
[null,null,"These categories are broken down further into sub-categories below to provide additional detail."]
[]
["`",{"$f":"\"Maturity Assessment – Overview\" & \": \" & Assessment!$F$2","v":"Maturity Assessment – Overview: e.g. Department of Education"}]
[]
[]
[null,"Overview - Assessment against Target"]
[]
[]
[]
[]
[]
[]
[]
[]
[]
[]
[]
[]
[]
[]
[]
[]
[]
[]
[null,null,"Overview"]
[null,null,null,null,null,null,null,null,"Score",1,2,3,4,5]
[]
[null,null,null,null,null,null,null,null,null,null,null,"= Maturity Assessment",null,"= Standard"]
[]
[null,null,"Overall Maturity Rating:",{"$f":"IFERROR(INDEX(Lists!$B$11:$B$15,MATCH(E40,Lists!$C$11:$C$15,0)),Lists!$C$39)","v":"Good"},{"$f":"MIN($E$43:$E$48)","v":3},null,null,null,"Dimensions","Developing - Basic","Developing - Improving","Good","Better","Best"]
{"$rows_left_out":92}
{"sheet":"Workings >>","index":9,"n_rows":0,"n_cols":0,"rows_kept":0,"cut":false,"hidden":true,"merged":[]}

{"sheet":"Lists","index":10,"n_rows":45,"n_cols":4,"rows_kept":45,"cut":false,"hidden":true,"merged":[]}
[]
[]
[]
[]
[]
[]
["Inputs and scoring"]
[]
["5 level scoring"]
[null,"Stage","Score","Score (3+)"]
[null,"Developing - Basic",1,1]
[null,"Developing - Improving",2,2]
[null,"Good",3,"3+"]
[null,"Better",4]
[null,"Best",5]
[]
["3+ level scoring"]
[null,"Stage","Score"]
[null,"Developing - Basic",1]
[null,"Developing - Improving",2]
[null,"Good+","3+"]
[]
["2 level scoring"]
[null,"Developing - Basic",1]
[null,"Good+","3+"]
[]
["Chart data"]
[]
[null,null,"Standard"]
[null,"Data Structure",3]
[null,"Data Assurance and Quality",3]
[null,"Data Ownership and Access",3]
[null,"Data Systems",3]
[null,"Data Usage",3]
[null,"Team Capacity and Capability",3]
[]
["Output lists"]
[]
[null,"Incomplete note","Assessment not complete "]
[]
{"$rows_left_out":5}