{"text_format":"1","workbook":"xlsx","n_sheets":8,"sheets":["Notes","Summary","Engagement Score Breakdown","Engagement Score","Advocacy","Involvement","Motivation","BS"],"not_rendered":{"charts":0,"images":0,"macros":1,"external_links":2,"defined_names":19,"comments":0,"pivot_tables":0},"unopened":[],"bounds":{"document_bytes":16777216,"sheet_cells":100000,"rows_first":2000,"rows_last":500,"rows_between":2000,"halvings":0,"cell_chars":16384,"cell_head_chars":4096},"cells_cut":0,"cells_raw":0,"read":"whole","date_system":"1900"}

{"sheet":"Notes","index":0,"n_rows":3,"n_cols":1,"rows_kept":3,"cut":false,"hidden":false,"merged":[]}
[]
["National Quarterly Pulse Survey Data - Q2 2022-23"]
[": "]

{"sheet":"Summary","index":1,"n_rows":36,"n_cols":5,"rows_kept":36,"cut":false,"hidden":false,"merged":[[5,1,5,3],[7,2,7,4]]}
[]
[]
[]
[null,"National level headline figures for Quarter 2"]
[]
[null,"187 NHS service providers submitted to Q2 2022-23"]
[]
[null,null,"Quarter 2"]
[null,null,"Response count","Head Count","Score"]
[null,"Engagement",127021,1180653,6.6151309238954923]
[null,"Engagement Score - Acute and Acute & Community Trusts",84442,860520,6.3727449644150784]
[null,"Engagement Score - Acute Specialist Trusts",2846,27481,6.7038914332840571]
[null,"Engagement Score - Ambulance Trusts",3181,33668,5.3207028067452269]
[null,"Engagement Score - Community Trusts",5941,43130,6.8462602929631498]
[null,"Engagement Score - Mental Health & Learning Disability and Mental Health, Learning Disability & Community Trusts",30611,215854,6.7382630057709028]
{"$rows_left_out":22}
{"sheet":"Engagement Score Breakdown","index":2,"n_rows":196,"n_cols":13,"rows_kept":196,"cut":false,"hidden":false,"merged":[[6,12,7,12],[6,6,7,6],[6,7,7,7],[6,8,7,8],[6,9,7,9],[6,10,7,10],[6,11,7,11],[6,5,7,5],[6,0,7,0],[6,1,7,1],[6,2,7,2],[6,3,7,3],[6,4,7,4]]}
[]
[]
[]
[]
[]
[]
["Region Code","Region Name","STP Code","STP Name","Org Code","Org Name","Care Setting","Total Responses","HSCIC Workforce Headcount","Engagement Score","Advocacy","Involvement","Motivation"]
[]
[null,null,null,null,null,null,"England",127021,1180653,6.6151309238954923,6.6465998251757403,6.4622195585013174,6.7365733880094201]
["Y56","LONDON COMMISSIONING REGION","QKK",{"$f":"VLOOKUP(C10,'[2]From July 2022'!$D:$E,2,0)","v":"NHS SOUTH EAST LONDON INTEGRATED CARE BOARD"},"RJ1","GUY'S AND ST THOMAS' NHS FOUNDATION TRUST","Acute and Acute & Community Trusts",2705,22169,6.9244828256609052,7.4957374254049443,6.4714880078316197,6.8062230437461491]
["Y56","LONDON COMMISSIONING REGION","QKK",{"$f":"VLOOKUP(C11,'[2]From July 2022'!$D:$E,2,0)","v":"NHS SOUTH EAST LONDON INTEGRATED CARE BOARD"},"RJZ","KING'S COLLEGE HOSPITAL NHS FOUNDATION TRUST","Acute and Acute & Community Trusts",1285,13297,6.4831387808041505,6.7107652399481195,6.2918287937743189,6.4468223086900123]
["Y56","LONDON COMMISSIONING REGION","QKK",{"$f":"VLOOKUP(C12,'[2]From July 2022'!$D:$E,2,0)","v":"NHS SOUTH EAST LONDON INTEGRATED CARE BOARD"},"RJ2","LEWISHAM AND GREENWICH NHS TRUST","Acute and Acute & Community Trusts",433,6850,6.023222992045163,5.8294842186297151,5.9699769053117784,6.2702078521939955]
["Y56","LONDON COMMISSIONING REGION","QKK",{"$f":"VLOOKUP(C13,'[2]From July 2022'!$D:$E,2,0)","v":"NHS SOUTH EAST LONDON INTEGRATED CARE BOARD"},"RV5","SOUTH LONDON AND MAUDSLEY NHS FOUNDATION TRUST","Mental Health & Learning Disability and Mental Health, Learning Disability & Community Trusts",195,5486,6.5470085470085477,6.1623931623931627,7.0641025641025639,6.4145299145299139]
["Y56","LONDON COMMISSIONING REGION","QMF",{"$f":"VLOOKUP(C14,'[2]From July 2022'!$D:$E,2,0)","v":"NHS NORTH EAST LONDON INTEGRATED CARE BOARD"},"R1H","BARTS HEALTH NHS TRUST","Acute and Acute & Community Trusts",435,17203,6.0114942528735638,5.9176245210727965,5.8869731800766285,6.2298850574712645]
["Y56","LONDON COMMISSIONING REGION","QMF",{"$f":"VLOOKUP(C15,'[2]From July 2022'!$D:$E,2,0)","v":"NHS NORTH EAST LONDON INTEGRATED CARE BOARD"},"RWK","EAST LONDON NHS FOUNDATION TRUST","Mental Health & Learning Disability and Mental Health, Learning Disability & Community Trusts",906,6545,7.1391381490719228,7.2976453274466522,6.9678932178932174,7.1518759018759015]
{"$rows_left_out":182}
{"sheet":"Engagement Score","index":3,"n_rows":196,"n_cols":10,"rows_kept":196,"cut":false,"hidden":false,"merged":[[6,5,7,5],[6,6,7,6],[6,7,7,7],[6,8,7,8],[6,9,7,9],[6,0,7,0],[6,1,7,1],[6,2,7,2],[6,3,7,3],[6,4,7,4]]}
[]
[]
[]
[]
[]
[]
["Region Code","Region Name","STP Code","STP Name","Org Code","Org Name","Care Setting","Total Responses","HSCIC Workforce Headcount","Engagement Score"]
[]
[null,null,null,null,null,null,"England",127021,1180653,6.6151309238954923]
["Y56","LONDON COMMISSIONING REGION","QKK","NHS SOUTH EAST LONDON INTEGRATED CARE BOARD","RJ1","GUY'S AND ST THOMAS' NHS FOUNDATION TRUST","Acute and Acute & Community Trusts",2705,22169,6.9244828256609052]
["Y56","LONDON COMMISSIONING REGION","QKK","NHS SOUTH EAST LONDON INTEGRATED CARE BOARD","RJZ","KING'S COLLEGE HOSPITAL NHS FOUNDATION TRUST","Acute and Acute & Community Trusts",1285,13297,6.4831387808041505]
["Y56","LONDON COMMISSIONING REGION","QKK","NHS SOUTH EAST LONDON INTEGRATED CARE BOARD","RJ2","LEWISHAM AND GREENWICH NHS TRUST","Acute and Acute & Community Trusts",433,6850,6.023222992045163]
["Y56","LONDON COMMISSIONING REGION","QKK","NHS SOUTH EAST LONDON INTEGRATED CARE BOARD","RV5","SOUTH LONDON AND MAUDSLEY NHS FOUNDATION TRUST","Mental Health & Learning Disability and Mental Health, Learning Disability & Community Trusts",195,5486,6.5470085470085477]
["Y56","LONDON COMMISSIONING REGION","QMF","NHS NORTH EAST LONDON INTEGRATED CARE BOARD","R1H","BARTS HEALTH NHS TRUST","Acute and Acute & Community Trusts",435,17203,6.0114942528735638]
["Y56","LONDON COMMISSIONING REGION","QMF","NHS NORTH EAST LONDON INTEGRATED CARE BOARD","RWK","EAST LONDON NHS FOUNDATION TRUST","Mental Health & Learning Disability and Mental Health, Learning Disability & Community Trusts",906,6545,7.1391381490719228]
{"$rows_left_out":182}
{"sheet":"Advocacy","index":4,"n_rows":196,"n_cols":10,"rows_kept":196,"cut":false,"hidden":false,"merged":[[6,6,7,6],[6,7,7,7],[6,8,7,8],[6,9,7,9],[6,5,7,5],[6,0,7,0],[6,1,7,1],[6,2,7,2],[6,3,7,3],[6,4,7,4]]}
[]
[]
[]
[]
[]
[]
["Region Code","Region Name","STP Code","STP Name","Org Code","Org Name","Care Setting","Total Responses","HSCIC Workforce Headcount","Advocacy Score"]
[]
[null,null,null,null,null,"England",null,127366,1180653,6.6465998251757403]
["Y56","LONDON COMMISSIONING REGION","QKK","NHS SOUTH EAST LONDON INTEGRATED CARE BOARD","RJ1","GUY'S AND ST THOMAS' NHS FOUNDATION TRUST","Acute and Acute & Community Trusts",2737,22169,7.4957374254049443]
["Y56","LONDON COMMISSIONING REGION","QKK","NHS SOUTH EAST LONDON INTEGRATED CARE BOARD","RJZ","KING'S COLLEGE HOSPITAL NHS FOUNDATION TRUST","Acute and Acute & Community Trusts",1285,13297,6.7107652399481195]
["Y56","LONDON COMMISSIONING REGION","QKK","NHS SOUTH EAST LONDON INTEGRATED CARE BOARD","RJ2","LEWISHAM AND GREENWICH NHS TRUST","Acute and Acute & Community Trusts",433,6850,5.8294842186297151]
["Y56","LONDON COMMISSIONING REGION","QKK","NHS SOUTH EAST LONDON INTEGRATED CARE BOARD","RV5","SOUTH LONDON AND MAUDSLEY NHS FOUNDATION TRUST","Mental Health & Learning Disability and Mental Health, Learning Disability & Community Trusts",195,5486,6.1623931623931627]
["Y56","LONDON COMMISSIONING REGION","QMF","NHS NORTH EAST LONDON INTEGRATED CARE BOARD","R1H","BARTS HEALTH NHS TRUST","Acute and Acute & Community Trusts",435,17203,5.9176245210727965]
["Y56","LONDON COMMISSIONING REGION","QMF","NHS NORTH EAST LONDON INTEGRATED CARE BOARD","RWK","EAST LONDON NHS FOUNDATION TRUST","Mental Health & Learning Disability and Mental Health, Learning Disability & Community Trusts",906,6545,7.2976453274466522]
{"$rows_left_out":182}
{"sheet":"Involvement","index":5,"n_rows":196,"n_cols":10,"rows_kept":196,"cut":false,"hidden":false,"merged":[[6,6,7,6],[6,7,7,7],[6,8,7,8],[6,9,7,9],[6,5,7,5],[6,0,7,0],[6,1,7,1],[6,2,7,2],[6,3,7,3],[6,4,7,4]]}
[]
[]
[]
[]
[]
[]
["Region Code","Region Name","STP Code","STP Name","Org Code","Org Name","Care Setting","Total Responses","HSCIC Workforce Headcount","Involvement Score"]
[]
[null,null,null,null,null,"England",null,127641,1180653,6.4622195585013174]
["Y56","LONDON COMMISSIONING REGION","QKK","NHS SOUTH EAST LONDON INTEGRATED CARE BOARD","RJ1","GUY'S AND ST THOMAS' NHS FOUNDATION TRUST","Acute and Acute & Community Trusts",2724,22169,6.4714880078316197]
["Y56","LONDON COMMISSIONING REGION","QKK","NHS SOUTH EAST LONDON INTEGRATED CARE BOARD","RJZ","KING'S COLLEGE HOSPITAL NHS FOUNDATION TRUST","Acute and Acute & Community Trusts",1285,13297,6.2918287937743189]
["Y56","LONDON COMMISSIONING REGION","QKK","NHS SOUTH EAST LONDON INTEGRATED CARE BOARD","RJ2","LEWISHAM AND GREENWICH NHS TRUST","Acute and Acute & Community Trusts",433,6850,5.9699769053117784]
["Y56","LONDON COMMISSIONING REGION","QKK","NHS SOUTH EAST LONDON INTEGRATED CARE BOARD","RV5","SOUTH LONDON AND MAUDSLEY NHS FOUNDATION TRUST","Mental Health & Learning Disability and Mental Health, Learning Disability & Community Trusts",195,5486,7.0641025641025639]
["Y56","LONDON COMMISSIONING REGION","QMF","NHS NORTH EAST LONDON INTEGRATED CARE BOARD","R1H","BARTS HEALTH NHS TRUST","Acute and Acute & Community Trusts",435,17203,5.8869731800766285]
["Y56","LONDON COMMISSIONING REGION","QMF","NHS NORTH EAST LONDON INTEGRATED CARE BOARD","RWK","EAST LONDON NHS FOUNDATION TRUST","Mental Health & Learning Disability and Mental Health, Learning Disability & Community Trusts",924,6545,6.9678932178932174]
{"$rows_left_out":182}
{"sheet":"Motivation","index":6,"n_rows":196,"n_cols":10,"rows_kept":196,"cut":false,"hidden":false,"merged":[[6,6,7,6],[6,7,7,7],[6,8,7,8],[6,9,7,9],[6,5,7,5],[6,0,7,0],[6,1,7,1],[6,2,7,2],[6,3,7,3],[6,4,7,4]]}
[]
[]
[]
[]
[]
[]
["Region Code","Region Name","STP Code","STP Name","Org Code","Org Name","Care Setting","Total Responses","HSCIC Workforce Headcount","Motivation Score"]
[]
[null,null,null,null,null,"England",null,127539,1180653,6.7365733880094201]
["Y56","LONDON COMMISSIONING REGION","QKK","NHS SOUTH EAST LONDON INTEGRATED CARE BOARD","RJ1","GUY'S AND ST THOMAS' NHS FOUNDATION TRUST","Acute and Acute & Community Trusts",2705,22169,6.8062230437461491]
["Y56","LONDON COMMISSIONING REGION","QKK","NHS SOUTH EAST LONDON INTEGRATED CARE BOARD","RJZ","KING'S COLLEGE HOSPITAL NHS FOUNDATION TRUST","Acute and Acute & Community Trusts",1285,13297,6.4468223086900123]
["Y56","LONDON COMMISSIONING REGION","QKK","NHS SOUTH EAST LONDON INTEGRATED CARE BOARD","RJ2","LEWISHAM AND GREENWICH NHS TRUST","Acute and Acute & Community Trusts",433,6850,6.2702078521939955]
["Y56","LONDON COMMISSIONING REGION","QKK","NHS SOUTH EAST LONDON INTEGRATED CARE BOARD","RV5","SOUTH LONDON AND MAUDSLEY NHS FOUNDATION TRUST","Mental Health & Learning Disability and Mental Health, Learning Disability & Community Trusts",195,5486,6.4145299145299139]
["Y56","LONDON COMMISSIONING REGION","QMF","NHS NORTH EAST LONDON INTEGRATED CARE BOARD","R1H","BARTS HEALTH NHS TRUST","Acute and Acute & Community Trusts",435,17203,6.2298850574712645]
["Y56","LONDON COMMISSIONING REGION","QMF","NHS NORTH EAST LONDON INTEGRATED CARE BOARD","RWK","EAST LONDON NHS FOUNDATION TRUST","Mental Health & Learning Disability and Mental Health, Learning Disability & Community Trusts",924,6545,7.1518759018759015]
{"$rows_left_out":182}
{"sheet":"BS","index":7,"n_rows":188,"n_cols":41,"rows_kept":188,"cut":false,"hidden":true,"merged":[]}
[null,"Sort","Region (Geography) code","Region (Geography) name","Org code","Org name","STP Code","STP Name","Org Type",null,"Sort Lists:","Sort range…","Sort range…","Region (Geography) Reference Lists:","Code…","Name…","Region (Geography) Linked Lists:","Code…","Name…","STP Reference List:","Code…","Code…","Name…","STP Linked List:","Code…","Name…","Orgs Reference List:","Code…","Code…","Code…","Name…","Type…","Orgs Linked List:","Code…","Name…","Type…","Org Type Reference List:","Type…",null,"Org Type Linked List:","Type…"]
["Engagement Score Breakdown",1,1,1,1,1,1,1,1,null,null,"Region Code","Region Code",null,"Y56","LONDON COMMISSIONING REGION",null,"Y56","LONDON COMMISSIONING REGION",null,"Y60","QNC","NHS STAFFORDSHIRE AND STOKE-ON-TRENT INTEGRATED CARE BOARD",null,"QE1","NHS LANCASHIRE AND SOUTH CUMBRIA INTEGRATED CARE BOARD",null,"Y56","QMF","R1H","BARTS HEALTH NHS TRUST","Acute and Acute & Community Trusts",null,"R0A","AIREDALE NHS FOUNDATION TRUST","Acute and Acute & Community Trusts",null,"Acute",null,null,"Acute and Acute & Community Trusts"]
["All Engagement Scores",1,1,1,1,1,1,1,1,null,null,"Region Name","Region Name",null,"Y58","SOUTH WEST COMMISSIONING REGION",null,"Y58","SOUTH WEST COMMISSIONING REGION",null,"Y58","QT6","NHS CORNWALL AND THE ISLES OF SCILLY INTEGRATED CARE BOARD",null,"QF7","NHS SOUTH YORKSHIRE INTEGRATED CARE BOARD",null,"Y56","QMJ","RAL","ROYAL FREE LONDON NHS FOUNDATION TRUST","Acute and Acute & Community Trusts",null,"R0B","ALDER HEY CHILDREN'S NHS FOUNDATION TRUST","Acute and Acute & Community Trusts",null,"Mental Health",null,null,"Acute Specialist Trusts"]
["Engagement Score",1,1,1,1,1,1,1,1,null,null,"STP Code","STP Code",null,"Y59","SOUTH EAST COMMISSIONING REGION",null,"Y59","SOUTH EAST COMMISSIONING REGION",null,"Y61","QHG","NHS BEDFORDSHIRE, LUTON AND MILTON KEYNES INTEGRATED CARE BOARD",null,"QGH","NHS HEREFORDSHIRE AND WORCESTERSHIRE INTEGRATED CARE BOARD",null,"Y56","QRV","RAN","ROYAL NATIONAL ORTHOPAEDIC HOSPITAL NHS TRUST","Acute Specialist Trusts",null,"R0D","AVON AND WILTSHIRE MENTAL HEALTH PARTNERSHIP NHS TRUST","Acute and Acute & Community Trusts",null,"Ambulance",null,null,"Mental Health & Learning Disability and Mental Health, Learning Disability & Community Trusts"]
["Advocacy",1,1,1,1,1,1,1,1,null,null,"STP Name","STP Name",null,"Y60","MIDLANDS COMMISSIONING REGION",null,"Y60","MIDLANDS COMMISSIONING REGION",null,"Y61","QH8","NHS MID AND SOUTH ESSEX INTEGRATED CARE BOARD",null,"QH8","NHS MID AND SOUTH ESSEX INTEGRATED CARE BOARD",null,"Y56","QMJ","RAP","NORTH MIDDLESEX UNIVERSITY HOSPITAL NHS TRUST","Acute and Acute & Community Trusts",null,"R1A","BARNET, ENFIELD AND HARINGEY MENTAL HEALTH NHS TRUST","Acute and Acute & Community Trusts",null,"Community",null,null,"Community Trusts"]
["Involvement",1,1,1,1,1,1,1,1,null,null,"Org Code","Org Code",null,"Y61","EAST OF ENGLAND COMMISSIONING REGION",null,"Y61","EAST OF ENGLAND COMMISSIONING REGION",null,"Y58","QUY","NHS BRISTOL, NORTH SOMERSET AND SOUTH GLOUCESTERSHIRE INTEGRATED CARE BOARD",null,"QHG","NHS BEDFORDSHIRE, LUTON AND MILTON KEYNES INTEGRATED CARE BOARD",null,"Y56","QRV","RAS","THE HILLINGDON HOSPITALS NHS FOUNDATION TRUST","Acute and Acute & Community Trusts",null,"R1C","BARNSLEY HOSPITAL NHS FOUNDATION TRUST","Acute and Acute & Community Trusts",null,null,null,null,"Ambulance Trusts"]
["Motivation",1,1,1,1,1,1,1,1,null,null,"Org Name","Org Name",null,"Y62","NORTH WEST COMMISSIONING REGION",null,"Y62","NORTH WEST COMMISSIONING REGION",null,"Y58","QR1","NHS GLOUCESTERSHIRE INTEGRATED CARE BOARD",null,"QHL","NHS BIRMINGHAM AND SOLIHULL INTEGRATED CARE BOARD",null,"Y56","QMF","RAT","NORTH EAST LONDON NHS FOUNDATION TRUST","Mental Health & Learning Disability and Mental Health, Learning Disability & Community Trusts",null,"R1D","BARTS HEALTH NHS TRUST","Acute and Acute & Community Trusts"]
[null,null,null,null,null,null,null,null,null,null,null,"Org Type","Org Type",null,"Y63","NORTH EAST AND YORKSHIRE COMMISSIONING REGION",null,"Y63","NORTH EAST AND YORKSHIRE COMMISSIONING REGION",null,"Y60","QOC","NHS SHROPSHIRE, TELFORD AND WREKIN INTEGRATED CARE BOARD",null,"QHM","NHS NORTH EAST AND NORTH CUMBRIA INTEGRATED CARE BOARD",null,"Y56","QKK","RJ1","GUY'S AND ST THOMAS' NHS FOUNDATION TRUST","Acute and Acute & Community Trusts",null,"R1F","BERKSHIRE HEALTHCARE NHS FOUNDATION TRUST","Acute and Acute & Community Trusts"]
[null,null,null,null,null,null,null,null,null,null,null,"Total Responses","Total Responses",null,null,null,null,null,null,null,"Y58","QSL","NHS SOMERSET INTEGRATED CARE BOARD",null,"QJ2","NHS DERBY AND DERBYSHIRE INTEGRATED CARE BOARD",null,"Y56","QKK","RJ2","LEWISHAM AND GREENWICH NHS TRUST","Acute and Acute & Community Trusts",null,"R1H","BIRMINGHAM AND SOLIHULL MENTAL HEALTH NHS FOUNDATION TRUST","Acute and Acute & Community Trusts"]
[null,null,null,null,null,null,null,null,null,null,null,"HSCIC Workforce Headcount","HSCIC Workforce Headcount",null,null,null,null,null,null,null,"Y60","QGH","NHS HEREFORDSHIRE AND WORCESTERSHIRE INTEGRATED CARE BOARD",null,"QJG","NHS SUFFOLK AND NORTH EAST ESSEX INTEGRATED CARE BOARD",null,"Y56","QWE","RJ7","ST GEORGE'S UNIVERSITY HOSPITALS NHS FOUNDATION TRUST","Acute and Acute & Community Trusts",null,"R1L","BIRMINGHAM COMMUNITY HEALTHCARE NHS FOUNDATION TRUST","Acute and Acute & Community Trusts"]
[null,null,null,null,null,null,null,null,null,null,null,"Score","Score",null,null,null,null,null,null,null,"Y59","QXU","NHS SURREY HEARTLANDS INTEGRATED CARE BOARD",null,"QJK","NHS DEVON INTEGRATED CARE BOARD",null,"Y56","QKK","RJZ","KING'S COLLEGE HOSPITAL NHS FOUNDATION TRUST","Acute and Acute & Community Trusts",null,"RA4","BLACK COUNTRY HEALTHCARE NHS FOUNDATION TRUST","Acute and Acute & Community Trusts"]
[null,null,null,null,null,null,null,null,null,null,null,null,null,null,null,null,null,null,null,null,"Y60","QWU","NHS COVENTRY AND WARWICKSHIRE INTEGRATED CARE BOARD",null,"QJM","NHS LINCOLNSHIRE INTEGRATED CARE BOARD",null,"Y56","QMJ","RKE","WHITTINGTON HEALTH NHS TRUST","Acute and Acute & Community Trusts",null,"RA7","BLACKPOOL TEACHING HOSPITALS NHS FOUNDATION TRUST","Acute and Acute & Community Trusts"]
[null,null,null,null,null,null,null,null,null,null,null,null,null,null,null,null,null,null,null,null,"Y60","QK1","NHS LEICESTER, LEICESTERSHIRE AND RUTLAND INTEGRATED CARE BOARD",null,"QK1","NHS LEICESTER, LEICESTERSHIRE AND RUTLAND INTEGRATED CARE BOARD",null,"Y56","QMJ","RNK","TAVISTOCK AND PORTMAN NHS FOUNDATION TRUST","Mental Health & Learning Disability and Mental Health, Learning Disability & Community Trusts",null,"RA9","BOLTON NHS FOUNDATION TRUST","Acute and Acute & Community Trusts"]
[null,null,null,null,null,null,null,null,null,null,null,null,null,null,null,null,null,null,null,null,"Y63","QOQ","NHS HUMBER AND NORTH YORKSHIRE INTEGRATED CARE BOARD",null,"QKK","NHS SOUTH EAST LONDON INTEGRATED CARE BOARD",null,"Y56","QMJ","RP4","GREAT ORMOND STREET HOSPITAL FOR CHILDREN NHS FOUNDATION TRUST","Acute Specialist Trusts",null,"RAE","BRADFORD DISTRICT CARE NHS FOUNDATION TRUST","Acute and Acute & Community Trusts"]
[null,null,null,null,null,null,null,null,null,null,null,null,null,null,null,null,null,null,null,null,"Y60","QHL","NHS BIRMINGHAM AND SOLIHULL INTEGRATED CARE BOARD",null,"QKS","NHS KENT AND MEDWAY INTEGRATED CARE BOARD",null,"Y56","QMJ","RP6","MOORFIELDS EYE HOSPITAL NHS FOUNDATION TRUST","Acute Specialist Trusts",null,"RAL","BRADFORD TEACHING HOSPITALS NHS FOUNDATION TRUST","Acute and Acute & Community Trusts"]
{"$rows_left_out":173}