{"text_format":"1","workbook":"xlsx","n_sheets":6,"sheets":["Notes","Summary","ICB","Trusts","Sites","BS"],"not_rendered":{"charts":0,"images":0,"macros":1,"external_links":1,"defined_names":5,"comments":0,"pivot_tables":0},"unopened":[],"bounds":{"document_bytes":16777216,"sheet_cells":100000,"rows_first":2000,"rows_last":500,"rows_between":2000,"halvings":0,"cell_chars":16384,"cell_head_chars":4096},"cells_cut":0,"cells_raw":0,"read":"whole","date_system":"1900"}

{"sheet":"Notes","index":0,"n_rows":2,"n_cols":8,"rows_kept":2,"cut":false,"hidden":false,"merged":[[1,1,1,4]]}
[]
[null,"A&E Friends and Family Test (FFT) data - July 2022",null,null,null,null,null,"  Show data for:"]

{"sheet":"Summary","index":1,"n_rows":7,"n_cols":10,"rows_kept":7,"cut":false,"hidden":false,"merged":[[2,1,3,1],[2,4,2,5],[2,6,2,7],[2,8,2,9]]}
[]
[]
[null,"FFT","Number of organisations submitting","Total responses to date","Responses",null,"Percentage Positive",null,"Percentage Negative"]
[null,null,"2022-07-01","2022-07-01","2022-07-01","2022-06-26","2022-07-01","2022-06-26","2022-07-01","2022-06-26"]
[null,"A&E Total",121,12975414,114530,114471,0.74515847376233302,0.74342846659852713,0.17353531825722518,0.17284727136130548]
[null,"Acute Type 1&2",99,12288318,107884,107675,0.74372474138889921,0.74000464360343632,0.17470616588187313,0.17537961458091478]
[null,"WiCs & MIUs",22,687096,6646,6796,0.76843213963286183,0.7976751030017657,0.15452904002407464,0.13272513243084166]

{"sheet":"ICB","index":2,"n_rows":48,"n_cols":12,"rows_kept":48,"cut":false,"hidden":false,"merged":[[2,6,2,11],[2,0,3,0],[2,1,3,1],[2,2,3,2],[2,3,3,3],[2,4,3,4],[2,5,3,5]]}
[]
[]
["ICB Code","ICB Name","Total Responses","Total Eligible","Percentage Positive","Percentage Negative","Breakdown of Responses"]
[null,null,null,null,null,null,"Very Good","Good","Neither Good nor Poor","Poor","Very Poor","Don't Know"]
[null,"England",114530,1149903,0.74515847376233302,0.17353531825722518,63866,21477,7712,7090,12785,1600]
[null,"Selection (excluding suppressed data)",{"$f":"SUBTOTAL(9,C7:C48)","v":114530},{"$f":"SUBTOTAL(9,D7:D48)","v":1149903},{"$f":"IFERROR((G6+H6)/C6, \"-\")","v":0.74515847376233302},{"$f":"IFERROR((J6+K6)/C6, \"-\")","v":0.17353531825722518},{"$f":"SUBTOTAL(9,G7:G48)","v":63866},21477,7712,7090,12785,1600]
["QE1",{"$f":"VLOOKUP($A7,'[1]Correct ICB'!$A$1:$B$42,2,0)","v":"LANCASHIRE AND SOUTH CUMBRIA ICB"},3506,27710,0.7430119794637764,0.17455790074158586,1973,632,262,204,408,27]
["QF7",{"$f":"VLOOKUP($A8,'[1]Correct ICB'!$A$1:$B$42,2,0)","v":"SOUTH YORKSHIRE ICB"},2050,35039,0.78487804878048784,0.13365853658536586,1274,335,142,105,169,25]
["QGH",{"$f":"VLOOKUP($A9,'[1]Correct ICB'!$A$1:$B$42,2,0)","v":"HEREFORDSHIRE AND WORCESTERSHIRE ICB"},2047,17166,0.86956521739130432,9.3795798729848556E-2,1622,158,74,75,117,1]
["QH8",{"$f":"VLOOKUP($A10,'[1]Correct ICB'!$A$1:$B$42,2,0)","v":"MID AND SOUTH ESSEX ICB"},3061,14506,0.72688663835347922,0.18000653381247958,1567,658,228,191,360,57]
["QHG",{"$f":"VLOOKUP($A11,'[1]Correct ICB'!$A$1:$B$42,2,0)","v":"BEDFORDSHIRE, LUTON AND MILTON KEYNES ICB"},678,21928,0.73008849557522126,0.15781710914454278,297,198,71,45,62,5]
["QHL",{"$f":"VLOOKUP($A12,'[1]Correct ICB'!$A$1:$B$42,2,0)","v":"BIRMINGHAM AND SOLIHULL ICB"},4026,32391,0.63487332339791358,0.26751117734724295,1844,712,286,332,745,107]
["QHM",{"$f":"VLOOKUP($A13,'[1]Correct ICB'!$A$1:$B$42,2,0)","v":"NORTH EAST AND NORTH CUMBRIA ICB"},2793,83658,0.81310418904403869,0.12495524525599713,1780,491,162,136,213,11]
["QJ2",{"$f":"VLOOKUP($A14,'[1]Correct ICB'!$A$1:$B$42,2,0)","v":"DERBY AND DERBYSHIRE ICB"},1953,16194,0.7547363031233999,0.16538658474142345,1055,419,149,137,186,7]
["QJG",{"$f":"VLOOKUP($A15,'[1]Correct ICB'!$A$1:$B$42,2,0)","v":"SUFFOLK AND NORTH EAST ESSEX ICB"},3353,21469,0.81538920369818069,0.11691022964509394,2095,639,196,156,236,31]
["QJK",{"$f":"VLOOKUP($A16,'[1]Correct ICB'!$A$1:$B$42,2,0)","v":"DEVON ICB"},57,32307,0.91228070175438591,7.0175438596491224E-2,48,4,1,1,3,0]
["QJM",{"$f":"VLOOKUP($A17,'[1]Correct ICB'!$A$1:$B$42,2,0)","v":"LINCOLNSHIRE ICB"},1463,2728,0.75187969924812026,0.1572112098427888,777,323,125,91,139,8]
["QK1",{"$f":"VLOOKUP($A18,'[1]Correct ICB'!$A$1:$B$42,2,0)","v":"LEICESTER, LEICESTERSHIRE AND RUTLAND ICB"},2415,15359,0.80496894409937891,0.13871635610766045,1286,658,120,110,225,16]
["QKK",{"$f":"VLOOKUP($A19,'[1]Correct ICB'!$A$1:$B$42,2,0)","v":"SOUTH EAST LONDON ICB"},2546,40390,0.72977219167321283,0.1779261586802828,1236,622,216,156,297,19]
["QKS",{"$f":"VLOOKUP($A20,'[1]Correct ICB'!$A$1:$B$42,2,0)","v":"KENT AND MEDWAY ICB"},3429,44628,0.7567804024496938,0.17614464858559348,1939,656,216,233,371,14]
{"$rows_left_out":29}
{"sheet":"Trusts","index":3,"n_rows":127,"n_cols":20,"rows_kept":127,"cut":false,"hidden":false,"merged":[[2,6,3,6],[2,7,2,12],[2,13,2,19],[2,0,3,0],[2,1,3,1],[2,2,3,2],[2,3,3,3],[2,4,3,4],[2,5,3,5]]}
[]
[]
["ICB Code","Trust Code","Trust Name","Total Responses","Total Eligible","Percentage Positive","Percentage Negative","Breakdown of Responses",null,null,null,null,null,"Mode of Collection"]
[null,null,null,null,null,null,null,"Very Good","Good","Neither Good nor Poor","Poor","Very Poor","Don't Know","Mode SMS","Mode Electronic Discharge","Mode Paper Discharge","Mode Paper Home","Mode Telephone","Mode Online","Mode Other"]
[null,null,"England",114530,1149903,0.74515847376233302,0.17353531825722518,63866,21477,7712,7090,12785,1600,90395,1454,2906,777,7245,10481,1272]
[null,null,"Selection (excluding suppressed data)",{"$f":"SUBTOTAL(9,D7:D999)","v":114530},{"$f":"SUBTOTAL(9,E7:E999)","v":1149903},{"$f":"IFERROR((H6+I6)/D6, \"-\")","v":0.73812101632759974},{"$f":"IFERROR((K6+L6)/D6, \"-\")","v":0.17155330481096656},{"$f":"SUBTOTAL(9,H7:H999)","v":63290},{"$f":"SUBTOTAL(9,I7:I999)","v":21247},7635,7010,12638,1585,89320,1454,2899,777,7245,10438,1272]
["QE1","RXL","BLACKPOOL TEACHING HOSPITALS NHS FOUNDATION TRUST",312,4108,0.66346153846153844,0.25,151,56,27,29,49,0,274,0,0,34,0,4,0]
["QE1","RXR","EAST LANCASHIRE HOSPITALS NHS TRUST",1060,11131,0.65943396226415096,0.24339622641509434,474,225,89,79,179,14,994,0,3,0,0,63,0]
["QE1","RXN","LANCASHIRE TEACHING HOSPITALS NHS FOUNDATION TRUST",516,4003,0.71511627906976749,0.19767441860465115,282,87,45,37,65,0,472,0,5,0,38,1,0]
["QE1","RTX","UNIVERSITY HOSPITALS OF MORECAMBE BAY NHS FOUNDATION TRUST",1618,8468,0.82200247218788625,0.10754017305315204,1066,264,101,59,115,13,1424,0,0,0,194,0,0]
["QF7","RP5","DONCASTER AND BASSETLAW TEACHING HOSPITALS NHS FOUNDATION TRUST",4,14988,"*","*","*","*","*","*","*","*","*","*","*","*","*","*","*"]
["QF7","RCU","SHEFFIELD CHILDREN'S NHS FOUNDATION TRUST",628,5367,0.77070063694267521,0.12101910828025478,378,106,61,32,44,7,0,0,0,0,627,1,0]
["QF7","RHQ","SHEFFIELD TEACHING HOSPITALS NHS FOUNDATION TRUST",1415,6614,0.79151943462897523,0.13851590106007067,892,228,81,73,123,18,1312,0,0,0,103,0,0]
["QF7","RFR","THE ROTHERHAM NHS FOUNDATION TRUST",3,8070,"*","*","*","*","*","*","*","*","*","*","*","*","*","*","*"]
["QGH","RWP","WORCESTERSHIRE ACUTE HOSPITALS NHS TRUST",2047,11125,0.86956521739130432,9.3795798729848556E-2,1622,158,74,75,117,1,2047,0,0,0,0,0,0]
["QGH","RLQ","WYE VALLEY NHS TRUST",0,6041,"NA","NA",0,0,0,0,0,0,0,0,0,0,0,0,0]
["QH8","RAJ","MID AND SOUTH ESSEX NHS FOUNDATION TRUST",3061,14506,0.72688663835347922,0.18000653381247958,1567,658,228,191,360,57,2744,0,0,0,308,9,0]
["QHG","RC9","BEDFORDSHIRE HOSPITALS NHS FOUNDATION TRUST",98,13533,0.69387755102040816,0.26530612244897961,56,12,3,6,20,1,0,55,0,0,0,43,0]
["QHG","RD8","MILTON KEYNES UNIVERSITY HOSPITAL NHS FOUNDATION TRUST",580,8395,0.73620689655172411,0.1396551724137931,241,186,68,39,42,4,559,0,0,9,0,12,0]
["QHL","RQ3","BIRMINGHAM WOMEN'S AND CHILDREN'S NHS FOUNDATION TRUST",75,4265,0.82666666666666666,0.14666666666666667,47,15,2,6,5,0,0,0,0,0,0,75,0]
{"$rows_left_out":108}
{"sheet":"Sites","index":4,"n_rows":233,"n_cols":15,"rows_kept":233,"cut":false,"hidden":false,"merged":[[2,6,3,6],[2,7,3,7],[2,8,3,8],[2,9,2,14],[2,0,3,0],[2,1,3,1],[2,2,3,2],[2,3,3,3],[2,4,3,4],[2,5,3,5]]}
[]
[]
["ICB Code","Trust Code","Trust Name","Site Code","Site Name","Total Responses","Total Eligible","Percentage Positive","Percentage Negative","Breakdown of Responses"]
[null,null,null,null,null,null,null,null,null,"Very Good","Good","Neither Good nor Poor","Poor","Very Poor","Don't Know"]
[null,null,null,null,"England",114530,1149903,0.74515847376233302,0.17353531825722518,63866,21477,7712,7090,12785,1600]
[null,null,null,null,"Selection (excluding suppressed data)",{"$f":"SUBTOTAL(9,F7:F999)","v":114530},{"$f":"SUBTOTAL(9,G7:G999)","v":1149903},{"$f":"IFERROR((J6+K6)/F6, \"-\")","v":0.73630489827992662},{"$f":"IFERROR((M6+N6)/F6, \"-\")","v":0.17155330481096656},{"$f":"SUBTOTAL(9,J7:J999)","v":63104},21225,7634,7007,12641,1584]
["QE1","RXL","BLACKPOOL TEACHING HOSPITALS NHS FOUNDATION TRUST","RXL01","Blackpool Victoria Hospital - RXL01",312,4108,0.66346153846153844,0.25,151,56,27,29,49,0]
["QE1","RXR","EAST LANCASHIRE HOSPITALS NHS TRUST","RXR20","Royal Blackburn Hospital - RXR20",1060,11131,0.65943396226415096,0.24339622641509434,474,225,89,79,179,14]
["QE1","RXN","LANCASHIRE TEACHING HOSPITALS NHS FOUNDATION TRUST","RXN01","Chorley and South Ribble Hospital - RXN01",230,1494,0.87826086956521743,6.9565217391304349E-2,168,34,12,7,9,0]
["QE1","RXN","LANCASHIRE TEACHING HOSPITALS NHS FOUNDATION TRUST","RXN02","Royal Preston Hospital - RXN02",286,2509,0.58391608391608396,0.30069930069930068,114,53,33,30,56,0]
["QE1","RTX","UNIVERSITY HOSPITALS OF MORECAMBE BAY NHS FOUNDATION TRUST","RTXBU","Furness General Hospital - RTXBU",467,2574,0.82655246252676662,0.10278372591006424,294,92,31,19,29,2]
["QE1","RTX","UNIVERSITY HOSPITALS OF MORECAMBE BAY NHS FOUNDATION TRUST","RTX02","Royal Lancaster Infirmary - RTX02",627,3592,0.70972886762360443,0.19138755980861244,331,114,54,39,81,8]
["QE1","RTX","UNIVERSITY HOSPITALS OF MORECAMBE BAY NHS FOUNDATION TRUST","RTXBW","Westmorland General Hospital - RTXBW",524,2302,0.95229007633587781,1.1450381679389313E-2,441,58,16,1,5,3]
["QF7","RP5","DONCASTER AND BASSETLAW TEACHING HOSPITALS NHS FOUNDATION TRUST","RP5BA","Bassetlaw Hospital - RP5BA",1,4721,"*","*","*","*","*","*","*","*"]
["QF7","RP5","DONCASTER AND BASSETLAW TEACHING HOSPITALS NHS FOUNDATION TRUST","RP5DR","Doncaster Royal Infirmary - RP5DR",3,8477,"*","*","*","*","*","*","*","*"]
["QF7","RP5","DONCASTER AND BASSETLAW TEACHING HOSPITALS NHS FOUNDATION TRUST","RP5MM","Montagu Hospital - RP5MM",0,1790,"NA","NA",0,0,0,0,0,0]
["QF7","RCU","SHEFFIELD CHILDREN'S NHS FOUNDATION TRUST","RCUEF","Sheffield Children's Hospital - RCUEF",628,5367,0.77070063694267521,0.12101910828025478,378,106,61,32,44,7]
["QF7","RHQ","SHEFFIELD TEACHING HOSPITALS NHS FOUNDATION TRUST","RHQNG","Northern General Hospital - RHQNG",790,4112,0.70886075949367089,0.19493670886075951,434,126,60,53,101,16]
["QF7","RHQ","SHEFFIELD TEACHING HOSPITALS NHS FOUNDATION TRUST","RHQHH","Royal Hallamshire Hospital - RHQHH",208,919,0.96634615384615385,2.403846153846154E-2,177,24,2,1,4,0]
["QF7","RHQ","SHEFFIELD TEACHING HOSPITALS NHS FOUNDATION TRUST","RHQXXX","WiC_MIU - RHQXXX",417,1583,0.86091127098321341,8.8729016786570747E-2,281,78,19,19,18,2]
{"$rows_left_out":214}
{"sheet":"BS","index":5,"n_rows":228,"n_cols":33,"rows_kept":228,"cut":false,"hidden":false,"merged":[]}
[null,"Sort","STP Code","STP name","Trust code","Trust name","Site Code","Site Name",null,"Sort Lists:","Sort range…","Sort range…","Sort range…","Reference Region List:","Code…","Name…","Linked Region List:","Code…","Name…","Reference Lists:","Code…","Code…","Name…","Code…","Name…","Trusts Linked Lists:","Code…","Name…","Sites Linked Lists:","Code…","Name…","Code…","Name…"]
["STP",1,1,1,"-","-","-","-",null,null,"ICB Code","ICB Code","ICB Code",null,"QE1","LANCASHIRE AND SOUTH CUMBRIA ICB",null,"QE1","LANCASHIRE AND SOUTH CUMBRIA ICB",null,"QE1","RXL","BLACKPOOL TEACHING HOSPITALS NHS FOUNDATION TRUST","RXL01","Blackpool Victoria Hospital - RXL01",null,"R0A","AIREDALE NHS FOUNDATION TRUST",null,"R0A","AIREDALE NHS FOUNDATION TRUST","E0A3H","Addenbrooke's Hospital - RGT01"]
["Trusts",1,1,1,1,1,"-","-",null,null,"ICB Name","Trust Code","Trust Code",null,"QF7","SOUTH YORKSHIRE ICB",null,"QF7","SOUTH YORKSHIRE ICB",null,"QE1","RXR","EAST LANCASHIRE HOSPITALS NHS TRUST","RXR20","Royal Blackburn Hospital - RXR20",null,"R0B","ALDER HEY CHILDREN'S NHS FOUNDATION TRUST",null,"R0B","ALDER HEY CHILDREN'S NHS FOUNDATION TRUST","G0W1C","Airedale General Hospital - RCF22"]
["Site",1,1,1,1,1,1,1,null,null,"Total Responses","Trust Name","Trust Name",null,"QGH","HEREFORDSHIRE AND WORCESTERSHIRE ICB",null,"QGH","HEREFORDSHIRE AND WORCESTERSHIRE ICB",null,"QE1","RXN","LANCASHIRE TEACHING HOSPITALS NHS FOUNDATION TRUST","RXN01","Chorley and South Ribble Hospital - RXN01",null,"R0D","ASHFORD AND ST PETER'S HOSPITALS NHS FOUNDATION TRUST",null,"R0D","ASHFORD AND ST PETER'S HOSPITALS NHS FOUNDATION TRUST","N6J7V","Alder Hey Children's NHS - RBS25"]
[null,null,null,null,null,null,null,null,null,null,"Total Eligible","Total Responses","Site Code",null,"QH8","MID AND SOUTH ESSEX ICB",null,"QH8","MID AND SOUTH ESSEX ICB",null,"QE1","RXN","LANCASHIRE TEACHING HOSPITALS NHS FOUNDATION TRUST","RXN02","Royal Preston Hospital - RXN02",null,"R1F","BARKING, HAVERING AND REDBRIDGE UNIVERSITY HOSPITALS NHS TRUST",null,"R1F","BARKING, HAVERING AND REDBRIDGE UNIVERSITY HOSPITALS NHS TRUST","R0A02","Alexandra Hospital - RWP01"]
[null,null,null,null,null,null,null,null,null,null,"Percentage Positive","Total Eligible","Site Name",null,"QHG","BEDFORDSHIRE, LUTON AND MILTON KEYNES ICB",null,"QHG","BEDFORDSHIRE, LUTON AND MILTON KEYNES ICB",null,"QE1","RTX","UNIVERSITY HOSPITALS OF MORECAMBE BAY NHS FOUNDATION TRUST","RTXBU","Furness General Hospital - RTXBU",null,"R1H","BARTS HEALTH NHS TRUST",null,"R1H","BARTS HEALTH NHS TRUST","R0A03","Andover War Memorial Hospital - RN542"]
[null,null,null,null,null,null,null,null,null,null,"Percentage Negative","Percentage Positive","Total Responses",null,"QHL","BIRMINGHAM AND SOLIHULL ICB",null,"QHL","BIRMINGHAM AND SOLIHULL ICB",null,"QE1","RTX","UNIVERSITY HOSPITALS OF MORECAMBE BAY NHS FOUNDATION TRUST","RTX02","Royal Lancaster Infirmary - RTX02",null,"R1K","BEDFORDSHIRE HOSPITALS NHS FOUNDATION TRUST",null,"R1K","BEDFORDSHIRE HOSPITALS NHS FOUNDATION TRUST","R0A04","Arrowe Park Hospital - RBL14"]
[null,null,null,null,null,null,null,null,null,null,"Very Good","Percentage Negative","Total Eligible",null,"QHM","NORTH EAST AND NORTH CUMBRIA ICB",null,"QHM","NORTH EAST AND NORTH CUMBRIA ICB",null,"QE1","RTX","UNIVERSITY HOSPITALS OF MORECAMBE BAY NHS FOUNDATION TRUST","RTXBW","Westmorland General Hospital - RTXBW",null,"RA4","BIRMINGHAM WOMEN'S AND CHILDREN'S NHS FOUNDATION TRUST",null,"RA4","BIRMINGHAM WOMEN'S AND CHILDREN'S NHS FOUNDATION TRUST","R0A07","Barnet Hospital - RAL26"]
[null,null,null,null,null,null,null,null,null,null,"Good","Very Good","Percentage Positive",null,"QJ2","DERBY AND DERBYSHIRE ICB",null,"QJ2","DERBY AND DERBYSHIRE ICB",null,"QF7","RP5","DONCASTER AND BASSETLAW TEACHING HOSPITALS NHS FOUNDATION TRUST","RP5BA","Bassetlaw Hospital - RP5BA",null,"RA7","BLACKPOOL TEACHING HOSPITALS NHS FOUNDATION TRUST",null,"RA7","BLACKPOOL TEACHING HOSPITALS NHS FOUNDATION TRUST","R0A09","Basildon Hospital - RAJ12"]
[null,null,null,null,null,null,null,null,null,null,"Neither Good nor Poor","Good","Percentage Negative",null,"QJG","SUFFOLK AND NORTH EAST ESSEX ICB",null,"QJG","SUFFOLK AND NORTH EAST ESSEX ICB",null,"QF7","RP5","DONCASTER AND BASSETLAW TEACHING HOSPITALS NHS FOUNDATION TRUST","RP5DR","Doncaster Royal Infirmary - RP5DR",null,"RA9","BOLTON NHS FOUNDATION TRUST",null,"RA9","BOLTON NHS FOUNDATION TRUST","R0A66","Basingstoke and North Hampshire Hospital - RN506"]
[null,null,null,null,null,null,null,null,null,null,"Poor","Neither Good nor Poor","Very Good",null,"QJK","DEVON ICB",null,"QJK","DEVON ICB",null,"QF7","RP5","DONCASTER AND BASSETLAW TEACHING HOSPITALS NHS FOUNDATION TRUST","RP5MM","Montagu Hospital - RP5MM",null,"RAE","BRADFORD TEACHING HOSPITALS NHS FOUNDATION TRUST",null,"RAE","BRADFORD TEACHING HOSPITALS NHS FOUNDATION TRUST","R0B01","Bassetlaw Hospital - RP5BA"]
[null,null,null,null,null,null,null,null,null,null,"Very Poor","Poor","Good",null,"QJM","LINCOLNSHIRE ICB",null,"QJM","LINCOLNSHIRE ICB",null,"QF7","RCU","SHEFFIELD CHILDREN'S NHS FOUNDATION TRUST","RCUEF","Sheffield Children's Hospital - RCUEF",null,"RAJ","BUCKINGHAMSHIRE HEALTHCARE NHS TRUST",null,"RAJ","BUCKINGHAMSHIRE HEALTHCARE NHS TRUST","R0B0Q","Bedford Hospital South Wing - RC979"]
[null,null,null,null,null,null,null,null,null,null,"Don't Know","Very Poor","Neither Good nor Poor",null,"QK1","LEICESTER, LEICESTERSHIRE AND RUTLAND ICB",null,"QK1","LEICESTER, LEICESTERSHIRE AND RUTLAND ICB",null,"QF7","RHQ","SHEFFIELD TEACHING HOSPITALS NHS FOUNDATION TRUST","RHQNG","Northern General Hospital - RHQNG",null,"RAL","CALDERDALE AND HUDDERSFIELD NHS FOUNDATION TRUST",null,"RAL","CALDERDALE AND HUDDERSFIELD NHS FOUNDATION TRUST","R0B0X","Birmingham Children's Hospital - RQ301"]
[null,null,null,null,null,null,null,null,null,null,null,"Don't Know","Poor",null,"QKK","SOUTH EAST LONDON ICB",null,"QKK","SOUTH EAST LONDON ICB",null,"QF7","RHQ","SHEFFIELD TEACHING HOSPITALS NHS FOUNDATION TRUST","RHQHH","Royal Hallamshire Hospital - RHQHH",null,"RAP","CAMBRIDGE UNIVERSITY HOSPITALS NHS FOUNDATION TRUST",null,"RAP","CAMBRIDGE UNIVERSITY HOSPITALS NHS FOUNDATION TRUST","R0D01","Birmingham Midland Eye Centre (Bmec) - RXK03"]
[null,null,null,null,null,null,null,null,null,null,null,"Mode SMS","Very Poor",null,"QKS","KENT AND MEDWAY ICB",null,"QKS","KENT AND MEDWAY ICB",null,"QF7","RHQ","SHEFFIELD TEACHING HOSPITALS NHS FOUNDATION TRUST","RHQXXX","WiC_MIU - RHQXXX",null,"RAS","CHELSEA AND WESTMINSTER HOSPITAL NHS FOUNDATION TRUST",null,"RAS","CHELSEA AND WESTMINSTER HOSPITAL NHS FOUNDATION TRUST","R0D02","Blackpool Victoria Hospital - RXL01"]
[null,null,null,null,null,null,null,null,null,null,null,"Mode Electronic Discharge","Don't Know",null,"QM7","HERTFORDSHIRE AND WEST ESSEX ICB",null,"QM7","HERTFORDSHIRE AND WEST ESSEX ICB",null,"QF7","RFR","THE ROTHERHAM NHS FOUNDATION TRUST","RFRPA","Rotherham District General Hospital - RFRPA",null,"RAX","CHESTERFIELD ROYAL HOSPITAL NHS FOUNDATION TRUST",null,"RAX","CHESTERFIELD ROYAL HOSPITAL NHS FOUNDATION TRUST","R1F01","Bradford Royal Infirmary - RAE01"]
[null,null,null,null,null,null,null,null,null,null,null,"Mode Paper Discharge",null,null,"QMF","NORTH EAST LONDON ICB",null,"QMF","NORTH EAST LONDON ICB",null,"QGH","RWP","WORCESTERSHIRE ACUTE HOSPITALS NHS TRUST","RWP01","Alexandra Hospital - RWP01",null,"RBD","COUNTY DURHAM AND DARLINGTON NHS FOUNDATION TRUST",null,"RBD","COUNTY DURHAM AND DARLINGTON NHS FOUNDATION TRUST","R1H12","Bristol Eye Hospital - RA708"]
[null,null,null,null,null,null,null,null,null,null,null,"Mode Paper Home",null,null,"QMJ","NORTH CENTRAL LONDON ICB",null,"QMJ","NORTH CENTRAL LONDON ICB",null,"QGH","RWP","WORCESTERSHIRE ACUTE HOSPITALS NHS TRUST","RWP31","Kidderminster Hospital - RWP31",null,"RBK","CROYDON HEALTH SERVICES NHS TRUST",null,"RBK","CROYDON HEALTH SERVICES NHS TRUST","R1HKH","Bristol Royal Hospital For Children - RA723"]
[null,null,null,null,null,null,null,null,null,null,null,"Mode Telephone",null,null,"QMM","NORFOLK AND WAVENEY ICB",null,"QMM","NORFOLK AND WAVENEY ICB",null,"QGH","RWP","WORCESTERSHIRE ACUTE HOSPITALS NHS TRUST","RWP50","Worcestershire Royal Hospital - RWP50",null,"RBL","DARTFORD AND GRAVESHAM NHS TRUST",null,"RBL","DARTFORD AND GRAVESHAM NHS TRUST","R1HM0","Bristol Royal Infirmary - RA701"]
[null,null,null,null,null,null,null,null,null,null,null,"Mode Online",null,null,"QNC","STAFFORDSHIRE AND STOKE-ON-TRENT ICB",null,"QNC","STAFFORDSHIRE AND STOKE-ON-TRENT ICB",null,"QGH","RLQ","WYE VALLEY NHS TRUST","RLQ01","Hereford County Hospital - RLQ01",null,"RBN","DONCASTER AND BASSETLAW TEACHING HOSPITALS NHS FOUNDATION TRUST",null,"RBN","DONCASTER AND BASSETLAW TEACHING HOSPITALS NHS FOUNDATION TRUST","R1HNH","Buckland Hospital - RVV02"]
{"$rows_left_out":208}