{"text_format":"1","workbook":"xlsx","n_sheets":4,"sheets":["Version","Instructions","Front sheet","Work sheet 1"],"not_rendered":{"charts":2,"images":17,"macros":1,"external_links":1,"defined_names":61,"comments":0,"pivot_tables":0},"unopened":[],"bounds":{"document_bytes":16777216,"sheet_cells":100000,"rows_first":2000,"rows_last":500,"rows_between":2000,"halvings":0,"cell_chars":16384,"cell_head_chars":4096},"cells_cut":0,"cells_raw":0,"read":"whole","date_system":"1900"}

{"sheet":"Version","index":0,"n_rows":20,"n_cols":4,"rows_kept":20,"cut":false,"hidden":false,"merged":[[14,3,14,8],[1,1,1,6],[4,3,4,8],[5,3,5,8],[6,3,6,8],[7,3,7,8],[8,3,8,8],[9,3,9,8],[10,3,10,8],[11,3,11,8],[12,3,12,8],[13,3,13,8],[2,1,2,8],[21,3,21,8],[22,3,22,8],[15,3,15,8],[16,3,16,8],[17,3,17,8],[18,3,18,8],[19,3,19,8],[20,3,20,8]]}
[]
[null,"SPC XmR tool: versions"]
[null,"For queries and feedback, please email england.improvementanalyticsteam@nhs.net and quote the tool name and version number"]
[]
[null,"Version number","Date"]
[null,"V1.0"]
[null,"V2.0"]
[null,"V3.0"]
{"$rows_left_out":13}
{"sheet":"Instructions","index":1,"n_rows":67,"n_cols":4,"rows_kept":67,"cut":false,"hidden":false,"merged":[[2,2,2,6],[66,2,66,12]]}
[]
[]
[null,null,"SPC XmR tool"]
[]
[null,null,"Version 4.8"]
[]
[null,null,"Instructions"]
[]
{"$rows_left_out":60}
{"sheet":"Front sheet","index":2,"n_rows":55,"n_cols":60,"rows_kept":55,"cut":false,"hidden":false,"merged":[[4,11,4,12],[2,11,2,12],[4,17,5,18],[23,28,24,29],[15,28,17,28],[2,20,2,22],[2,17,3,18],[51,8,51,23],[35,27,36,29],[5,5,5,7],[5,25,6,26],[6,5,6,7],[47,7,48,7],[47,8,48,23],[7,5,7,7],[48,27,50,30],[48,2,49,4],[48,5,49,5],[46,5,47,5],[44,5,45,5],[1,2,2,8],[4,5,4,9],[40,5,41,5],[49,7,50,7],[49,8,50,23],[42,5,43,5],[40,7,42,23],[43,8,44,23],[43,7,44,7],[38,2,39,5],[38,7,39,23],[40,2,41,4],[42,2,43,4],[44,2,45,4],[45,7,46,7],[45,8,46,23],[46,2,47,4]]}
[]
[null,null,"Statistical Process Control (XmR) tool"]
[null,null,null,null,null,null,null,null,null,null,null,"Target",null,null,null,null,null,"Points for significance",null,6," (shift and trend)",null,null,null,null,null,null,null,null,null,null,null,null,null,null,null,null,null,null,null,null,null,null,null,null,null,null,null,"08:00:00"]
[]
[null,null,"Chart title",null,null,null,null,null,null,null,null,"Maximum number",null,null,null,null,null,{"$f":"IF(P7=\"days\",\"Include weekends?\",\"\")","v":""},null,"Yes",null,null,null,null,null,null,null,null,null,null,null,null,null,null,null,null,null,null,null,null,null,"Days",null,"Yes",null,null,null,null,"18:00:00","Integer",null,"dd/mm/yy",null,"Vertical ",null,null,null,null,"High is good",1]
[null,null,"Team/unit name",null,null,null,null,null,null,null,null,"Start date",null,null,null,{"$f":"IF(P7=\"months\",\" please select date <= 28th\",IF(P7=\"Quarters\",\" please select date <= 28th\"))","v":" please select date <= 28th"},null,null,null,null,null,null,null,null,null,null,null,null,null,null,null,null,null,null,null,null,null,null,null,null,null,"Weeks",null,"No",null,null,null,null,null,"Decimal",null,"mmm yy",null,"Horizontal",null,null,null,null,"Low is good",2]
[null,null,"Your measure",null,null,null,null,null,null,null,null,"Planned duration",null,null,null,"Months",null,"Set baseline",null,null,{"$f":"P7","v":"Months"},null,"Icon height",{"$f":"AD20","v":1.05},null,null,null,null,null,null,null,null,null,null,null,null,null,null,null,null,null,"2 Weeks",null,null,null,null,null,null,null,"Percentage",null,null,null,null,null,null,null,null,"Neither",3]
[null,null,"What does improvement look like?",null,null,"High is good",null,null,null,null,null,"(days, weeks, months)",null,null,null,null,null,"(choose baseline period 12 - 20*)",null,null,null,null,null,null,null,null,null,null,null,null,null,null,null,null,null,null,null,null,null,null,null,"4 Weeks",null,null,null,null,null,null,null,"Time",null,"hh:mm:ss"]
{"$rows_left_out":48}
{"sheet":"Work sheet 1","index":3,"n_rows":120,"n_cols":90,"rows_kept":120,"cut":false,"hidden":true,"merged":[[0,6,0,14],[1,6,1,14],[2,6,2,14],[3,6,3,14],[3,16,3,17],[6,67,6,70],[6,72,6,74],[6,83,6,85],[3,39,3,40],[5,6,5,14],[3,36,3,37],[4,6,4,14],[4,31,4,32],[4,33,4,34],[6,76,6,80],[6,19,6,20],[6,22,6,23]]}
[null,null,null,{"$f":"'Front sheet'!$F$5&\"-\"&'Front sheet'!F6& \" starting \"&TEXT('Front sheet'!O6,\"dd/mm/yy\") & IF(AND('Front sheet'!$P$7= \"days\",'Front sheet'!$T$5=\"No\"),\" excluding weekends\",\"\")","v":"- starting 00/01/00"},{"$f":"'Front sheet'!$F$5&\"-\"&'Front sheet'!F6&\" Moving range, starting \"&TEXT('Front sheet'!O6,\"dd/mm/yy\")","v":"- Moving range, starting 00/01/00"},null,"This type of chart (SPC) allows you to identify statistically significant changes in data. The dotted lines (process limits) represent the expected range for data points if variation is within expected limits - that is, normal. You can aply a number of rules to identify when the process is not in control - that is, special variation.",null,null,null,null,{"$f":"IF(ISERROR(VLOOKUP(100,$G$8:$K$120,9,0)),\"\",VLOOKUP(100,$G$8:$K$120,9,0))","v":""},null,null,null,null,"Points ><3 sigma",null,null,"Runs above mean",null,null,"Runs Below mean",null,null,"Trend up",null,null,"Trend Down",null,null,null,null,null,null,null,"Points above #Moving Range",null,null,"Points outside Mean+-Sigma",null,null,null,null,null,null,null,null,null,null,null,null,null,{"$f":"IF('Front sheet'!$T$7=\"\",\"\",\"Baseline calculated on first \" &'Front sheet'!$T$7& \" values\")","v":""},null,null,null,null,null,null,null,null,null,null,"Yes"]
[null,null,null,{"$f":"'Front sheet'!F7","v":0},{"$f":"'Front sheet'!P7","v":"Months"},"correction",{"$f":"IF(Q4<>\"\",Q4,IF(T4<>\"\",T4,IF(Z4<>\"\",Z4,IF(AN4<>\"\",AN4,IF(AF5<>\"\",AF5,IF(AH5<>0,AH5,IF(AK4<>\"\",AK4,\"\")))))))","v":{"$error":"#VALUE!"}},null,null,null,null,null,null,null,null,null,"how many above",{"$f":"MAX(Q9:Q128)","v":0},null,{"$f":"IF(SUM(U9:U128)>0,\"Yes\",0)","v":0},null,null,{"$f":"IF(SUM(X9:X128)>0,\"Yes\",0)","v":0},null,null,{"$f":"IF(SUM(AA9:AA128)>0,\"Yes\",0)","v":0},null,null,{"$f":"IF(SUM(AD9:AD128)>0,\"Yes\",0)","v":0},null,null,null,null,null,null,null,"how many above",{"$f":"IF(ISERROR(MAX(AK9:AK128)),\"\",MAX(AK9:AK128))","v":""},null,"how many points",{"$f":"IF(ISERROR(SUM(OFFSET($AO$9,0,0,$E$3,1))),\"\",SUM(OFFSET($AO$9,0,0,$E$3,1)))","v":""},null,null,null,null,null,null,null,null,null,null,null,null,{"$f":"BF2/8","v":{"$error":"#N/A"}},null,{"$f":"'Front sheet'!X7","v":1.05},{"$f":"IFERROR(MIN(OFFSET(H9,0,0,E3,3)),MIN(OFFSET(E9,0,0,E3,1)))","v":{"$error":"#N/A"}},{"$f":"BD2-BE2","v":{"$error":"#N/A"}},null,null,null,null,null,null,"No"]
[null,null,1,"Rows of data",{"$f":"MAX(B9:B120)","v":1},{"$f":"COUNTIF(F8:F119,C3)","v":1},{"$f":"IF(AND(T4<>\"\",T4<>G2),T4,IF(AND(Z4<>\"\",Z4<>G2),Z4,IF(AND(AN4<>\"\",AN4<>G2),AN4,IF(AND(AF5<>\"\",AF5<>G2),AF5,IF(AND(AH5<>\"\",AH5<>G2),AH5,IF(AND(AK4<>\"\",AK4<>G2),AK4,\"\"))))))","v":{"$error":"#VALUE!"}},null,null,null,null,null,null,null,null,null,"how many below",{"$f":"MAX(R9:R128)","v":0},null,null,null,null,null,null,null,null,null,null,null,null,null,null,{"$f":"MAX(AG9:AG128)","v":0},null,{"$f":"MAX(AI9:AI128)","v":0},null,null,null,null,"Proportion",{"$f":"AO2/E3","v":{"$error":"#VALUE!"}},null,null,null,null,null,null,null,null,null,null,null,null,{"$f":"SUM((BA9:BA120))","v":111}]
[null,null,2,"Recalculate 1",{"$f":"IF(BI6=0,0,BI5)","v":0},{"$f":"COUNTIF(F9:F120,C4)","v":0},{"$f":"IF(AND(Z4<>\"\",Z4<>G2,Z4<>G3),Z4,IF(AND(AN4<>\"\",AN4<>G2,AN4<>G3),AN4,IF(AND(AF5<>\"\",AF5<>G2,AF5<>G3),AF5,IF(AND(AH5<>\"\",AH5<>G2,AH5<>G3),AH5,IF(AND(AK4<>\"\",AK4<>G2,AK4<>G3),AK4,\"\")))))","v":{"$error":"#VALUE!"}},null,null,null,null,null,null,null,null,null,{"$f":"IF($R$3+$R$2>0,\"Points which fall outside the grey dotted lines (process limits) are unusual and should be investigated. They represent a system which may be out of control.\",\"\")&IF(R2=0,\"\",IF(R2=1,\" There is \",\" There are \")&R2&IF(R2=1,\" data point which is above the line. \",\" data points which are above the line. \"))&Q5","v":""},null,null,{"$f":"IF(OR(T2=\"Yes\",W2=\"Yes\"),\"When more than 7 sequential points fall above or below the mean that is unusual and may indicate a sigificant change in process. This process is not in control. There is a run of points \" & IF(AND(T2=\"Yes\",W2=\"Yes\"),\" above and below\",IF(T2= \"Yes\", \" above\", \"below\"))& \" the mean.\",\"\")","v":""},null,null,null,null,null,{"$f":"IF(OR(Z2=\"Yes\",AC2=\"Yes\"),\"When there is a run of 7 increasing or decreasing sequential points this may indicate a sigificant change in the process.  This process is not in control. In this data set there is a run of \" & IF(AND(Z2=\"Yes\",AC2=\"Yes\"),\" rising and falling \",IF(Z2= \"Yes\", \"rising\", \"falling\"))& \" points.\",\"\")","v":""},null,null,null,null,null,null,null,null,null,null,{"$f":"IF($AL$3+$AL$2>0,\"On the moving range chart points which fall above the moving range process limit - grey dotted line - are unusual and suggest that the system is out of control. This should be investigated.\"&IF(AL2=0,\"\",IF(AL2=1,\" There is \",\" There are \")&AL2&IF(AL2=1,\" data point which is above the line. \",\" data points which are above the line. \")),\"\")","v":{"$error":"#VALUE!"}},null,null,{"$f":"IF(AO3>0,\"When more than 15 consecutive points lie within the mean +/- 1σ  this process is considered to be out of control.\",\"\")","v":{"$error":"#VALUE!"}},null,null,null,null,null,null,null,null,null,null,null,null,null,"Date","Intervention1","Intervention2","Intervention3","Intervention4","Intervention5",null,"Recalculate limits","Recalculate limits","Recalculate limits","Recalculate limits",null,null,null,"ICONS"]
[null,null,3,"Recalculate 2",{"$f":"IF(BJ6=0,0,BJ5)","v":0},{"$f":"COUNTIF(F10:F121,C5)","v":0},{"$f":"IF(AND(AN4<>\"\",AN4<>G2,AN4<>G3),AN4,IF(AND(AF5<>\"\",AF5<>G2,AF5<>G3,AF5<>G4),AF5,IF(AND(AH5<>\"\",AH5<>G2,AH5<>G3,AH5<>G4),AH5,IF(AND(AK4<>\"\",AK4<>G2,AK4<>G3,AK4<>G4),AK4,\"\"))))","v":{"$error":"#VALUE!"}},null,null,null,null,null,null,null,null,null,{"$f":"IF(R3>0,IF(R3=1,\" There is  \",\" There are \")&R3&\" data point(s) below the line\",\"\")","v":""},"Single point",null,"Shift",{"$f":"'Front sheet'!T3","v":6},null,null,{"$f":"'Front sheet'!T3","v":6},null,"Trend",{"$f":"'Front sheet'!T3","v":6},null,null,{"$f":"'Front sheet'!T3","v":6},null,null,null,null,null,null,null,"mR",null,"Rule 4",null,null,null,null,null,null,null,null,null,null,null,null,null,null,2,6,38,71,111,null,16,38,60,93,null,null,null,{"$f":"'Front sheet'!F8","v":"High is good"},null,null,null,null,null,null,null,null,null,null,null,null,"Direction",null,null,null,"position"]
[null,null,4,"Recalculate 3",{"$f":"IF(BK6=0,0,BK5)","v":0},0,{"$f":"IF(AND(AN4<>\"\",AN4<>G2,AN4<>G3,AN4<>G5),AN4,IF(AND(AF5<>\"\",AF5<>G2,AF5<>G3,AF5<>G4,AF5<>G5),AF5,IF(AND(AH5<>\"\",AH5<>G2,AH5<>G3,AH5<>G4,AH5<>G5),AH5,IF(AND(AK4<>\"\",AK4<>G2,AK4<>G3,AK4<>G4,AK4<>G5),AK4,\"\"))))","v":{"$error":"#VALUE!"}},null,null,null,null,null,null,null,null,null,null,null,null,null,null,null,null,null,null,null,null,null,null,null,null,null,"2 of 3",null,"2 of 3",null,null,null,null,null,null,null,null,null,null,null,null,null,null,null,null,null,null,"Annotation",{"$f":"'Front sheet'!AD26","v":0},{"$f":"'Front sheet'!AD28","v":0},{"$f":"'Front sheet'!$AD$30","v":0},{"$f":"'Front sheet'!$AD$32","v":0},{"$f":"'Front sheet'!$AD$34","v":0},null,{"$f":"'Front sheet'!AD39","v":0},{"$f":"'Front sheet'!AD41","v":0},{"$f":"'Front sheet'!AD43","v":0},{"$f":"'Front sheet'!AD45","v":0},null,null,null,{"$f":"VLOOKUP(BP5,'Front sheet'!$BG$5:$BH$7,2,0)","v":1},null,null,null,null,null,null,null,null,null,null,null,null,null,null,null,{"$f":"IF('Front sheet'!O3=\"\",\"\",IF(AND('Front sheet'!O3<OFFSET('Work sheet 1'!H8,$E$3,0),'Front sheet'!O3>OFFSET('Work sheet 1'!I8,$E$3,0)),\"Flip\",IF(AND('Front sheet'!O3<=OFFSET('Work sheet 1'!I8,E3,0),'Work sheet 1'!BP6=1),\"Pass\",IF(AND('Front sheet'!O3>=OFFSET('Work sheet 1'!H8,E3,0),'Work sheet 1'!BP6=2),\"Pass\",\"Fail\"))))","v":""},{"$f":"IF(E3>100,5,IF(E3>70,4,IF(E3>40,3,IF(E3>20,2,1))))","v":1}]
[null,null,5,"Recalculate 4",{"$f":"IF(BL6=0,0,BL5)","v":0},0,null,null,null,null,"Difference mR for plot","Difference",null,null,"Sigma",null,"> 3","< 3 ",null,null,null,null,null,null,null,null,null,null,null,null,null,null,null,null,null,null,null,null,null,null,null,null,null,null,{"$f":"'Front sheet'!$F$8","v":"High is good"},null,null,null,"Date","Weekday",null,null,null,null,1,2,3,4,5,null,1,2,3,4,null,null,null,"High Good",null,null,null,null,"Low good",null,null,null,"Neither",null,null,null,null,null,null,"Pass Fail"]
[null,null,null,"Date","Tally","Step marker","Mean","UCL","LCL","Tally0 - for calculating averages",null,"For. Roll avg","Cumul. Moving Avg.","2.66* MR","3.27*MR",null,"Count","Count",null,"7 points > mean",null,null,"7 points < mean",null,null,"Trend up",null,null,"Trend Down",null,"2/3 (above below mean)","2 out of 3 low",null,"2 out of 3 high",null,null,"Moving Range",null,null,"> Mean+Sigma","< Mean-Sigma","Target","Plot series High","Plot seriesLow","special cause concern","special cause Improvement","special cause neither","Special cause flag",null,null,null,null,{"$f":"'Front sheet'!AD52","v":"No"},null,{"$f":"OFFSET($BB8,BC5,0)","v":""},{"$f":"OFFSET($BB8,BD5,0)","v":""},{"$f":"OFFSET($BB8,BE5,0)","v":""},{"$f":"OFFSET($BB8,BF5,0)","v":""},{"$f":"OFFSET($BB8,BG5,0)","v":""},null,{"$f":"OFFSET($BB8,BI5,0)","v":""},{"$f":"OFFSET($BB8,BJ5,0)","v":""},{"$f":"OFFSET($BB8,BK5,0)","v":""},"",null,null,null,"Special cause markers","CC","Sc_imp","SC_concern",null,"Special cause markers","Sc_imp","SC_concern",null,"Special cause markers","Special cause up","Neither_UP","Special cause down","Neither_DOWN",null,null,"Pass fail marker","Pass","Fail","Flip Flop",null,"For summary data"]
{"$rows_left_out":112}